{"text_format":"1","workbook":"xlsx","n_sheets":34,"sheets":["Historical_ISO","Historical_ISO_Period","Historical_SDMX","Historical_SDMX_Period","Historical","Input_ISO","Input_ISO_Period","Input_SDMX","Input_SDMX_Period","Entries","Output_ISO_csv","Output_SDMX_csv","Output_SDMX_long_complete","Mapping_Products_Flows","Parameters","Parameter_mapping","Test","Logs","Mapping_countries","Menu","Instructions","Param_Menu","Param_Questionnaire","Param_Multilanguage","Template_Table1","TemplateRemarks","Template_TS1","TemplateRemarksTS","Template_Graphs","CheckReport","Param_Sheets","Param_Sheets_Templates","Param_Tables","Param_Tables_Templates"],"not_rendered":{"charts":2,"images":0,"macros":1,"external_links":0,"defined_names":45,"comments":0,"pivot_tables":2},"unopened":[],"bounds":{"document_bytes":16777216,"sheet_cells":100000,"rows_first":2000,"rows_last":500,"rows_between":2000,"halvings":0,"cell_chars":16384,"cell_head_chars":4096},"cells_cut":0,"cells_raw":0,"read":"whole","date_system":"1900"}

{"sheet":"Historical_ISO","index":0,"n_rows":1,"n_cols":10,"rows_kept":1,"cut":false,"hidden":true,"merged":[]}
["COUNTRY","QUEST","PRODUCT","DATATYPE","ITEM1","ITEM2","TIME","VALUE","OBSERVATION","CONFIDENTIALITY"]

{"sheet":"Historical_ISO_Period","index":1,"n_rows":1,"n_cols":1,"rows_kept":1,"cut":false,"hidden":true,"merged":[]}
["ExternalData_1"]

{"sheet":"Historical_SDMX","index":2,"n_rows":2770,"n_cols":13,"rows_kept":2770,"cut":false,"hidden":true,"merged":[]}
["REF_AREA","DATAFLOW","PRODUCT","DATATYPE","ITEM1","ITEM2","TIME","VALUE","OBSERVATION","CONFIDENTIALITY","Record"]
[]
[null,null,null,null,null,null,null,null,null,null,null,"",""]
[null,null,null,null,null,null,null,null,null,null,null,"",""]
[null,null,null,null,null,null,null,null,null,null,null,"",""]
[null,null,null,null,null,null,null,null,null,null,null,"",""]
[null,null,null,null,null,null,null,null,null,null,null,"",""]
[null,null,null,null,null,null,null,null,null,null,null,"",""]
[null,null,null,null,null,null,null,null,null,null,null,"",""]
[null,null,null,null,null,null,null,null,null,null,null,"",""]
{"$rows_left_out":2761}
{"sheet":"Historical_SDMX_Period","index":3,"n_rows":1,"n_cols":1,"rows_kept":1,"cut":false,"hidden":true,"merged":[]}
["TIME"]

{"sheet":"Historical","index":4,"n_rows":1,"n_cols":11,"rows_kept":1,"cut":false,"hidden":true,"merged":[]}
["COUNTRY","QUEST","PRODUCT","DATATYPE","ITEM1","ITEM2","TIME","VALUE","OBSERVATION","CONFIDENTIALITY","KEYREC"]

{"sheet":"Input_ISO","index":5,"n_rows":1,"n_cols":10,"rows_kept":1,"cut":false,"hidden":true,"merged":[]}
["COUNTRY","QUEST","PRODUCT","DATATYPE","ITEM1","ITEM2","TIME","VALUE","OBSERVATION","CONFIDENTIALITY"]

{"sheet":"Input_ISO_Period","index":6,"n_rows":1,"n_cols":1,"rows_kept":1,"cut":false,"hidden":true,"merged":[]}
["ExternalData_3"]

{"sheet":"Input_SDMX","index":7,"n_rows":2810,"n_cols":13,"rows_kept":2810,"cut":false,"hidden":true,"merged":[]}
["REF_AREA","DATAFLOW","PRODUCT","DATATYPE","ITEM1","ITEM2","TIME","VALUE","OBSERVATION","CONFIDENTIALITY","Record"]
[]
[null,null,null,null,null,null,null,null,"",null,null,null,""]
[null,null,null,null,null,null,null,null,"",null,null,null,""]
[null,null,null,null,null,null,null,null,"",null,null,null,""]
[null,null,null,null,null,null,null,null,"",null,null,null,""]
[null,null,null,null,null,null,null,null,"",null,null,null,""]
[null,null,null,null,null,null,null,null,"",null,null,null,""]
[null,null,null,null,null,null,null,null,"",null,null,null,""]
[null,null,null,null,null,null,null,null,"",null,null,null,""]
{"$rows_left_out":2801}
{"sheet":"Input_SDMX_Period","index":8,"n_rows":1,"n_cols":1,"rows_kept":1,"cut":false,"hidden":true,"merged":[]}
["TIME"]

{"sheet":"Entries","index":9,"n_rows":1,"n_cols":11,"rows_kept":1,"cut":false,"hidden":true,"merged":[]}
["COUNTRY","QUEST","PRODUCT","DATATYPE","ITEM1","ITEM2","TIME","VALUE","OBSERVATION","CONFIDENTIALITY","KEYREC"]

{"sheet":"Output_ISO_csv","index":10,"n_rows":1,"n_cols":1,"rows_kept":1,"cut":false,"hidden":true,"merged":[]}
["Output"]

{"sheet":"Output_SDMX_csv","index":11,"n_rows":1,"n_cols":1,"rows_kept":1,"cut":false,"hidden":true,"merged":[]}
["Output"]

{"sheet":"Output_SDMX_long_complete","index":12,"n_rows":1,"n_cols":22,"rows_kept":1,"cut":false,"hidden":true,"merged":[]}
["DATAFLOW","QUEST_SOURCE","REF_AREA","FREQ","ENERGY_PRODUCT","MAIN_FLOW","FLOW_BREAKDOWN","PLANT_TECH","PLANT_TYPE","STOCKS","INFRASTRUCTURE_IND","VIS_A_VIS_AREA","MEASURE_VALUE_TYPE","FACILITY_ID","TIME_PERIOD","OBS_VALUE","UNIT_MEASURE","OBS_STATUS","CONF_STATUS","COMMENT_OBS","FACILITY_TYPE","FACILITY_NAME"]

{"sheet":"Mapping_Products_Flows","index":13,"n_rows":49,"n_cols":16,"rows_kept":49,"cut":false,"hidden":true,"merged":[]}
["DATATYPE","PRODUCT","ITEM1","ITEM2","ENERGY_PRODUCT","MAIN_FLOW","FLOW_BREAKDOWN","PLANT_TECH","PLANT_TYPE","STOCKS","INFRASTRUCTURE_IND","VIS_A_VIS_AREA","MEASURE_VALUE_TYPE","FACILITY_ID","UNIT_MEASURE","ISO_EXCLUSION"]
["FLOW","HARDCOAL","INDPROD",null,"C0100","PRODUCT","_T","_Z","_Z","_Z","_Z","_Z","VOLUME","_Z","KT","y"]
["FLOW","HARDCOAL","OSOURCES",null,"C0100","PRODUCT","OSOURCES","_Z","_Z","_Z","_Z","_Z","VOLUME","_Z","KT","y"]
["FLOW","HARDCOAL","TOTIMPSB",null,"C0100","IMPORTS","TOTIMPSB","_Z","_Z","_Z","_Z","_Z","VOLUME","_Z","KT","y"]
["FLOW","HARDCOAL","TOTIMPSBEU",null,"C0100","IMPORTS","_Z","_Z","_Z","_Z","_Z","D5","VOLUME","_Z","KT","y"]
["FLOW","HARDCOAL","TOTEXPSB",null,"C0100","EXPORTS","TOTEXPSB","_Z","_Z","_Z","_Z","_Z","VOLUME","_Z","KT","y"]
["FLOW","HARDCOAL","STOCKSTART",null,"C0100","STOCKS","OPESTLV","_Z","_Z","NATTER","_Z","_Z","VOLUME","_Z","KT","y"]
["FLOW","HARDCOAL","STOCKEND",null,"C0100","STOCKS","CLOSTLV","_Z","_Z","NATTER","_Z","_Z","VOLUME","_Z","KT","y"]
["FLOW","HARDCOAL","STCHANAT",null,"C0100","STOCKS","STOCKCH","_Z","_Z","NATTER","_Z","_Z","VOLUME","_Z","KT","y"]
["FLOW","HARDCOAL","INDCONC",null,"C0100","SUPPLY","INLDEMC","_Z","_Z","_Z","_Z","_Z","VOLUME","_Z","KT","y"]
{"$rows_left_out":40}
{"sheet":"Parameters","index":14,"n_rows":21,"n_cols":7,"rows_kept":21,"cut":false,"hidden":true,"merged":[]}
["Element","Type","PosType","Position",null,"DataStart","P2"]
["QUEST_SOURCE","DIM","COLUMN","B",null,"DataEnd","P100000"]
["FREQ","DIM","COLUMN","D",null,"SkipIncompleteKeys","true"]
["REF_AREA","DIM","COLUMN","C",null,"formatValues","actualValue"]
["ENERGY_PRODUCT","DIM","COLUMN","E"]
["MAIN_FLOW","DIM","COLUMN","F"]
["FLOW_BREAKDOWN","DIM","COLUMN","G"]
["PLANT_TECH","DIM","COLUMN","H"]
["PLANT_TYPE","DIM","COLUMN","I"]
["STOCKS","DIM","COLUMN","J"]
{"$rows_left_out":12}
{"sheet":"Parameter_mapping","index":15,"n_rows":2,"n_cols":2,"rows_kept":2,"cut":false,"hidden":true,"merged":[]}
["Data sheet","Parameter sheet"]
["Output_SDMX_long_complete","Parameters"]

{"sheet":"Test","index":16,"n_rows":1,"n_cols":4,"rows_kept":1,"cut":false,"hidden":true,"merged":[]}
["Fonction","Time","Txt1","Txt2"]

{"sheet":"Logs","index":17,"n_rows":1,"n_cols":7,"rows_kept":1,"cut":false,"hidden":true,"merged":[]}
["Date","Module","Function","Param","Return","ErrorCode","Description"]

{"sheet":"Mapping_countries","index":18,"n_rows":73,"n_cols":4,"rows_kept":73,"cut":false,"hidden":true,"merged":[]}
["Official","IEA","EUROSTAT","IEA-ISO"]
["Albania","ALBANIA","AL","AL"]
["Argentina","ARGENTINA","AR","AR"]
["Armenia","ARMENIA","AM","AM"]
["Australia","AUSTRALI","AU","AU"]
["Austria","AUSTRIA","AT","AT"]
["Azerbaijan","AZERBAIJAN","AZ","AZ"]
["Belarus","BELARUS","BY","BY"]
["Belgium","BELGIUM","BE","BE"]
["Bosnia and Herzegovina","BOSNIAHERZ","BA","BA"]
{"$rows_left_out":64}
{"sheet":"Menu","index":19,"n_rows":994,"n_cols":34,"rows_kept":994,"cut":false,"hidden":false,"merged":[[23,2,23,8],[1,2,1,8],[2,2,2,8],[10,2,10,8],[19,2,19,8],[14,2,14,8],[3,2,3,8]]}
[]
[null,null,"Monthly Coal Statistics"]
[null,null,"REPORTING TEMPLATE "]
[null,null,"Eurostat"]
[]
[]
[null,null,"Language:",null,"English"]
[]
[null,null,"Country:",null,"Slovenia"]
[]
{"$rows_left_out":985}
{"sheet":"Instructions","index":20,"n_rows":154,"n_cols":25,"rows_kept":154,"cut":false,"hidden":false,"merged":[[149,1,149,5],[151,1,151,5],[153,4,155,5],[124,1,127,5],[131,2,131,5],[132,1,133,1],[132,2,133,5],[138,2,138,5],[147,1,147,5],[148,1,148,5],[142,1,142,5],[143,1,144,5],[145,1,145,5],[136,2,136,5],[137,2,137,5],[140,1,140,5],[101,4,109,5],[110,4,113,5],[115,4,117,5],[119,4,121,5],[123,1,123,5],[82,1,82,5],[84,4,89,5],[92,1,92,5],[93,1,94,5],[95,4,100,5],[91,1,91,5],[141,1,141,5],[129,2,129,5],[130,2,130,5],[134,2,134,5],[135,2,135,5],[81,1,81,5],[46,4,48,5],[50,1,52,5],[54,1,54,5],[55,1,56,5],[58,4,60,5],[62,4,64,5],[80,1,80,5],[66,4,70,5],[72,4,74,5],[76,4,78,5],[44,1,44,5],[30,4,32,5],[34,4,37,5],[39,1,41,5],[43,1,43,5],[26,1,26,5],[27,1,28,5],[9,1,9,5],[1,1,1,5],[2,1,2,5],[5,1,5,5],[15,1,15,5],[10,1,10,5],[11,1,11,5],[12,1,12,5],[20,4,24,5],[16,1,16,5],[18,1,18,5]]}
[]
[null,"Monthly Coal Statistics"]
[null,"REPORTING TEMPLATE "]
[]
[" ",null,null,null,null,null,null,null,null,null,null,null,null,null,null,null,null,null,null,null,null,"English version"]
[null,"SUPPORT CONTACT",null,null,null,null,null,null,null,null,null,null,null,null,null,null,null,null,null,null,null,"Should you have any questions regarding the functions of this file or other logistics please do not hesitate to contact:","Pour d'autres informations, n'hésitez pas à contacter :","За дополнительной информацией, пожалуйста, обращайтесь:","Pour d'autres informations, n'hésitez pas à contacter :"]
[null,"EUROSTAT: ",null,"ESTAT-ENERGY-MONTHLY@EC.EUROPA.EU",null,null,null,null,null,null,null,null,null,null,null,null,null,null,null,null,null,"Email address:","Email :","Эмайл :","Email :"]
[null,null,null,null,null,null,null,null,null,null,null,null,null,null,null,null,null,null,null,null,null,"Telephone:","Téléphone :","Телефон :","Téléphone :"]
[]
[null,"SUBMISSION"]
{"$rows_left_out":145}
{"sheet":"Param_Menu","index":21,"n_rows":43,"n_cols":6,"rows_kept":43,"cut":false,"hidden":true,"merged":[]}
[null,"Selection",null,"Sep"]
["Format",2,1,";"]
["File Import","D:\\ARTEMIS INFO. MGMT\\Energy - Lot 2\\Development\\Questionnaires\\Monthly Coal\\Developed quest\\sample file\\coal_sl_minus1.csv"]
["File Export","D:\\ARTEMIS INFO. MGMT\\Energy - Lot 2\\Development\\Questionnaires\\Monthly Coal\\Developed quest\\Slovenia_SDMX_2023-07-27_14-51.csv"]
["File Import historical","D:\\ARTEMIS INFO. MGMT\\Energy - Lot 2\\Development\\Questionnaires\\Monthly Coal\\Developed quest\\sample file\\coal_sl.csv"]
[]
["Year","Month","Period","Selected"]
[2021,"M01",{"$f":"PeriodsToLoad[[#This Row],[Year]]&PeriodsToLoad[[#This Row],[Month]]","v":"2021M01"},0,null,"Reference cell for the first period used for checks on stocks"]
[2021,"M02",{"$f":"PeriodsToLoad[[#This Row],[Year]]&PeriodsToLoad[[#This Row],[Month]]","v":"2021M02"},0]
[2021,"M03",{"$f":"PeriodsToLoad[[#This Row],[Year]]&PeriodsToLoad[[#This Row],[Month]]","v":"2021M03"},0]
{"$rows_left_out":34}
{"sheet":"Param_Questionnaire","index":22,"n_rows":73,"n_cols":18,"rows_kept":73,"cut":false,"hidden":true,"merged":[]}
["Version","Eurostat",null,"Eurostat","IEA","Language",null,"FormatNormal","FormatConfidential","FormatConfidential2","FormatEstimated","FormatNotAvailable","FormatDataCannotExist","FormatNotSignificant","FormatLowReliability","FormatDefinitionDiff","FormatTSBreak","FormatProvisional"]
["Questionnaire","MCOAL",null,"Albania","Albania","English",0,1234567.8899999999,0,1234.56789,1234567.8899999999,1234567.8899999999,1234567.8899999999,1234567.8899999999,1234567.8899999999,1234567.8899999999,1234567.8899999999,1234567.8899999999]
["DATAFLOW","ESTAT:ENERGY_SOLID_M(1.0)",null,"Austria","Argentina","French",1,1234567.8899999999,0,1234.56789,1234567.8899999999,1234567.8899999999,1234567.8899999999,1234567.8899999999,1234567.8899999999,1234567.8899999999,1234567.8899999999,1234567.8899999999]
["QUEST_SOURCE","M_COAL",null,"Belgium","Armenia",null,2,1234567.8899999999,0,1234.56789,1234567.8899999999,1234567.8899999999,1234567.8899999999,1234567.8899999999,1234567.8899999999,1234567.8899999999,1234567.8899999999,1234567.8899999999]
["FREQ","M",null,"Bosnia and Herzegovina","Australia",null,3,1234567.8899999999,0,1234.56789,1234567.8899999999,1234567.8899999999,1234567.8899999999,1234567.8899999999,1234567.8899999999,1234567.8899999999,1234567.8899999999,1234567.8899999999]
["CountryName",{"$f":"Menu!E9","v":"Slovenia"},null,"Bulgaria","Austria",null,4,1234567.8899999999,0,1234.56789,1234567.8899999999,1234567.8899999999,1234567.8899999999,1234567.8899999999,1234567.8899999999,1234567.8899999999,1234567.8899999999,1234567.8899999999]
["CountryIEA",{"$f":"VLOOKUP(CountryName,Mapping_countries[],2,0)","v":"SLOVENIA"},null,"Croatia","Azerbaijan",null,5,1234567.8899999999,0,1234.56789,1234567.8899999999,1234567.8899999999,1234567.8899999999,1234567.8899999999,1234567.8899999999,1234567.8899999999,1234567.8899999999,1234567.8899999999]
["CountrySDMX",{"$f":"VLOOKUP(CountryName, Mapping_countries[], 3, 0)","v":"SI"},null,"Cyprus","Belarus",null,6,1234567.8899999999,0,1234.56789,1234567.8899999999,1234567.8899999999,1234567.8899999999,1234567.8899999999,1234567.8899999999,1234567.8899999999,1234567.8899999999,1234567.8899999999]
["Language",{"$f":"Menu!E7","v":"English"},null,"Czech Republic","Belgium",null,null,null,null,null,"e","o","m","n","u","d","b","p"]
["PeriodSelected",{"$f":"Menu!C13","v":"2023M06"},null,"Denmark","Bosnia and Herzegovina"]
{"$rows_left_out":64}
{"sheet":"Param_Multilanguage","index":23,"n_rows":28,"n_cols":3,"rows_kept":28,"cut":false,"hidden":true,"merged":[]}
["Shortnames","English","French"]
[null,"Hard coal","Hard Coal"]
[null,"Brown coal","Brown Coal"]
[null,"Peat","Peat"]
[null,"Oil shale and oil sands","Oil shale and oil sands"]
[null,"Coke oven coke","Coke oven coke"]
[null,"Primary products","Primary products"]
[null,"Secondary products","Secondary products"]
[null,"Monthly Coal Statistics (kt)","Monthly Coal Statistics (kt)"]
[null,"Production ","Production "]
{"$rows_left_out":19}
{"sheet":"Template_Table1","index":24,"n_rows":28,"n_cols":14,"rows_kept":28,"cut":false,"hidden":true,"merged":[[10,9,10,12]]}
["TIME","XXXXMX",null,null,null,null,null,"Monthly Coal Statistics (kt)"]
["DATATYPE","FLOW",null,null,null,null,null,null,null,{"$f":"VLOOKUP(H1, LanguageData, MATCH(LanguageChosen, Language[Language],0), FALSE) & \" - \" & B1","v":"Monthly Coal Statistics (kt) - XXXXMX"}]
["ITEM2",null,null,null,null,null,null,"ProductRow",null,"HARDCOAL","BROWN","PEAT","OILSHALE","COKEOVEN"]
[null,null,null,null,null,null,null,"FormulaRow"]
[null,null,null,null,null,null,null,"CheckRow"]
[null,null,null,null,null,null,null,"LockedRow"]
[null,null,null,null,null,null,null,"EmptyRow"]
[null,null,null,null,null,null,null,"VoluntaryRow"]
[null,null,null,null,null,null,null,"LabelRow1",null,"Primary products",null,null,null,"Secondary products"]
["Item1Col","FormulaCol","CheckCol","LabelCheckCol1","LockedCol","EmptyCol","VoluntaryCol","LabelCol",null,"Hard coal","Brown coal","Peat","Oil shale and oil sands","Coke oven coke"]
{"$rows_left_out":19}
{"sheet":"TemplateRemarks","index":25,"n_rows":35,"n_cols":5,"rows_kept":35,"cut":false,"hidden":true,"merged":[[0,4,2,4]]}
["Mode","Remarks",null,null,{"$f":"VLOOKUP(B1, LanguageData, MATCH(LanguageChosen, Language[Language],0), FALSE)","v":"Remarks"}]
["DataType"]
["Product",null,null,{"$f":"CountryName","v":"Slovenia"}]
["Time"]
["Item2",null,"TypeRow",null,"txt"]
[]
["Item1",null,"Label"]
["REMROW01",null,"Remarks 1"]
["REMROW02",null,"Remarks 2"]
["REMROW03",null,"Remarks 3"]
{"$rows_left_out":26}
{"sheet":"Template_TS1","index":26,"n_rows":28,"n_cols":21,"rows_kept":28,"cut":false,"hidden":true,"merged":[[0,9,0,20],[9,9,9,20]]}
["Mode",null,null,null,null,null,null,"Monthly Coal Statistics (kt)",null,{"$f":" VLOOKUP(H1,LanguageData, MATCH(LanguageChosen, Language[Language],0), FALSE) & \" - \" & I12","v":{"$error":"#N/A"}}]
["Datatype","xxxx",null,null,null,null,null,null,null,"M01","M02","M03","M04","M05","M06","M07","M08","M09","M10","M11","M12"]
["Product",null,null,"HARDCOAL","Hard coal",{"$f":"VLOOKUP(E3, LanguageData, MATCH(LanguageChosen, Language[Language],0), FALSE)","v":"Hard coal"},null,"TimeRow",null,{"$f":"$B$5 & J2","v":"2022M01"},{"$f":"$B$5 & K2","v":"2022M02"},"2022M03","2022M04","2022M05","2022M06","2022M07","2022M08","2022M09","2022M10","2022M11","2022M12"]
["Item2",null,null,"BROWN","Brown coal",{"$f":"VLOOKUP(E4, LanguageData, MATCH(LanguageChosen, Language[Language],0), FALSE)","v":"Brown coal"},null,"FormulaRow"]
["Version",2022,null,"PEAT","Peat",{"$f":"VLOOKUP(E5, LanguageData, MATCH(LanguageChosen, Language[Language],0), FALSE)","v":"Peat"},null,"CheckRow",null,{"$f":"IF(J3>Param_Menu!C8,\"§[Item1=STOCKSTART]§<>[ext:Item1=STOCKEND#Time=\" & B5-1 & \"M12]\",\"\")","v":"§[Item1=STOCKSTART]§<>[ext:Item1=STOCKEND#Time=2021M12]"},{"$f":"\"§[Item1=STOCKSTART]§<>[Item1=STOCKEND#Time=\" & J11 & \"]\"","v":"§[Item1=STOCKSTART]§<>[Item1=STOCKEND#Time=2022M01]"},{"$f":"\"§[Item1=STOCKSTART]§<>[Item1=STOCKEND#Time=\" & K11 & \"]\"","v":"§[Item1=STOCKSTART]§<>[Item1=STOCKEND#Time=2022M02]"},"§[Item1=STOCKSTART]§<>[Item1=STOCKEND#Time=2022M03]","§[Item1=STOCKSTART]§<>[Item1=STOCKEND#Time=2022M04]","§[Item1=STOCKSTART]§<>[Item1=STOCKEND#Time=2022M05]","§[Item1=STOCKSTART]§<>[Item1=STOCKEND#Time=2022M06]","§[Item1=STOCKSTART]§<>[Item1=STOCKEND#Time=2022M07]","§[Item1=STOCKSTART]§<>[Item1=STOCKEND#Time=2022M08]","§[Item1=STOCKSTART]§<>[Item1=STOCKEND#Time=2022M09]","§[Item1=STOCKSTART]§<>[Item1=STOCKEND#Time=2022M10]","§[Item1=STOCKSTART]§<>[Item1=STOCKEND#Time=2022M11]"]
[null,null,null,"OILSHALE","Oil shale and oil sands",{"$f":"VLOOKUP(E6, LanguageData, MATCH(LanguageChosen, Language[Language],0), FALSE)","v":"Oil shale and oil sands"},null,"LabelCheckRow",null,"Opening stocks should equal the\nclosing stocks of the previous month","Opening stocks should equal the\nclosing stocks of the previous month","Opening stocks should equal the\nclosing stocks of the previous month","Opening stocks should equal the\nclosing stocks of the previous month","Opening stocks should equal the\nclosing stocks of the previous month","Opening stocks should equal the\nclosing stocks of the previous month","Opening stocks should equal the\nclosing stocks of the previous month","Opening stocks should equal the\nclosing stocks of the previous month","Opening stocks should equal the\nclosing stocks of the previous month","Opening stocks should equal the\nclosing stocks of the previous month","Opening stocks should equal the\nclosing stocks of the previous month","Opening stocks should equal the\nclosing stocks of the previous month"]
[null,null,null,"COKEOVEN","Coke oven coke",{"$f":"VLOOKUP(E7, LanguageData, MATCH(LanguageChosen, Language[Language],0), FALSE)","v":"Coke oven coke"},null,"LockedRow"]
[null,null,null,null,null,null,null,"EmptyRow"]
[null,null,null,null,null,null,null,"VoluntaryRow"]
[null,null,null,null,null,null,null,null,null,{"$f":"B5","v":2022}]
{"$rows_left_out":19}
{"sheet":"TemplateRemarksTS","index":27,"n_rows":35,"n_cols":16,"rows_kept":35,"cut":false,"hidden":true,"merged":[]}
["Mode","Remarks"]
["DataType",null,null,null,{"$f":"VLOOKUP(B1, LanguageData, MATCH(LanguageChosen, Language[Language],0), FALSE)","v":"Remarks"}]
["Product"]
["Version",2023,null,null,"M01","M02","M03","M04","M05","M06","M07","M08","M09","M10","M11","M12"]
["Item2",null,"TypeRow",null,"txt","txt","txt","txt","txt","txt","txt","txt","txt","txt","txt","txt"]
[null,null,"Time",{"$f":"CountryName","v":"Slovenia"},{"$f":"$B$4&E4","v":"2023M01"},{"$f":"$B$4&F4","v":"2023M02"},"2023M03","2023M04","2023M05","2023M06","2023M07","2023M08","2023M09","2023M10","2023M11","2023M12"]
["Item1",null,"Label"]
["REMROW01",null,"Remarks 1"]
["REMROW02",null,"Remarks 2"]
["REMROW03",null,"Remarks 3"]
{"$rows_left_out":26}
{"sheet":"Template_Graphs","index":28,"n_rows":1099,"n_cols":16,"rows_kept":1099,"cut":false,"hidden":true,"merged":[]}
["VERSION","2022M05",null,null,null,null,null,"Monthly Coal Statistics (kt)",null,null,null,{"$f":"CountryName","v":"Slovenia"},null,null,null,{"$f":"CountryName & \": \"&VLOOKUP(H1, LanguageData, MATCH(LanguageChosen, Language[Language],0), FALSE)","v":"Slovenia: Monthly Coal Statistics (kt)"}]
["DATATYPE","FLOW"]
["ITEM2"]
[]
[null,{"$f":"DATE(LEFT($B$1,4),RIGHT($B$1,2)-4,1)","v":"2022-01-01"},null,null,null,null,null,"FormulaRow"]
[null,null,null,null,null,null,null,"CheckRow"]
[null,null,null,null,null,null,null,"LockedRow"]
[null,null,null,null,null,null,null,"EmptyRow"]
[null,null,null,null,null,null,null,"VoluntaryRow"]
[null,null,null,null,null,null,null,"LabelRow1"]
{"$rows_left_out":1090}
{"sheet":"CheckReport","index":29,"n_rows":1,"n_cols":14,"rows_kept":1,"cut":false,"hidden":true,"merged":[]}
["COUNTRY","QUEST","DATATYPE","PRODUCT","ITEM1","ITEM2","TIME","VALIDATION","VALUE","EXPECTED","RULE","CELL","TABLE","ERRORTYPE"]

{"sheet":"Param_Sheets","index":30,"n_rows":35,"n_cols":14,"rows_kept":35,"cut":false,"hidden":true,"merged":[]}
["Name","Template_Sheet","Version","Datatype","Product","Item1","Item2","Time","Protect",null,null,null,"Refresh Formula","Name"]
["Table1","Template_Table1",null,"FLOW","Template","Template",null,{"$f":"PeriodSelected","v":"2023M06"},1,null,null,null,null,"Table1"]
["TSHardCoal_2018","Template_TS1",2018,"FLOW","HARDCOAL","Template",null,"Template",1]
["TSHardCoal_2019","Template_TS1",2019,"FLOW","HARDCOAL","Template",null,"Template",1]
["TSHardCoal_2020","Template_TS1",2020,"FLOW","HARDCOAL","Template",null,"Template",1]
["TSHardCoal_2021","Template_TS1",2021,"FLOW","HARDCOAL","Template",null,"Template",1]
["TSHardCoal_2022","Template_TS1",2022,"FLOW","HARDCOAL","Template",null,"Template",1]
["TSHardCoal_2023","Template_TS1",2023,"FLOW","HARDCOAL","Template",null,"Template",1]
["TSBrown_2018","Template_TS1",2018,"FLOW","BROWN","Template",null,"Template",1]
["TSBrown_2019","Template_TS1",2019,"FLOW","BROWN","Template",null,"Template",1]
{"$rows_left_out":26}
{"sheet":"Param_Sheets_Templates","index":31,"n_rows":6,"n_cols":6,"rows_kept":6,"cut":false,"hidden":true,"merged":[]}
["Name","Template_Table1","Template_TS1","Template_Graphs","TemplateRemarks","TemplateRemarksTS"]
["Format","OneYear","TimeSeries","TimeSeries","OneYear","TimeSeries"]
["VersionRow",null,5,1,null,4]
["VersionCol",null,2,2,null,2]
["HideCol","A:H","A:H","A:N","A:C","A:C"]
["HideRow","3:10","2:8","4:11","4:7","4:5"]

{"sheet":"Param_Tables","index":32,"n_rows":35,"n_cols":9,"rows_kept":35,"cut":false,"hidden":true,"merged":[]}
["Name","SheetName","Template","Version","Datatype","Product","Item1","Item2","Time"]
["Table1","Table1","Template_Table1",null,"FLOW","Template","Template",null,{"$f":"PeriodSelected","v":"2023M06"}]
["TSHardCoal_2018","TSHardCoal_2018","Template_TS1",2018,"FLOW","HARDCOAL","Template",null,"Template"]
["TSHardCoal_2019","TSHardCoal_2019","Template_TS1",2019,"FLOW","HARDCOAL","Template",null,"Template"]
["TSHardCoal_2020","TSHardCoal_2020","Template_TS1",2020,"FLOW","HARDCOAL","Template",null,"Template"]
["TSHardCoal_2021","TSHardCoal_2021","Template_TS1",2021,"FLOW","HARDCOAL","Template",null,"Template"]
["TSHardCoal_2022","TSHardCoal_2022","Template_TS1",2022,"FLOW","HARDCOAL","Template",null,"Template"]
["TSHardCoal_2023","TSHardCoal_2023","Template_TS1",2023,"FLOW","HARDCOAL","Template",null,"Template"]
["TSBrown_2018","TSBrown_2018","Template_TS1",2018,"FLOW","BROWN","Template",null,"Template"]
["TSBrown_2019","TSBrown_2019","Template_TS1",2019,"FLOW","BROWN","Template",null,"Template"]
{"$rows_left_out":26}
{"sheet":"Param_Tables_Templates","index":33,"n_rows":45,"n_cols":6,"rows_kept":45,"cut":false,"hidden":true,"merged":[]}
["Name","Template_Table1","Template_TS1","TemplateRemarks","Template_Graphs","TemplateRemarksTS"]
["SheetName","Template_Table1","Template_TS1","TemplateRemarks","Template_Graphs","TemplateRemarksTS"]
["Format","OneYear","TimeSeries","OneYear","OneYear","TimeSeries"]
["VersionRow",null,5,null,1,4]
["VersionCol",null,2,null,2,2]
["FirstRow",13,13,8,14,8]
["FirstCol",10,10,5,13,5]
["LastRow",28,28,35,973,35]
["LastCol",14,21,5,13,16]
["DataTypeRow",2,2,2,2,2]
{"$rows_left_out":35}