{"text_format":"1","workbook":"xlsx","n_sheets":34,"sheets":["Historical_ISO","Historical_ISO_Period","Historical_SDMX","Historical_SDMX_Period","Historical","Input_ISO","Input_ISO_Period","Input_SDMX","Input_SDMX_Period","Entries","Output_ISO_csv","Output_SDMX_csv","Output_SDMX_long_complete","Mapping_Products_Flows","Parameters","Parameter_mapping","Test","Logs","Mapping_countries","Menu","Instructions","Param_Menu","Param_Questionnaire","Param_Multilanguage","Template_Table1","TemplateRemarks","Template_TS1","TemplateRemarksTS","Template_Graphs","CheckReport","Param_Sheets","Param_Sheets_Templates","Param_Tables","Param_Tables_Templates"],"not_rendered":{"charts":2,"images":0,"macros":1,"external_links":0,"defined_names":45,"comments":0,"pivot_tables":2},"unopened":[],"bounds":{"document_bytes":16777216,"sheet_cells":100000,"rows_first":2000,"rows_last":500,"rows_between":2000,"halvings":0,"cell_chars":16384,"cell_head_chars":4096},"cells_cut":0,"cells_raw":0,"read":"whole","date_system":"1900"}

{"sheet":"Historical_ISO","index":0,"n_rows":1,"n_cols":10,"rows_kept":1,"cut":false,"hidden":true,"merged":[]}
["COUNTRY","QUEST","PRODUCT","DATATYPE","ITEM1","ITEM2","TIME","VALUE","OBSERVATION","CONFIDENTIALITY"]

{"sheet":"Historical_ISO_Period","index":1,"n_rows":1,"n_cols":1,"rows_kept":1,"cut":false,"hidden":true,"merged":[]}
["ExternalData_1"]

{"sheet":"Historical_SDMX","index":2,"n_rows":2770,"n_cols":13,"rows_kept":2770,"cut":false,"hidden":true,"merged":[]}
["REF_AREA","DATAFLOW","PRODUCT","DATATYPE","ITEM1","ITEM2","TIME","VALUE","OBSERVATION","CONFIDENTIALITY","Record"]
[]
[null,null,null,null,null,null,null,null,null,null,null,"",""]
[null,null,null,null,null,null,null,null,null,null,null,"",""]
[null,null,null,null,null,null,null,null,null,null,null,"",""]
[null,null,null,null,null,null,null,null,null,null,null,"",""]
[null,null,null,null,null,null,null,null,null,null,null,"",""]
[null,null,null,null,null,null,null,null,null,null,null,"",""]
[null,null,null,null,null,null,null,null,null,null,null,"",""]
[null,null,null,null,null,null,null,null,null,null,null,"",""]
[null,null,null,null,null,null,null,null,null,null,null,"",""]
[null,null,null,null,null,null,null,null,null,null,null,"",""]
[null,null,null,null,null,null,null,null,null,null,null,"",""]
[null,null,null,null,null,null,null,null,null,null,null,"",""]
[null,null,null,null,null,null,null,null,null,null,null,"",""]
[null,null,null,null,null,null,null,null,null,null,null,"",""]
[null,null,null,null,null,null,null,null,null,null,null,"",""]
[null,null,null,null,null,null,null,null,null,null,null,"",""]
[null,null,null,null,null,null,null,null,null,null,null,"",""]
[null,null,null,null,null,null,null,null,null,null,null,"",""]
[null,null,null,null,null,null,null,null,null,null,null,"",""]
[null,null,null,null,null,null,null,null,null,null,null,"",""]
[null,null,null,null,null,null,null,null,null,null,null,"",""]
[null,null,null,null,null,null,null,null,null,null,null,"",""]
[null,null,null,null,null,null,null,null,null,null,null,"",""]
[null,null,null,null,null,null,null,null,null,null,null,"",""]
[null,null,null,null,null,null,null,null,null,null,null,"",""]
[null,null,null,null,null,null,null,null,null,null,null,"",""]
[null,null,null,null,null,null,null,null,null,null,null,"",""]
[null,null,null,null,null,null,null,null,null,null,null,"",""]
[null,null,null,null,null,null,null,null,null,null,null,"",""]
[null,null,null,null,null,null,null,null,null,null,null,"",""]
[null,null,null,null,null,null,null,null,null,null,null,"",""]
[null,null,null,null,null,null,null,null,null,null,null,"",""]
[null,null,null,null,null,null,null,null,null,null,null,"",""]
[null,null,null,null,null,null,null,null,null,null,null,"",""]
[null,null,null,null,null,null,null,null,null,null,null,"",""]
[null,null,null,null,null,null,null,null,null,null,null,"",""]
[null,null,null,null,null,null,null,null,null,null,null,"",""]
[null,null,null,null,null,null,null,null,null,null,null,"",""]
[null,null,null,null,null,null,null,null,null,null,null,"",""]
[null,null,null,null,null,null,null,null,null,null,null,"",""]
[null,null,null,null,null,null,null,null,null,null,null,"",""]
[null,null,null,null,null,null,null,null,null,null,null,"",""]
[null,null,null,null,null,null,null,null,null,null,null,"",""]
[null,null,null,null,null,null,null,null,null,null,null,"",""]
[null,null,null,null,null,null,null,null,null,null,null,"",""]
[null,null,null,null,null,null,null,null,null,null,null,"",""]
[null,null,null,null,null,null,null,null,null,null,null,"",""]
[null,null,null,null,null,null,null,null,null,null,null,"",""]
[null,null,null,null,null,null,null,null,null,null,null,"",""]
[null,null,null,null,null,null,null,null,null,null,null,"",""]
[null,null,null,null,null,null,null,null,null,null,null,"",""]
[null,null,null,null,null,null,null,null,null,null,null,"",""]
[null,null,null,null,null,null,null,null,null,null,null,"",""]
[null,null,null,null,null,null,null,null,null,null,null,"",""]
[null,null,null,null,null,null,null,null,null,null,null,"",""]
[null,null,null,null,null,null,null,null,null,null,null,"",""]
[null,null,null,null,null,null,null,null,null,null,null,"",""]
[null,null,null,null,null,null,null,null,null,null,null,"",""]
[null,null,null,null,null,null,null,null,null,null,null,"",""]
[null,null,null,null,null,null,null,null,null,null,null,"",""]
[null,null,null,null,null,null,null,null,null,null,null,"",""]
[null,null,null,null,null,null,null,null,null,null,null,"",""]
[null,null,null,null,null,null,null,null,null,null,null,"",""]
[null,null,null,null,null,null,null,null,null,null,null,"",""]
[null,null,null,null,null,null,null,null,null,null,null,"",""]
[null,null,null,null,null,null,null,null,null,null,null,"",""]
[null,null,null,null,null,null,null,null,null,null,null,"",""]
[null,null,null,null,null,null,null,null,null,null,null,"",""]
[null,null,null,null,null,null,null,null,null,null,null,"",""]
[null,null,null,null,null,null,null,null,null,null,null,"",""]
[null,null,null,null,null,null,null,null,null,null,null,"",""]
[null,null,null,null,null,null,null,null,null,null,null,"",""]
[null,null,null,null,null,null,null,null,null,null,null,"",""]
[null,null,null,null,null,null,null,null,null,null,null,"",""]
[null,null,null,null,null,null,null,null,null,null,null,"",""]
[null,null,null,null,null,null,null,null,null,null,null,"",""]
[null,null,null,null,null,null,null,null,null,null,null,"",""]
[null,null,null,null,null,null,null,null,null,null,null,"",""]
[null,null,null,null,null,null,null,null,null,null,null,"",""]
[null,null,null,null,null,null,null,null,null,null,null,"",""]
[null,null,null,null,null,null,null,null,null,null,null,"",""]
[null,null,null,null,null,null,null,null,null,null,null,"",""]
[null,null,null,null,null,null,null,null,null,null,null,"",""]
[null,null,null,null,null,null,null,null,null,null,null,"",""]
[null,null,null,null,null,null,null,null,null,null,null,"",""]
[null,null,null,null,null,null,null,null,null,null,null,"",""]
[null,null,null,null,null,null,null,null,null,null,null,"",""]
[null,null,null,null,null,null,null,null,null,null,null,"",""]
[null,null,null,null,null,null,null,null,null,null,null,"",""]
[null,null,null,null,null,null,null,null,null,null,null,"",""]
[null,null,null,null,null,null,null,null,null,null,null,"",""]
[null,null,null,null,null,null,null,null,null,null,null,"",""]
[null,null,null,null,null,null,null,null,null,null,null,"",""]
[null,null,null,null,null,null,null,null,null,null,null,"",""]
[null,null,null,null,null,null,null,null,null,null,null,"",""]
[null,null,null,null,null,null,null,null,null,null,null,"",""]
[null,null,null,null,null,null,null,null,null,null,null,"",""]
[null,null,null,null,null,null,null,null,null,null,null,"",""]
[null,null,null,null,null,null,null,null,null,null,null,"",""]
[null,null,null,null,null,null,null,null,null,null,null,"",""]
[null,null,null,null,null,null,null,null,null,null,null,"",""]
[null,null,null,null,null,null,null,null,null,null,null,"",""]
[null,null,null,null,null,null,null,null,null,null,null,"",""]
[null,null,null,null,null,null,null,null,null,null,null,"",""]
[null,null,null,null,null,null,null,null,null,null,null,"",""]
[null,null,null,null,null,null,null,null,null,null,null,"",""]
[null,null,null,null,null,null,null,null,null,null,null,"",""]
[null,null,null,null,null,null,null,null,null,null,null,"",""]
[null,null,null,null,null,null,null,null,null,null,null,"",""]
[null,null,null,null,null,null,null,null,null,null,null,"",""]
[null,null,null,null,null,null,null,null,null,null,null,"",""]
[null,null,null,null,null,null,null,null,null,null,null,"",""]
[null,null,null,null,null,null,null,null,null,null,null,"",""]
[null,null,null,null,null,null,null,null,null,null,null,"",""]
[null,null,null,null,null,null,null,null,null,null,null,"",""]
[null,null,null,null,null,null,null,null,null,null,null,"",""]
[null,null,null,null,null,null,null,null,null,null,null,"",""]
[null,null,null,null,null,null,null,null,null,null,null,"",""]
[null,null,null,null,null,null,null,null,null,null,null,"",""]
[null,null,null,null,null,null,null,null,null,null,null,"",""]
[null,null,null,null,null,null,null,null,null,null,null,"",""]
[null,null,null,null,null,null,null,null,null,null,null,"",""]
[null,null,null,null,null,null,null,null,null,null,null,"",""]
[null,null,null,null,null,null,null,null,null,null,null,"",""]
[null,null,null,null,null,null,null,null,null,null,null,"",""]
[null,null,null,null,null,null,null,null,null,null,null,"",""]
[null,null,null,null,null,null,null,null,null,null,null,"",""]
[null,null,null,null,null,null,null,null,null,null,null,"",""]
[null,null,null,null,null,null,null,null,null,null,null,"",""]
[null,null,null,null,null,null,null,null,null,null,null,"",""]
[null,null,null,null,null,null,null,null,null,null,null,"",""]
[null,null,null,null,null,null,null,null,null,null,null,"",""]
[null,null,null,null,null,null,null,null,null,null,null,"",""]
[null,null,null,null,null,null,null,null,null,null,null,"",""]
[null,null,null,null,null,null,null,null,null,null,null,"",""]
[null,null,null,null,null,null,null,null,null,null,null,"",""]
[null,null,null,null,null,null,null,null,null,null,null,"",""]
[null,null,null,null,null,null,null,null,null,null,null,"",""]
[null,null,null,null,null,null,null,null,null,null,null,"",""]
[null,null,null,null,null,null,null,null,null,null,null,"",""]
[null,null,null,null,null,null,null,null,null,null,null,"",""]
[null,null,null,null,null,null,null,null,null,null,null,"",""]
[null,null,null,null,null,null,null,null,null,null,null,"",""]
[null,null,null,null,null,null,null,null,null,null,null,"",""]
[null,null,null,null,null,null,null,null,null,null,null,"",""]
[null,null,null,null,null,null,null,null,null,null,null,"",""]
[null,null,null,null,null,null,null,null,null,null,null,"",""]
[null,null,null,null,null,null,null,null,null,null,null,"",""]
[null,null,null,null,null,null,null,null,null,null,null,"",""]
[null,null,null,null,null,null,null,null,null,null,null,"",""]
[null,null,null,null,null,null,null,null,null,null,null,"",""]
[null,null,null,null,null,null,null,null,null,null,null,"",""]
[null,null,null,null,null,null,null,null,null,null,null,"",""]
[null,null,null,null,null,null,null,null,null,null,null,"",""]
[null,null,null,null,null,null,null,null,null,null,null,"",""]
[null,null,null,null,null,null,null,null,null,null,null,"",""]
[null,null,null,null,null,null,null,null,null,null,null,"",""]
[null,null,null,null,null,null,null,null,null,null,null,"",""]
[null,null,null,null,null,null,null,null,null,null,null,"",""]
[null,null,null,null,null,null,null,null,null,null,null,"",""]
[null,null,null,null,null,null,null,null,null,null,null,"",""]
[null,null,null,null,null,null,null,null,null,null,null,"",""]
[null,null,null,null,null,null,null,null,null,null,null,"",""]
[null,null,null,null,null,null,null,null,null,null,null,"",""]
[null,null,null,null,null,null,null,null,null,null,null,"",""]
[null,null,null,null,null,null,null,null,null,null,null,"",""]
[null,null,null,null,null,null,null,null,null,null,null,"",""]
[null,null,null,null,null,null,null,null,null,null,null,"",""]
[null,null,null,null,null,null,null,null,null,null,null,"",""]
[null,null,null,null,null,null,null,null,null,null,null,"",""]
[null,null,null,null,null,null,null,null,null,null,null,"",""]
[null,null,null,null,null,null,null,null,null,null,null,"",""]
[null,null,null,null,null,null,null,null,null,null,null,"",""]
[null,null,null,null,null,null,null,null,null,null,null,"",""]
[null,null,null,null,null,null,null,null,null,null,null,"",""]
[null,null,null,null,null,null,null,null,null,null,null,"",""]
[null,null,null,null,null,null,null,null,null,null,null,"",""]
[null,null,null,null,null,null,null,null,null,null,null,"",""]
[null,null,null,null,null,null,null,null,null,null,null,"",""]
[null,null,null,null,null,null,null,null,null,null,null,"",""]
[null,null,null,null,null,null,null,null,null,null,null,"",""]
[null,null,null,null,null,null,null,null,null,null,null,"",""]
[null,null,null,null,null,null,null,null,null,null,null,"",""]
[null,null,null,null,null,null,null,null,null,null,null,"",""]
[null,null,null,null,null,null,null,null,null,null,null,"",""]
[null,null,null,null,null,null,null,null,null,null,null,"",""]
[null,null,null,null,null,null,null,null,null,null,null,"",""]
[null,null,null,null,null,null,null,null,null,null,null,"",""]
[null,null,null,null,null,null,null,null,null,null,null,"",""]
[null,null,null,null,null,null,null,null,null,null,null,"",""]
[null,null,null,null,null,null,null,null,null,null,null,"",""]
[null,null,null,null,null,null,null,null,null,null,null,"",""]
[null,null,null,null,null,null,null,null,null,null,null,"",""]
[null,null,null,null,null,null,null,null,null,null,null,"",""]
[null,null,null,null,null,null,null,null,null,null,null,"",""]
[null,null,null,null,null,null,null,null,null,null,null,"",""]
[null,null,null,null,null,null,null,null,null,null,null,"",""]
[null,null,null,null,null,null,null,null,null,null,null,"",""]
[null,null,null,null,null,null,null,null,null,null,null,"",""]
[null,null,null,null,null,null,null,null,null,null,null,"",""]
[null,null,null,null,null,null,null,null,null,null,null,"",""]
[null,null,null,null,null,null,null,null,null,null,null,"",""]
[null,null,null,null,null,null,null,null,null,null,null,"",""]
[null,null,null,null,null,null,null,null,null,null,null,"",""]
[null,null,null,null,null,null,null,null,null,null,null,"",""]
[null,null,null,null,null,null,null,null,null,null,null,"",""]
[null,null,null,null,null,null,null,null,null,null,null,"",""]
[null,null,null,null,null,null,null,null,null,null,null,"",""]
[null,null,null,null,null,null,null,null,null,null,null,"",""]
[null,null,null,null,null,null,null,null,null,null,null,"",""]
[null,null,null,null,null,null,null,null,null,null,null,"",""]
[null,null,null,null,null,null,null,null,null,null,null,"",""]
[null,null,null,null,null,null,null,null,null,null,null,"",""]
[null,null,null,null,null,null,null,null,null,null,null,"",""]
[null,null,null,null,null,null,null,null,null,null,null,"",""]
[null,null,null,null,null,null,null,null,null,null,null,"",""]
[null,null,null,null,null,null,null,null,null,null,null,"",""]
[null,null,null,null,null,null,null,null,null,null,null,"",""]
[null,null,null,null,null,null,null,null,null,null,null,"",""]
[null,null,null,null,null,null,null,null,null,null,null,"",""]
[null,null,null,null,null,null,null,null,null,null,null,"",""]
[null,null,null,null,null,null,null,null,null,null,null,"",""]
[null,null,null,null,null,null,null,null,null,null,null,"",""]
[null,null,null,null,null,null,null,null,null,null,null,"",""]
[null,null,null,null,null,null,null,null,null,null,null,"",""]
[null,null,null,null,null,null,null,null,null,null,null,"",""]
[null,null,null,null,null,null,null,null,null,null,null,"",""]
[null,null,null,null,null,null,null,null,null,null,null,"",""]
[null,null,null,null,null,null,null,null,null,null,null,"",""]
[null,null,null,null,null,null,null,null,null,null,null,"",""]
[null,null,null,null,null,null,null,null,null,null,null,"",""]
[null,null,null,null,null,null,null,null,null,null,null,"",""]
[null,null,null,null,null,null,null,null,null,null,null,"",""]
[null,null,null,null,null,null,null,null,null,null,null,"",""]
[null,null,null,null,null,null,null,null,null,null,null,"",""]
[null,null,null,null,null,null,null,null,null,null,null,"",""]
[null,null,null,null,null,null,null,null,null,null,null,"",""]
[null,null,null,null,null,null,null,null,null,null,null,"",""]
[null,null,null,null,null,null,null,null,null,null,null,"",""]
[null,null,null,null,null,null,null,null,null,null,null,"",""]
[null,null,null,null,null,null,null,null,null,null,null,"",""]
[null,null,null,null,null,null,null,null,null,null,null,"",""]
[null,null,null,null,null,null,null,null,null,null,null,"",""]
[null,null,null,null,null,null,null,null,null,null,null,"",""]
[null,null,null,null,null,null,null,null,null,null,null,"",""]
[null,null,null,null,null,null,null,null,null,null,null,"",""]
[null,null,null,null,null,null,null,null,null,null,null,"",""]
[null,null,null,null,null,null,null,null,null,null,null,"",""]
[null,null,null,null,null,null,null,null,null,null,null,"",""]
[null,null,null,null,null,null,null,null,null,null,null,"",""]
[null,null,null,null,null,null,null,null,null,null,null,"",""]
[null,null,null,null,null,null,null,null,null,null,null,"",""]
[null,null,null,null,null,null,null,null,null,null,null,"",""]
[null,null,null,null,null,null,null,null,null,null,null,"",""]
[null,null,null,null,null,null,null,null,null,null,null,"",""]
[null,null,null,null,null,null,null,null,null,null,null,"",""]
[null,null,null,null,null,null,null,null,null,null,null,"",""]
[null,null,null,null,null,null,null,null,null,null,null,"",""]
[null,null,null,null,null,null,null,null,null,null,null,"",""]
[null,null,null,null,null,null,null,null,null,null,null,"",""]
[null,null,null,null,null,null,null,null,null,null,null,"",""]
[null,null,null,null,null,null,null,null,null,null,null,"",""]
[null,null,null,null,null,null,null,null,null,null,null,"",""]
[null,null,null,null,null,null,null,null,null,null,null,"",""]
[null,null,null,null,null,null,null,null,null,null,null,"",""]
[null,null,null,null,null,null,null,null,null,null,null,"",""]
[null,null,null,null,null,null,null,null,null,null,null,"",""]
[null,null,null,null,null,null,null,null,null,null,null,"",""]
[null,null,null,null,null,null,null,null,null,null,null,"",""]
[null,null,null,null,null,null,null,null,null,null,null,"",""]
[null,null,null,null,null,null,null,null,null,null,null,"",""]
[null,null,null,null,null,null,null,null,null,null,null,"",""]
[null,null,null,null,null,null,null,null,null,null,null,"",""]
[null,null,null,null,null,null,null,null,null,null,null,"",""]
[null,null,null,null,null,null,null,null,null,null,null,"",""]
[null,null,null,null,null,null,null,null,null,null,null,"",""]
[null,null,null,null,null,null,null,null,null,null,null,"",""]
[null,null,null,null,null,null,null,null,null,null,null,"",""]
[null,null,null,null,null,null,null,null,null,null,null,"",""]
[null,null,null,null,null,null,null,null,null,null,null,"",""]
[null,null,null,null,null,null,null,null,null,null,null,"",""]
[null,null,null,null,null,null,null,null,null,null,null,"",""]
[null,null,null,null,null,null,null,null,null,null,null,"",""]
[null,null,null,null,null,null,null,null,null,null,null,"",""]
[null,null,null,null,null,null,null,null,null,null,null,"",""]
[null,null,null,null,null,null,null,null,null,null,null,"",""]
[null,null,null,null,null,null,null,null,null,null,null,"",""]
[null,null,null,null,null,null,null,null,null,null,null,"",""]
[null,null,null,null,null,null,null,null,null,null,null,"",""]
[null,null,null,null,null,null,null,null,null,null,null,"",""]
[null,null,null,null,null,null,null,null,null,null,null,"",""]
[null,null,null,null,null,null,null,null,null,null,null,"",""]
[null,null,null,null,null,null,null,null,null,null,null,"",""]
[null,null,null,null,null,null,null,null,null,null,null,"",""]
[null,null,null,null,null,null,null,null,null,null,null,"",""]
[null,null,null,null,null,null,null,null,null,null,null,"",""]
[null,null,null,null,null,null,null,null,null,null,null,"",""]
[null,null,null,null,null,null,null,null,null,null,null,"",""]
[null,null,null,null,null,null,null,null,null,null,null,"",""]
[null,null,null,null,null,null,null,null,null,null,null,"",""]
[null,null,null,null,null,null,null,null,null,null,null,"",""]
[null,null,null,null,null,null,null,null,null,null,null,"",""]
[null,null,null,null,null,null,null,null,null,null,null,"",""]
[null,null,null,null,null,null,null,null,null,null,null,"",""]
[null,null,null,null,null,null,null,null,null,null,null,"",""]
[null,null,null,null,null,null,null,null,null,null,null,"",""]
[null,null,null,null,null,null,null,null,null,null,null,"",""]
[null,null,null,null,null,null,null,null,null,null,null,"",""]
[null,null,null,null,null,null,null,null,null,null,null,"",""]
[null,null,null,null,null,null,null,null,null,null,null,"",""]
[null,null,null,null,null,null,null,null,null,null,null,"",""]
[null,null,null,null,null,null,null,null,null,null,null,"",""]
[null,null,null,null,null,null,null,null,null,null,null,"",""]
[null,null,null,null,null,null,null,null,null,null,null,"",""]
[null,null,null,null,null,null,null,null,null,null,null,"",""]
[null,null,null,null,null,null,null,null,null,null,null,"",""]
[null,null,null,null,null,null,null,null,null,null,null,"",""]
[null,null,null,null,null,null,null,null,null,null,null,"",""]
[null,null,null,null,null,null,null,null,null,null,null,"",""]
[null,null,null,null,null,null,null,null,null,null,null,"",""]
[null,null,null,null,null,null,null,null,null,null,null,"",""]
[null,null,null,null,null,null,null,null,null,null,null,"",""]
[null,null,null,null,null,null,null,null,null,null,null,"",""]
[null,null,null,null,null,null,null,null,null,null,null,"",""]
[null,null,null,null,null,null,null,null,null,null,null,"",""]
[null,null,null,null,null,null,null,null,null,null,null,"",""]
[null,null,null,null,null,null,null,null,null,null,null,"",""]
[null,null,null,null,null,null,null,null,null,null,null,"",""]
[null,null,null,null,null,null,null,null,null,null,null,"",""]
[null,null,null,null,null,null,null,null,null,null,null,"",""]
[null,null,null,null,null,null,null,null,null,null,null,"",""]
[null,null,null,null,null,null,null,null,null,null,null,"",""]
[null,null,null,null,null,null,null,null,null,null,null,"",""]
[null,null,null,null,null,null,null,null,null,null,null,"",""]
[null,null,null,null,null,null,null,null,null,null,null,"",""]
[null,null,null,null,null,null,null,null,null,null,null,"",""]
[null,null,null,null,null,null,null,null,null,null,null,"",""]
[null,null,null,null,null,null,null,null,null,null,null,"",""]
[null,null,null,null,null,null,null,null,null,null,null,"",""]
[null,null,null,null,null,null,null,null,null,null,null,"",""]
[null,null,null,null,null,null,null,null,null,null,null,"",""]
[null,null,null,null,null,null,null,null,null,null,null,"",""]
[null,null,null,null,null,null,null,null,null,null,null,"",""]
[null,null,null,null,null,null,null,null,null,null,null,"",""]
[null,null,null,null,null,null,null,null,null,null,null,"",""]
[null,null,null,null,null,null,null,null,null,null,null,"",""]
[null,null,null,null,null,null,null,null,null,null,null,"",""]
[null,null,null,null,null,null,null,null,null,null,null,"",""]
[null,null,null,null,null,null,null,null,null,null,null,"",""]
[null,null,null,null,null,null,null,null,null,null,null,"",""]
[null,null,null,null,null,null,null,null,null,null,null,"",""]
[null,null,null,null,null,null,null,null,null,null,null,"",""]
[null,null,null,null,null,null,null,null,null,null,null,"",""]
[null,null,null,null,null,null,null,null,null,null,null,"",""]
[null,null,null,null,null,null,null,null,null,null,null,"",""]
[null,null,null,null,null,null,null,null,null,null,null,"",""]
[null,null,null,null,null,null,null,null,null,null,null,"",""]
[null,null,null,null,null,null,null,null,null,null,null,"",""]
[null,null,null,null,null,null,null,null,null,null,null,"",""]
[null,null,null,null,null,null,null,null,null,null,null,"",""]
[null,null,null,null,null,null,null,null,null,null,null,"",""]
[null,null,null,null,null,null,null,null,null,null,null,"",""]
[null,null,null,null,null,null,null,null,null,null,null,"",""]
[null,null,null,null,null,null,null,null,null,null,null,"",""]
[null,null,null,null,null,null,null,null,null,null,null,"",""]
[null,null,null,null,null,null,null,null,null,null,null,"",""]
[null,null,null,null,null,null,null,null,null,null,null,"",""]
[null,null,null,null,null,null,null,null,null,null,null,"",""]
[null,null,null,null,null,null,null,null,null,null,null,"",""]
[null,null,null,null,null,null,null,null,null,null,null,"",""]
[null,null,null,null,null,null,null,null,null,null,null,"",""]
[null,null,null,null,null,null,null,null,null,null,null,"",""]
[null,null,null,null,null,null,null,null,null,null,null,"",""]
[null,null,null,null,null,null,null,null,null,null,null,"",""]
[null,null,null,null,null,null,null,null,null,null,null,"",""]
[null,null,null,null,null,null,null,null,null,null,null,"",""]
[null,null,null,null,null,null,null,null,null,null,null,"",""]
[null,null,null,null,null,null,null,null,null,null,null,"",""]
[null,null,null,null,null,null,null,null,null,null,null,"",""]
[null,null,null,null,null,null,null,null,null,null,null,"",""]
[null,null,null,null,null,null,null,null,null,null,null,"",""]
[null,null,null,null,null,null,null,null,null,null,null,"",""]
[null,null,null,null,null,null,null,null,null,null,null,"",""]
[null,null,null,null,null,null,null,null,null,null,null,"",""]
[null,null,null,null,null,null,null,null,null,null,null,"",""]
[null,null,null,null,null,null,null,null,null,null,null,"",""]
[null,null,null,null,null,null,null,null,null,null,null,"",""]
[null,null,null,null,null,null,null,null,null,null,null,"",""]
[null,null,null,null,null,null,null,null,null,null,null,"",""]
[null,null,null,null,null,null,null,null,null,null,null,"",""]
[null,null,null,null,null,null,null,null,null,null,null,"",""]
[null,null,null,null,null,null,null,null,null,null,null,"",""]
[null,null,null,null,null,null,null,null,null,null,null,"",""]
[null,null,null,null,null,null,null,null,null,null,null,"",""]
[null,null,null,null,null,null,null,null,null,null,null,"",""]
[null,null,null,null,null,null,null,null,null,null,null,"",""]
[null,null,null,null,null,null,null,null,null,null,null,"",""]
[null,null,null,null,null,null,null,null,null,null,null,"",""]
[null,null,null,null,null,null,null,null,null,null,null,"",""]
[null,null,null,null,null,null,null,null,null,null,null,"",""]
[null,null,null,null,null,null,null,null,null,null,null,"",""]
[null,null,null,null,null,null,null,null,null,null,null,"",""]
[null,null,null,null,null,null,null,null,null,null,null,"",""]
[null,null,null,null,null,null,null,null,null,null,null,"",""]
[null,null,null,null,null,null,null,null,null,null,null,"",""]
[null,null,null,null,null,null,null,null,null,null,null,"",""]
[null,null,null,null,null,null,null,null,null,null,null,"",""]
[null,null,null,null,null,null,null,null,null,null,null,"",""]
[null,null,null,null,null,null,null,null,null,null,null,"",""]
[null,null,null,null,null,null,null,null,null,null,null,"",""]
[null,null,null,null,null,null,null,null,null,null,null,"",""]
[null,null,null,null,null,null,null,null,null,null,null,"",""]
[null,null,null,null,null,null,null,null,null,null,null,"",""]
[null,null,null,null,null,null,null,null,null,null,null,"",""]
[null,null,null,null,null,null,null,null,null,null,null,"",""]
[null,null,null,null,null,null,null,null,null,null,null,"",""]
[null,null,null,null,null,null,null,null,null,null,null,"",""]
[null,null,null,null,null,null,null,null,null,null,null,"",""]
[null,null,null,null,null,null,null,null,null,null,null,"",""]
[null,null,null,null,null,null,null,null,null,null,null,"",""]
[null,null,null,null,null,null,null,null,null,null,null,"",""]
[null,null,null,null,null,null,null,null,null,null,null,"",""]
[null,null,null,null,null,null,null,null,null,null,null,"",""]
[null,null,null,null,null,null,null,null,null,null,null,"",""]
[null,null,null,null,null,null,null,null,null,null,null,"",""]
[null,null,null,null,null,null,null,null,null,null,null,"",""]
[null,null,null,null,null,null,null,null,null,null,null,"",""]
[null,null,null,null,null,null,null,null,null,null,null,"",""]
[null,null,null,null,null,null,null,null,null,null,null,"",""]
[null,null,null,null,null,null,null,null,null,null,null,"",""]
[null,null,null,null,null,null,null,null,null,null,null,"",""]
[null,null,null,null,null,null,null,null,null,null,null,"",""]
[null,null,null,null,null,null,null,null,null,null,null,"",""]
[null,null,null,null,null,null,null,null,null,null,null,"",""]
[null,null,null,null,null,null,null,null,null,null,null,"",""]
[null,null,null,null,null,null,null,null,null,null,null,"",""]
[null,null,null,null,null,null,null,null,null,null,null,"",""]
[null,null,null,null,null,null,null,null,null,null,null,"",""]
[null,null,null,null,null,null,null,null,null,null,null,"",""]
[null,null,null,null,null,null,null,null,null,null,null,"",""]
[null,null,null,null,null,null,null,null,null,null,null,"",""]
[null,null,null,null,null,null,null,null,null,null,null,"",""]
[null,null,null,null,null,null,null,null,null,null,null,"",""]
[null,null,null,null,null,null,null,null,null,null,null,"",""]
[null,null,null,null,null,null,null,null,null,null,null,"",""]
[null,null,null,null,null,null,null,null,null,null,null,"",""]
[null,null,null,null,null,null,null,null,null,null,null,"",""]
[null,null,null,null,null,null,null,null,null,null,null,"",""]
[null,null,null,null,null,null,null,null,null,null,null,"",""]
[null,null,null,null,null,null,null,null,null,null,null,"",""]
[null,null,null,null,null,null,null,null,null,null,null,"",""]
[null,null,null,null,null,null,null,null,null,null,null,"",""]
[null,null,null,null,null,null,null,null,null,null,null,"",""]
[null,null,null,null,null,null,null,null,null,null,null,"",""]
[null,null,null,null,null,null,null,null,null,null,null,"",""]
[null,null,null,null,null,null,null,null,null,null,null,"",""]
[null,null,null,null,null,null,null,null,null,null,null,"",""]
[null,null,null,null,null,null,null,null,null,null,null,"",""]
[null,null,null,null,null,null,null,null,null,null,null,"",""]
[null,null,null,null,null,null,null,null,null,null,null,"",""]
[null,null,null,null,null,null,null,null,null,null,null,"",""]
[null,null,null,null,null,null,null,null,null,null,null,"",""]
[null,null,null,null,null,null,null,null,null,null,null,"",""]
[null,null,null,null,null,null,null,null,null,null,null,"",""]
[null,null,null,null,null,null,null,null,null,null,null,"",""]
[null,null,null,null,null,null,null,null,null,null,null,"",""]
[null,null,null,null,null,null,null,null,null,null,null,"",""]
[null,null,null,null,null,null,null,null,null,null,null,"",""]
[null,null,null,null,null,null,null,null,null,null,null,"",""]
[null,null,null,null,null,null,null,null,null,null,null,"",""]
[null,null,null,null,null,null,null,null,null,null,null,"",""]
[null,null,null,null,null,null,null,null,null,null,null,"",""]
[null,null,null,null,null,null,null,null,null,null,null,"",""]
[null,null,null,null,null,null,null,null,null,null,null,"",""]
[null,null,null,null,null,null,null,null,null,null,null,"",""]
[null,null,null,null,null,null,null,null,null,null,null,"",""]
[null,null,null,null,null,null,null,null,null,null,null,"",""]
[null,null,null,null,null,null,null,null,null,null,null,"",""]
[null,null,null,null,null,null,null,null,null,null,null,"",""]
[null,null,null,null,null,null,null,null,null,null,null,"",""]
[null,null,null,null,null,null,null,null,null,null,null,"",""]
[null,null,null,null,null,null,null,null,null,null,null,"",""]
[null,null,null,null,null,null,null,null,null,null,null,"",""]
[null,null,null,null,null,null,null,null,null,null,null,"",""]
[null,null,null,null,null,null,null,null,null,null,null,"",""]
[null,null,null,null,null,null,null,null,null,null,null,"",""]
[null,null,null,null,null,null,null,null,null,null,null,"",""]
[null,null,null,null,null,null,null,null,null,null,null,"",""]
[null,null,null,null,null,null,null,null,null,null,null,"",""]
[null,null,null,null,null,null,null,null,null,null,null,"",""]
[null,null,null,null,null,null,null,null,null,null,null,"",""]
[null,null,null,null,null,null,null,null,null,null,null,"",""]
[null,null,null,null,null,null,null,null,null,null,null,"",""]
[null,null,null,null,null,null,null,null,null,null,null,"",""]
[null,null,null,null,null,null,null,null,null,null,null,"",""]
[null,null,null,null,null,null,null,null,null,null,null,"",""]
[null,null,null,null,null,null,null,null,null,null,null,"",""]
[null,null,null,null,null,null,null,null,null,null,null,"",""]
[null,null,null,null,null,null,null,null,null,null,null,"",""]
[null,null,null,null,null,null,null,null,null,null,null,"",""]
[null,null,null,null,null,null,null,null,null,null,null,"",""]
[null,null,null,null,null,null,null,null,null,null,null,"",""]
[null,null,null,null,null,null,null,null,null,null,null,"",""]
[null,null,null,null,null,null,null,null,null,null,null,"",""]
[null,null,null,null,null,null,null,null,null,null,null,"",""]
[null,null,null,null,null,null,null,null,null,null,null,"",""]
[null,null,null,null,null,null,null,null,null,null,null,"",""]
[null,null,null,null,null,null,null,null,null,null,null,"",""]
[null,null,null,null,null,null,null,null,null,null,null,"",""]
[null,null,null,null,null,null,null,null,null,null,null,"",""]
[null,null,null,null,null,null,null,null,null,null,null,"",""]
[null,null,null,null,null,null,null,null,null,null,null,"",""]
[null,null,null,null,null,null,null,null,null,null,null,"",""]
[null,null,null,null,null,null,null,null,null,null,null,"",""]
[null,null,null,null,null,null,null,null,null,null,null,"",""]
[null,null,null,null,null,null,null,null,null,null,null,"",""]
[null,null,null,null,null,null,null,null,null,null,null,"",""]
[null,null,null,null,null,null,null,null,null,null,null,"",""]
[null,null,null,null,null,null,null,null,null,null,null,"",""]
[null,null,null,null,null,null,null,null,null,null,null,"",""]
[null,null,null,null,null,null,null,null,null,null,null,"",""]
[null,null,null,null,null,null,null,null,null,null,null,"",""]
[null,null,null,null,null,null,null,null,null,null,null,"",""]
[null,null,null,null,null,null,null,null,null,null,null,"",""]
[null,null,null,null,null,null,null,null,null,null,null,"",""]
[null,null,null,null,null,null,null,null,null,null,null,"",""]
[null,null,null,null,null,null,null,null,null,null,null,"",""]
[null,null,null,null,null,null,null,null,null,null,null,"",""]
[null,null,null,null,null,null,null,null,null,null,null,"",""]
[null,null,null,null,null,null,null,null,null,null,null,"",""]
[null,null,null,null,null,null,null,null,null,null,null,"",""]
[null,null,null,null,null,null,null,null,null,null,null,"",""]
[null,null,null,null,null,null,null,null,null,null,null,"",""]
[null,null,null,null,null,null,null,null,null,null,null,"",""]
[null,null,null,null,null,null,null,null,null,null,null,"",""]
[null,null,null,null,null,null,null,null,null,null,null,"",""]
[null,null,null,null,null,null,null,null,null,null,null,"",""]
[null,null,null,null,null,null,null,null,null,null,null,"",""]
[null,null,null,null,null,null,null,null,null,null,null,"",""]
[null,null,null,null,null,null,null,null,null,null,null,"",""]
[null,null,null,null,null,null,null,null,null,null,null,"",""]
[null,null,null,null,null,null,null,null,null,null,null,"",""]
[null,null,null,null,null,null,null,null,null,null,null,"",""]
[null,null,null,null,null,null,null,null,null,null,null,"",""]
[null,null,null,null,null,null,null,null,null,null,null,"",""]
[null,null,null,null,null,null,null,null,null,null,null,"",""]
[null,null,null,null,null,null,null,null,null,null,null,"",""]
[null,null,null,null,null,null,null,null,null,null,null,"",""]
[null,null,null,null,null,null,null,null,null,null,null,"",""]
[null,null,null,null,null,null,null,null,null,null,null,"",""]
[null,null,null,null,null,null,null,null,null,null,null,"",""]
[null,null,null,null,null,null,null,null,null,null,null,"",""]
[null,null,null,null,null,null,null,null,null,null,null,"",""]
[null,null,null,null,null,null,null,null,null,null,null,"",""]
[null,null,null,null,null,null,null,null,null,null,null,"",""]
[null,null,null,null,null,null,null,null,null,null,null,"",""]
[null,null,null,null,null,null,null,null,null,null,null,"",""]
[null,null,null,null,null,null,null,null,null,null,null,"",""]
[null,null,null,null,null,null,null,null,null,null,null,"",""]
[null,null,null,null,null,null,null,null,null,null,null,"",""]
[null,null,null,null,null,null,null,null,null,null,null,"",""]
[null,null,null,null,null,null,null,null,null,null,null,"",""]
[null,null,null,null,null,null,null,null,null,null,null,"",""]
[null,null,null,null,null,null,null,null,null,null,null,"",""]
[null,null,null,null,null,null,null,null,null,null,null,"",""]
[null,null,null,null,null,null,null,null,null,null,null,"",""]
[null,null,null,null,null,null,null,null,null,null,null,"",""]
[null,null,null,null,null,null,null,null,null,null,null,"",""]
[null,null,null,null,null,null,null,null,null,null,null,"",""]
[null,null,null,null,null,null,null,null,null,null,null,"",""]
[null,null,null,null,null,null,null,null,null,null,null,"",""]
[null,null,null,null,null,null,null,null,null,null,null,"",""]
[null,null,null,null,null,null,null,null,null,null,null,"",""]
[null,null,null,null,null,null,null,null,null,null,null,"",""]
[null,null,null,null,null,null,null,null,null,null,null,"",""]
[null,null,null,null,null,null,null,null,null,null,null,"",""]
[null,null,null,null,null,null,null,null,null,null,null,"",""]
[null,null,null,null,null,null,null,null,null,null,null,"",""]
[null,null,null,null,null,null,null,null,null,null,null,"",""]
[null,null,null,null,null,null,null,null,null,null,null,"",""]
[null,null,null,null,null,null,null,null,null,null,null,"",""]
[null,null,null,null,null,null,null,null,null,null,null,"",""]
[null,null,null,null,null,null,null,null,null,null,null,"",""]
[null,null,null,null,null,null,null,null,null,null,null,"",""]
[null,null,null,null,null,null,null,null,null,null,null,"",""]
[null,null,null,null,null,null,null,null,null,null,null,"",""]
[null,null,null,null,null,null,null,null,null,null,null,"",""]
[null,null,null,null,null,null,null,null,null,null,null,"",""]
[null,null,null,null,null,null,null,null,null,null,null,"",""]
[null,null,null,null,null,null,null,null,null,null,null,"",""]
[null,null,null,null,null,null,null,null,null,null,null,"",""]
[null,null,null,null,null,null,null,null,null,null,null,"",""]
[null,null,null,null,null,null,null,null,null,null,null,"",""]
[null,null,null,null,null,null,null,null,null,null,null,"",""]
[null,null,null,null,null,null,null,null,null,null,null,"",""]
[null,null,null,null,null,null,null,null,null,null,null,"",""]
[null,null,null,null,null,null,null,null,null,null,null,"",""]
[null,null,null,null,null,null,null,null,null,null,null,"",""]
[null,null,null,null,null,null,null,null,null,null,null,"",""]
[null,null,null,null,null,null,null,null,null,null,null,"",""]
[null,null,null,null,null,null,null,null,null,null,null,"",""]
[null,null,null,null,null,null,null,null,null,null,null,"",""]
[null,null,null,null,null,null,null,null,null,null,null,"",""]
[null,null,null,null,null,null,null,null,null,null,null,"",""]
[null,null,null,null,null,null,null,null,null,null,null,"",""]
[null,null,null,null,null,null,null,null,null,null,null,"",""]
[null,null,null,null,null,null,null,null,null,null,null,"",""]
[null,null,null,null,null,null,null,null,null,null,null,"",""]
[null,null,null,null,null,null,null,null,null,null,null,"",""]
[null,null,null,null,null,null,null,null,null,null,null,"",""]
[null,null,null,null,null,null,null,null,null,null,null,"",""]
[null,null,null,null,null,null,null,null,null,null,null,"",""]
[null,null,null,null,null,null,null,null,null,null,null,"",""]
[null,null,null,null,null,null,null,null,null,null,null,"",""]
[null,null,null,null,null,null,null,null,null,null,null,"",""]
[null,null,null,null,null,null,null,null,null,null,null,"",""]
[null,null,null,null,null,null,null,null,null,null,null,"",""]
[null,null,null,null,null,null,null,null,null,null,null,"",""]
[null,null,null,null,null,null,null,null,null,null,null,"",""]
[null,null,null,null,null,null,null,null,null,null,null,"",""]
[null,null,null,null,null,null,null,null,null,null,null,"",""]
[null,null,null,null,null,null,null,null,null,null,null,"",""]
[null,null,null,null,null,null,null,null,null,null,null,"",""]
[null,null,null,null,null,null,null,null,null,null,null,"",""]
[null,null,null,null,null,null,null,null,null,null,null,"",""]
[null,null,null,null,null,null,null,null,null,null,null,"",""]
[null,null,null,null,null,null,null,null,null,null,null,"",""]
[null,null,null,null,null,null,null,null,null,null,null,"",""]
[null,null,null,null,null,null,null,null,null,null,null,"",""]
[null,null,null,null,null,null,null,null,null,null,null,"",""]
[null,null,null,null,null,null,null,null,null,null,null,"",""]
[null,null,null,null,null,null,null,null,null,null,null,"",""]
[null,null,null,null,null,null,null,null,null,null,null,"",""]
[null,null,null,null,null,null,null,null,null,null,null,"",""]
[null,null,null,null,null,null,null,null,null,null,null,"",""]
[null,null,null,null,null,null,null,null,null,null,null,"",""]
[null,null,null,null,null,null,null,null,null,null,null,"",""]
[null,null,null,null,null,null,null,null,null,null,null,"",""]
[null,null,null,null,null,null,null,null,null,null,null,"",""]
[null,null,null,null,null,null,null,null,null,null,null,"",""]
[null,null,null,null,null,null,null,null,null,null,null,"",""]
[null,null,null,null,null,null,null,null,null,null,null,"",""]
[null,null,null,null,null,null,null,null,null,null,null,"",""]
[null,null,null,null,null,null,null,null,null,null,null,"",""]
[null,null,null,null,null,null,null,null,null,null,null,"",""]
[null,null,null,null,null,null,null,null,null,null,null,"",""]
[null,null,null,null,null,null,null,null,null,null,null,"",""]
[null,null,null,null,null,null,null,null,null,null,null,"",""]
[null,null,null,null,null,null,null,null,null,null,null,"",""]
[null,null,null,null,null,null,null,null,null,null,null,"",""]
[null,null,null,null,null,null,null,null,null,null,null,"",""]
[null,null,null,null,null,null,null,null,null,null,null,"",""]
[null,null,null,null,null,null,null,null,null,null,null,"",""]
[null,null,null,null,null,null,null,null,null,null,null,"",""]
[null,null,null,null,null,null,null,null,null,null,null,"",""]
[null,null,null,null,null,null,null,null,null,null,null,"",""]
[null,null,null,null,null,null,null,null,null,null,null,"",""]
[null,null,null,null,null,null,null,null,null,null,null,"",""]
[null,null,null,null,null,null,null,null,null,null,null,"",""]
[null,null,null,null,null,null,null,null,null,null,null,"",""]
[null,null,null,null,null,null,null,null,null,null,null,"",""]
[null,null,null,null,null,null,null,null,null,null,null,"",""]
[null,null,null,null,null,null,null,null,null,null,null,"",""]
[null,null,null,null,null,null,null,null,null,null,null,"",""]
[null,null,null,null,null,null,null,null,null,null,null,"",""]
[null,null,null,null,null,null,null,null,null,null,null,"",""]
[null,null,null,null,null,null,null,null,null,null,null,"",""]
[null,null,null,null,null,null,null,null,null,null,null,"",""]
[null,null,null,null,null,null,null,null,null,null,null,"",""]
[null,null,null,null,null,null,null,null,null,null,null,"",""]
[null,null,null,null,null,null,null,null,null,null,null,"",""]
[null,null,null,null,null,null,null,null,null,null,null,"",""]
[null,null,null,null,null,null,null,null,null,null,null,"",""]
[null,null,null,null,null,null,null,null,null,null,null,"",""]
[null,null,null,null,null,null,null,null,null,null,null,"",""]
[null,null,null,null,null,null,null,null,null,null,null,"",""]
[null,null,null,null,null,null,null,null,null,null,null,"",""]
[null,null,null,null,null,null,null,null,null,null,null,"",""]
[null,null,null,null,null,null,null,null,null,null,null,"",""]
[null,null,null,null,null,null,null,null,null,null,null,"",""]
[null,null,null,null,null,null,null,null,null,null,null,"",""]
[null,null,null,null,null,null,null,null,null,null,null,"",""]
[null,null,null,null,null,null,null,null,null,null,null,"",""]
[null,null,null,null,null,null,null,null,null,null,null,"",""]
[null,null,null,null,null,null,null,null,null,null,null,"",""]
[null,null,null,null,null,null,null,null,null,null,null,"",""]
[null,null,null,null,null,null,null,null,null,null,null,"",""]
[null,null,null,null,null,null,null,null,null,null,null,"",""]
[null,null,null,null,null,null,null,null,null,null,null,"",""]
[null,null,null,null,null,null,null,null,null,null,null,"",""]
[null,null,null,null,null,null,null,null,null,null,null,"",""]
[null,null,null,null,null,null,null,null,null,null,null,"",""]
[null,null,null,null,null,null,null,null,null,null,null,"",""]
[null,null,null,null,null,null,null,null,null,null,null,"",""]
[null,null,null,null,null,null,null,null,null,null,null,"",""]
[null,null,null,null,null,null,null,null,null,null,null,"",""]
[null,null,null,null,null,null,null,null,null,null,null,"",""]
[null,null,null,null,null,null,null,null,null,null,null,"",""]
[null,null,null,null,null,null,null,null,null,null,null,"",""]
[null,null,null,null,null,null,null,null,null,null,null,"",""]
[null,null,null,null,null,null,null,null,null,null,null,"",""]
[null,null,null,null,null,null,null,null,null,null,null,"",""]
[null,null,null,null,null,null,null,null,null,null,null,"",""]
[null,null,null,null,null,null,null,null,null,null,null,"",""]
[null,null,null,null,null,null,null,null,null,null,null,"",""]
[null,null,null,null,null,null,null,null,null,null,null,"",""]
[null,null,null,null,null,null,null,null,null,null,null,"",""]
[null,null,null,null,null,null,null,null,null,null,null,"",""]
[null,null,null,null,null,null,null,null,null,null,null,"",""]
[null,null,null,null,null,null,null,null,null,null,null,"",""]
[null,null,null,null,null,null,null,null,null,null,null,"",""]
[null,null,null,null,null,null,null,null,null,null,null,"",""]
[null,null,null,null,null,null,null,null,null,null,null,"",""]
[null,null,null,null,null,null,null,null,null,null,null,"",""]
[null,null,null,null,null,null,null,null,null,null,null,"",""]
[null,null,null,null,null,null,null,null,null,null,null,"",""]
[null,null,null,null,null,null,null,null,null,null,null,"",""]
[null,null,null,null,null,null,null,null,null,null,null,"",""]
[null,null,null,null,null,null,null,null,null,null,null,"",""]
[null,null,null,null,null,null,null,null,null,null,null,"",""]
[null,null,null,null,null,null,null,null,null,null,null,"",""]
[null,null,null,null,null,null,null,null,null,null,null,"",""]
[null,null,null,null,null,null,null,null,null,null,null,"",""]
[null,null,null,null,null,null,null,null,null,null,null,"",""]
[null,null,null,null,null,null,null,null,null,null,null,"",""]
[null,null,null,null,null,null,null,null,null,null,null,"",""]
[null,null,null,null,null,null,null,null,null,null,null,"",""]
[null,null,null,null,null,null,null,null,null,null,null,"",""]
[null,null,null,null,null,null,null,null,null,null,null,"",""]
[null,null,null,null,null,null,null,null,null,null,null,"",""]
[null,null,null,null,null,null,null,null,null,null,null,"",""]
[null,null,null,null,null,null,null,null,null,null,null,"",""]
[null,null,null,null,null,null,null,null,null,null,null,"",""]
[null,null,null,null,null,null,null,null,null,null,null,"",""]
[null,null,null,null,null,null,null,null,null,null,null,"",""]
[null,null,null,null,null,null,null,null,null,null,null,"",""]
[null,null,null,null,null,null,null,null,null,null,null,"",""]
[null,null,null,null,null,null,null,null,null,null,null,"",""]
[null,null,null,null,null,null,null,null,null,null,null,"",""]
[null,null,null,null,null,null,null,null,null,null,null,"",""]
[null,null,null,null,null,null,null,null,null,null,null,"",""]
[null,null,null,null,null,null,null,null,null,null,null,"",""]
[null,null,null,null,null,null,null,null,null,null,null,"",""]
[null,null,null,null,null,null,null,null,null,null,null,"",""]
[null,null,null,null,null,null,null,null,null,null,null,"",""]
[null,null,null,null,null,null,null,null,null,null,null,"",""]
[null,null,null,null,null,null,null,null,null,null,null,"",""]
[null,null,null,null,null,null,null,null,null,null,null,"",""]
[null,null,null,null,null,null,null,null,null,null,null,"",""]
[null,null,null,null,null,null,null,null,null,null,null,"",""]
[null,null,null,null,null,null,null,null,null,null,null,"",""]
[null,null,null,null,null,null,null,null,null,null,null,"",""]
[null,null,null,null,null,null,null,null,null,null,null,"",""]
[null,null,null,null,null,null,null,null,null,null,null,"",""]
[null,null,null,null,null,null,null,null,null,null,null,"",""]
[null,null,null,null,null,null,null,null,null,null,null,"",""]
[null,null,null,null,null,null,null,null,null,null,null,"",""]
[null,null,null,null,null,null,null,null,null,null,null,"",""]
[null,null,null,null,null,null,null,null,null,null,null,"",""]
[null,null,null,null,null,null,null,null,null,null,null,"",""]
[null,null,null,null,null,null,null,null,null,null,null,"",""]
[null,null,null,null,null,null,null,null,null,null,null,"",""]
[null,null,null,null,null,null,null,null,null,null,null,"",""]
[null,null,null,null,null,null,null,null,null,null,null,"",""]
[null,null,null,null,null,null,null,null,null,null,null,"",""]
[null,null,null,null,null,null,null,null,null,null,null,"",""]
[null,null,null,null,null,null,null,null,null,null,null,"",""]
[null,null,null,null,null,null,null,null,null,null,null,"",""]
[null,null,null,null,null,null,null,null,null,null,null,"",""]
[null,null,null,null,null,null,null,null,null,null,null,"",""]
[null,null,null,null,null,null,null,null,null,null,null,"",""]
[null,null,null,null,null,null,null,null,null,null,null,"",""]
[null,null,null,null,null,null,null,null,null,null,null,"",""]
[null,null,null,null,null,null,null,null,null,null,null,"",""]
[null,null,null,null,null,null,null,null,null,null,null,"",""]
[null,null,null,null,null,null,null,null,null,null,null,"",""]
[null,null,null,null,null,null,null,null,null,null,null,"",""]
[null,null,null,null,null,null,null,null,null,null,null,"",""]
[null,null,null,null,null,null,null,null,null,null,null,"",""]
[null,null,null,null,null,null,null,null,null,null,null,"",""]
[null,null,null,null,null,null,null,null,null,null,null,"",""]
[null,null,null,null,null,null,null,null,null,null,null,"",""]
[null,null,null,null,null,null,null,null,null,null,null,"",""]
[null,null,null,null,null,null,null,null,null,null,null,"",""]
[null,null,null,null,null,null,null,null,null,null,null,"",""]
[null,null,null,null,null,null,null,null,null,null,null,"",""]
[null,null,null,null,null,null,null,null,null,null,null,"",""]
[null,null,null,null,null,null,null,null,null,null,null,"",""]
[null,null,null,null,null,null,null,null,null,null,null,"",""]
[null,null,null,null,null,null,null,null,null,null,null,"",""]
[null,null,null,null,null,null,null,null,null,null,null,"",""]
[null,null,null,null,null,null,null,null,null,null,null,"",""]
[null,null,null,null,null,null,null,null,null,null,null,"",""]
[null,null,null,null,null,null,null,null,null,null,null,"",""]
[null,null,null,null,null,null,null,null,null,null,null,"",""]
[null,null,null,null,null,null,null,null,null,null,null,"",""]
[null,null,null,null,null,null,null,null,null,null,null,"",""]
[null,null,null,null,null,null,null,null,null,null,null,"",""]
[null,null,null,null,null,null,null,null,null,null,null,"",""]
[null,null,null,null,null,null,null,null,null,null,null,"",""]
[null,null,null,null,null,null,null,null,null,null,null,"",""]
[null,null,null,null,null,null,null,null,null,null,null,"",""]
[null,null,null,null,null,null,null,null,null,null,null,"",""]
[null,null,null,null,null,null,null,null,null,null,null,"",""]
[null,null,null,null,null,null,null,null,null,null,null,"",""]
[null,null,null,null,null,null,null,null,null,null,null,"",""]
[null,null,null,null,null,null,null,null,null,null,null,"",""]
[null,null,null,null,null,null,null,null,null,null,null,"",""]
[null,null,null,null,null,null,null,null,null,null,null,"",""]
[null,null,null,null,null,null,null,null,null,null,null,"",""]
[null,null,null,null,null,null,null,null,null,null,null,"",""]
[null,null,null,null,null,null,null,null,null,null,null,"",""]
[null,null,null,null,null,null,null,null,null,null,null,"",""]
[null,null,null,null,null,null,null,null,null,null,null,"",""]
[null,null,null,null,null,null,null,null,null,null,null,"",""]
[null,null,null,null,null,null,null,null,null,null,null,"",""]
[null,null,null,null,null,null,null,null,null,null,null,"",""]
[null,null,null,null,null,null,null,null,null,null,null,"",""]
[null,null,null,null,null,null,null,null,null,null,null,"",""]
[null,null,null,null,null,null,null,null,null,null,null,"",""]
[null,null,null,null,null,null,null,null,null,null,null,"",""]
[null,null,null,null,null,null,null,null,null,null,null,"",""]
[null,null,null,null,null,null,null,null,null,null,null,"",""]
[null,null,null,null,null,null,null,null,null,null,null,"",""]
[null,null,null,null,null,null,null,null,null,null,null,"",""]
[null,null,null,null,null,null,null,null,null,null,null,"",""]
[null,null,null,null,null,null,null,null,null,null,null,"",""]
[null,null,null,null,null,null,null,null,null,null,null,"",""]
[null,null,null,null,null,null,null,null,null,null,null,"",""]
[null,null,null,null,null,null,null,null,null,null,null,"",""]
[null,null,null,null,null,null,null,null,null,null,null,"",""]
[null,null,null,null,null,null,null,null,null,null,null,"",""]
[null,null,null,null,null,null,null,null,null,null,null,"",""]
[null,null,null,null,null,null,null,null,null,null,null,"",""]
[null,null,null,null,null,null,null,null,null,null,null,"",""]
[null,null,null,null,null,null,null,null,null,null,null,"",""]
[null,null,null,null,null,null,null,null,null,null,null,"",""]
[null,null,null,null,null,null,null,null,null,null,null,"",""]
[null,null,null,null,null,null,null,null,null,null,null,"",""]
[null,null,null,null,null,null,null,null,null,null,null,"",""]
[null,null,null,null,null,null,null,null,null,null,null,"",""]
[null,null,null,null,null,null,null,null,null,null,null,"",""]
[null,null,null,null,null,null,null,null,null,null,null,"",""]
[null,null,null,null,null,null,null,null,null,null,null,"",""]
[null,null,null,null,null,null,null,null,null,null,null,"",""]
[null,null,null,null,null,null,null,null,null,null,null,"",""]
[null,null,null,null,null,null,null,null,null,null,null,"",""]
[null,null,null,null,null,null,null,null,null,null,null,"",""]
[null,null,null,null,null,null,null,null,null,null,null,"",""]
[null,null,null,null,null,null,null,null,null,null,null,"",""]
[null,null,null,null,null,null,null,null,null,null,null,"",""]
[null,null,null,null,null,null,null,null,null,null,null,"",""]
[null,null,null,null,null,null,null,null,null,null,null,"",""]
[null,null,null,null,null,null,null,null,null,null,null,"",""]
[null,null,null,null,null,null,null,null,null,null,null,"",""]
[null,null,null,null,null,null,null,null,null,null,null,"",""]
[null,null,null,null,null,null,null,null,null,null,null,"",""]
[null,null,null,null,null,null,null,null,null,null,null,"",""]
[null,null,null,null,null,null,null,null,null,null,null,"",""]
[null,null,null,null,null,null,null,null,null,null,null,"",""]
[null,null,null,null,null,null,null,null,null,null,null,"",""]
[null,null,null,null,null,null,null,null,null,null,null,"",""]
[null,null,null,null,null,null,null,null,null,null,null,"",""]
[null,null,null,null,null,null,null,null,null,null,null,"",""]
[null,null,null,null,null,null,null,null,null,null,null,"",""]
[null,null,null,null,null,null,null,null,null,null,null,"",""]
[null,null,null,null,null,null,null,null,null,null,null,"",""]
[null,null,null,null,null,null,null,null,null,null,null,"",""]
[null,null,null,null,null,null,null,null,null,null,null,"",""]
[null,null,null,null,null,null,null,null,null,null,null,"",""]
[null,null,null,null,null,null,null,null,null,null,null,"",""]
[null,null,null,null,null,null,null,null,null,null,null,"",""]
[null,null,null,null,null,null,null,null,null,null,null,"",""]
[null,null,null,null,null,null,null,null,null,null,null,"",""]
[null,null,null,null,null,null,null,null,null,null,null,"",""]
[null,null,null,null,null,null,null,null,null,null,null,"",""]
[null,null,null,null,null,null,null,null,null,null,null,"",""]
[null,null,null,null,null,null,null,null,null,null,null,"",""]
[null,null,null,null,null,null,null,null,null,null,null,"",""]
[null,null,null,null,null,null,null,null,null,null,null,"",""]
[null,null,null,null,null,null,null,null,null,null,null,"",""]
[null,null,null,null,null,null,null,null,null,null,null,"",""]
[null,null,null,null,null,null,null,null,null,null,null,"",""]
[null,null,null,null,null,null,null,null,null,null,null,"",""]
[null,null,null,null,null,null,null,null,null,null,null,"",""]
[null,null,null,null,null,null,null,null,null,null,null,"",""]
[null,null,null,null,null,null,null,null,null,null,null,"",""]
[null,null,null,null,null,null,null,null,null,null,null,"",""]
[null,null,null,null,null,null,null,null,null,null,null,"",""]
[null,null,null,null,null,null,null,null,null,null,null,"",""]
[null,null,null,null,null,null,null,null,null,null,null,"",""]
[null,null,null,null,null,null,null,null,null,null,null,"",""]
[null,null,null,null,null,null,null,null,null,null,null,"",""]
[null,null,null,null,null,null,null,null,null,null,null,"",""]
[null,null,null,null,null,null,null,null,null,null,null,"",""]
[null,null,null,null,null,null,null,null,null,null,null,"",""]
[null,null,null,null,null,null,null,null,null,null,null,"",""]
[null,null,null,null,null,null,null,null,null,null,null,"",""]
[null,null,null,null,null,null,null,null,null,null,null,"",""]
[null,null,null,null,null,null,null,null,null,null,null,"",""]
[null,null,null,null,null,null,null,null,null,null,null,"",""]
[null,null,null,null,null,null,null,null,null,null,null,"",""]
[null,null,null,null,null,null,null,null,null,null,null,"",""]
[null,null,null,null,null,null,null,null,null,null,null,"",""]
[null,null,null,null,null,null,null,null,null,null,null,"",""]
[null,null,null,null,null,null,null,null,null,null,null,"",""]
[null,null,null,null,null,null,null,null,null,null,null,"",""]
[null,null,null,null,null,null,null,null,null,null,null,"",""]
[null,null,null,null,null,null,null,null,null,null,null,"",""]
[null,null,null,null,null,null,null,null,null,null,null,"",""]
[null,null,null,null,null,null,null,null,null,null,null,"",""]
[null,null,null,null,null,null,null,null,null,null,null,"",""]
[null,null,null,null,null,null,null,null,null,null,null,"",""]
[null,null,null,null,null,null,null,null,null,null,null,"",""]
[null,null,null,null,null,null,null,null,null,null,null,"",""]
[null,null,null,null,null,null,null,null,null,null,null,"",""]
[null,null,null,null,null,null,null,null,null,null,null,"",""]
[null,null,null,null,null,null,null,null,null,null,null,"",""]
[null,null,null,null,null,null,null,null,null,null,null,"",""]
[null,null,null,null,null,null,null,null,null,null,null,"",""]
[null,null,null,null,null,null,null,null,null,null,null,"",""]
[null,null,null,null,null,null,null,null,null,null,null,"",""]
[null,null,null,null,null,null,null,null,null,null,null,"",""]
[null,null,null,null,null,null,null,null,null,null,null,"",""]
[null,null,null,null,null,null,null,null,null,null,null,"",""]
[null,null,null,null,null,null,null,null,null,null,null,"",""]
[null,null,null,null,null,null,null,null,null,null,null,"",""]
[null,null,null,null,null,null,null,null,null,null,null,"",""]
[null,null,null,null,null,null,null,null,null,null,null,"",""]
[null,null,null,null,null,null,null,null,null,null,null,"",""]
[null,null,null,null,null,null,null,null,null,null,null,"",""]
[null,null,null,null,null,null,null,null,null,null,null,"",""]
[null,null,null,null,null,null,null,null,null,null,null,"",""]
[null,null,null,null,null,null,null,null,null,null,null,"",""]
[null,null,null,null,null,null,null,null,null,null,null,"",""]
[null,null,null,null,null,null,null,null,null,null,null,"",""]
[null,null,null,null,null,null,null,null,null,null,null,"",""]
[null,null,null,null,null,null,null,null,null,null,null,"",""]
[null,null,null,null,null,null,null,null,null,null,null,"",""]
[null,null,null,null,null,null,null,null,null,null,null,"",""]
[null,null,null,null,null,null,null,null,null,null,null,"",""]
[null,null,null,null,null,null,null,null,null,null,null,"",""]
[null,null,null,null,null,null,null,null,null,null,null,"",""]
[null,null,null,null,null,null,null,null,null,null,null,"",""]
[null,null,null,null,null,null,null,null,null,null,null,"",""]
[null,null,null,null,null,null,null,null,null,null,null,"",""]
[null,null,null,null,null,null,null,null,null,null,null,"",""]
[null,null,null,null,null,null,null,null,null,null,null,"",""]
[null,null,null,null,null,null,null,null,null,null,null,"",""]
[null,null,null,null,null,null,null,null,null,null,null,"",""]
[null,null,null,null,null,null,null,null,null,null,null,"",""]
[null,null,null,null,null,null,null,null,null,null,null,"",""]
[null,null,null,null,null,null,null,null,null,null,null,"",""]
[null,null,null,null,null,null,null,null,null,null,null,"",""]
[null,null,null,null,null,null,null,null,null,null,null,"",""]
[null,null,null,null,null,null,null,null,null,null,null,"",""]
[null,null,null,null,null,null,null,null,null,null,null,"",""]
[null,null,null,null,null,null,null,null,null,null,null,"",""]
[null,null,null,null,null,null,null,null,null,null,null,"",""]
[null,null,null,null,null,null,null,null,null,null,null,"",""]
[null,null,null,null,null,null,null,null,null,null,null,"",""]
[null,null,null,null,null,null,null,null,null,null,null,"",""]
[null,null,null,null,null,null,null,null,null,null,null,"",""]
[null,null,null,null,null,null,null,null,null,null,null,"",""]
[null,null,null,null,null,null,null,null,null,null,null,"",""]
[null,null,null,null,null,null,null,null,null,null,null,"",""]
[null,null,null,null,null,null,null,null,null,null,null,"",""]
[null,null,null,null,null,null,null,null,null,null,null,"",""]
[null,null,null,null,null,null,null,null,null,null,null,"",""]
[null,null,null,null,null,null,null,null,null,null,null,"",""]
[null,null,null,null,null,null,null,null,null,null,null,"",""]
[null,null,null,null,null,null,null,null,null,null,null,"",""]
[null,null,null,null,null,null,null,null,null,null,null,"",""]
[null,null,null,null,null,null,null,null,null,null,null,"",""]
[null,null,null,null,null,null,null,null,null,null,null,"",""]
[null,null,null,null,null,null,null,null,null,null,null,"",""]
[null,null,null,null,null,null,null,null,null,null,null,"",""]
[null,null,null,null,null,null,null,null,null,null,null,"",""]
[null,null,null,null,null,null,null,null,null,null,null,"",""]
[null,null,null,null,null,null,null,null,null,null,null,"",""]
[null,null,null,null,null,null,null,null,null,null,null,"",""]
[null,null,null,null,null,null,null,null,null,null,null,"",""]
[null,null,null,null,null,null,null,null,null,null,null,"",""]
[null,null,null,null,null,null,null,null,null,null,null,"",""]
[null,null,null,null,null,null,null,null,null,null,null,"",""]
[null,null,null,null,null,null,null,null,null,null,null,"",""]
[null,null,null,null,null,null,null,null,null,null,null,"",""]
[null,null,null,null,null,null,null,null,null,null,null,"",""]
[null,null,null,null,null,null,null,null,null,null,null,"",""]
[null,null,null,null,null,null,null,null,null,null,null,"",""]
[null,null,null,null,null,null,null,null,null,null,null,"",""]
[null,null,null,null,null,null,null,null,null,null,null,"",""]
[null,null,null,null,null,null,null,null,null,null,null,"",""]
[null,null,null,null,null,null,null,null,null,null,null,"",""]
[null,null,null,null,null,null,null,null,null,null,null,"",""]
[null,null,null,null,null,null,null,null,null,null,null,"",""]
[null,null,null,null,null,null,null,null,null,null,null,"",""]
[null,null,null,null,null,null,null,null,null,null,null,"",""]
[null,null,null,null,null,null,null,null,null,null,null,"",""]
[null,null,null,null,null,null,null,null,null,null,null,"",""]
[null,null,null,null,null,null,null,null,null,null,null,"",""]
[null,null,null,null,null,null,null,null,null,null,null,"",""]
[null,null,null,null,null,null,null,null,null,null,null,"",""]
[null,null,null,null,null,null,null,null,null,null,null,"",""]
[null,null,null,null,null,null,null,null,null,null,null,"",""]
[null,null,null,null,null,null,null,null,null,null,null,"",""]
[null,null,null,null,null,null,null,null,null,null,null,"",""]
[null,null,null,null,null,null,null,null,null,null,null,"",""]
[null,null,null,null,null,null,null,null,null,null,null,"",""]
[null,null,null,null,null,null,null,null,null,null,null,"",""]
[null,null,null,null,null,null,null,null,null,null,null,"",""]
[null,null,null,null,null,null,null,null,null,null,null,"",""]
[null,null,null,null,null,null,null,null,null,null,null,"",""]
[null,null,null,null,null,null,null,null,null,null,null,"",""]
[null,null,null,null,null,null,null,null,null,null,null,"",""]
[null,null,null,null,null,null,null,null,null,null,null,"",""]
[null,null,null,null,null,null,null,null,null,null,null,"",""]
[null,null,null,null,null,null,null,null,null,null,null,"",""]
[null,null,null,null,null,null,null,null,null,null,null,"",""]
[null,null,null,null,null,null,null,null,null,null,null,"",""]
[null,null,null,null,null,null,null,null,null,null,null,"",""]
[null,null,null,null,null,null,null,null,null,null,null,"",""]
[null,null,null,null,null,null,null,null,null,null,null,"",""]
[null,null,null,null,null,null,null,null,null,null,null,"",""]
[null,null,null,null,null,null,null,null,null,null,null,"",""]
[null,null,null,null,null,null,null,null,null,null,null,"",""]
[null,null,null,null,null,null,null,null,null,null,null,"",""]
[null,null,null,null,null,null,null,null,null,null,null,"",""]
[null,null,null,null,null,null,null,null,null,null,null,"",""]
[null,null,null,null,null,null,null,null,null,null,null,"",""]
[null,null,null,null,null,null,null,null,null,null,null,"",""]
[null,null,null,null,null,null,null,null,null,null,null,"",""]
[null,null,null,null,null,null,null,null,null,null,null,"",""]
[null,null,null,null,null,null,null,null,null,null,null,"",""]
[null,null,null,null,null,null,null,null,null,null,null,"",""]
[null,null,null,null,null,null,null,null,null,null,null,"",""]
[null,null,null,null,null,null,null,null,null,null,null,"",""]
[null,null,null,null,null,null,null,null,null,null,null,"",""]
[null,null,null,null,null,null,null,null,null,null,null,"",""]
[null,null,null,null,null,null,null,null,null,null,null,"",""]
[null,null,null,null,null,null,null,null,null,null,null,"",""]
[null,null,null,null,null,null,null,null,null,null,null,"",""]
[null,null,null,null,null,null,null,null,null,null,null,"",""]
[null,null,null,null,null,null,null,null,null,null,null,"",""]
[null,null,null,null,null,null,null,null,null,null,null,"",""]
[null,null,null,null,null,null,null,null,null,null,null,"",""]
[null,null,null,null,null,null,null,null,null,null,null,"",""]
[null,null,null,null,null,null,null,null,null,null,null,"",""]
[null,null,null,null,null,null,null,null,null,null,null,"",""]
[null,null,null,null,null,null,null,null,null,null,null,"",""]
[null,null,null,null,null,null,null,null,null,null,null,"",""]
[null,null,null,null,null,null,null,null,null,null,null,"",""]
[null,null,null,null,null,null,null,null,null,null,null,"",""]
[null,null,null,null,null,null,null,null,null,null,null,"",""]
[null,null,null,null,null,null,null,null,null,null,null,"",""]
[null,null,null,null,null,null,null,null,null,null,null,"",""]
[null,null,null,null,null,null,null,null,null,null,null,"",""]
[null,null,null,null,null,null,null,null,null,null,null,"",""]
[null,null,null,null,null,null,null,null,null,null,null,"",""]
[null,null,null,null,null,null,null,null,null,null,null,"",""]
[null,null,null,null,null,null,null,null,null,null,null,"",""]
[null,null,null,null,null,null,null,null,null,null,null,"",""]
[null,null,null,null,null,null,null,null,null,null,null,"",""]
[null,null,null,null,null,null,null,null,null,null,null,"",""]
[null,null,null,null,null,null,null,null,null,null,null,"",""]
[null,null,null,null,null,null,null,null,null,null,null,"",""]
[null,null,null,null,null,null,null,null,null,null,null,"",""]
[null,null,null,null,null,null,null,null,null,null,null,"",""]
[null,null,null,null,null,null,null,null,null,null,null,"",""]
[null,null,null,null,null,null,null,null,null,null,null,"",""]
[null,null,null,null,null,null,null,null,null,null,null,"",""]
[null,null,null,null,null,null,null,null,null,null,null,"",""]
[null,null,null,null,null,null,null,null,null,null,null,"",""]
[null,null,null,null,null,null,null,null,null,null,null,"",""]
[null,null,null,null,null,null,null,null,null,null,null,"",""]
[null,null,null,null,null,null,null,null,null,null,null,"",""]
[null,null,null,null,null,null,null,null,null,null,null,"",""]
[null,null,null,null,null,null,null,null,null,null,null,"",""]
[null,null,null,null,null,null,null,null,null,null,null,"",""]
[null,null,null,null,null,null,null,null,null,null,null,"",""]
[null,null,null,null,null,null,null,null,null,null,null,"",""]
[null,null,null,null,null,null,null,null,null,null,null,"",""]
[null,null,null,null,null,null,null,null,null,null,null,"",""]
[null,null,null,null,null,null,null,null,null,null,null,"",""]
[null,null,null,null,null,null,null,null,null,null,null,"",""]
[null,null,null,null,null,null,null,null,null,null,null,"",""]
[null,null,null,null,null,null,null,null,null,null,null,"",""]
[null,null,null,null,null,null,null,null,null,null,null,"",""]
[null,null,null,null,null,null,null,null,null,null,null,"",""]
[null,null,null,null,null,null,null,null,null,null,null,"",""]
[null,null,null,null,null,null,null,null,null,null,null,"",""]
[null,null,null,null,null,null,null,null,null,null,null,"",""]
[null,null,null,null,null,null,null,null,null,null,null,"",""]
[null,null,null,null,null,null,null,null,null,null,null,"",""]
[null,null,null,null,null,null,null,null,null,null,null,"",""]
[null,null,null,null,null,null,null,null,null,null,null,"",""]
[null,null,null,null,null,null,null,null,null,null,null,"",""]
[null,null,null,null,null,null,null,null,null,null,null,"",""]
[null,null,null,null,null,null,null,null,null,null,null,"",""]
[null,null,null,null,null,null,null,null,null,null,null,"",""]
[null,null,null,null,null,null,null,null,null,null,null,"",""]
[null,null,null,null,null,null,null,null,null,null,null,"",""]
[null,null,null,null,null,null,null,null,null,null,null,"",""]
[null,null,null,null,null,null,null,null,null,null,null,"",""]
[null,null,null,null,null,null,null,null,null,null,null,"",""]
[null,null,null,null,null,null,null,null,null,null,null,"",""]
[null,null,null,null,null,null,null,null,null,null,null,"",""]
[null,null,null,null,null,null,null,null,null,null,null,"",""]
[null,null,null,null,null,null,null,null,null,null,null,"",""]
[null,null,null,null,null,null,null,null,null,null,null,"",""]
[null,null,null,null,null,null,null,null,null,null,null,"",""]
[null,null,null,null,null,null,null,null,null,null,null,"",""]
[null,null,null,null,null,null,null,null,null,null,null,"",""]
[null,null,null,null,null,null,null,null,null,null,null,"",""]
[null,null,null,null,null,null,null,null,null,null,null,"",""]
[null,null,null,null,null,null,null,null,null,null,null,"",""]
[null,null,null,null,null,null,null,null,null,null,null,"",""]
[null,null,null,null,null,null,null,null,null,null,null,"",""]
[null,null,null,null,null,null,null,null,null,null,null,"",""]
[null,null,null,null,null,null,null,null,null,null,null,"",""]
[null,null,null,null,null,null,null,null,null,null,null,"",""]
[null,null,null,null,null,null,null,null,null,null,null,"",""]
[null,null,null,null,null,null,null,null,null,null,null,"",""]
[null,null,null,null,null,null,null,null,null,null,null,"",""]
[null,null,null,null,null,null,null,null,null,null,null,"",""]
[null,null,null,null,null,null,null,null,null,null,null,"",""]
[null,null,null,null,null,null,null,null,null,null,null,"",""]
[null,null,null,null,null,null,null,null,null,null,null,"",""]
[null,null,null,null,null,null,null,null,null,null,null,"",""]
[null,null,null,null,null,null,null,null,null,null,null,"",""]
[null,null,null,null,null,null,null,null,null,null,null,"",""]
[null,null,null,null,null,null,null,null,null,null,null,"",""]
[null,null,null,null,null,null,null,null,null,null,null,"",""]
[null,null,null,null,null,null,null,null,null,null,null,"",""]
[null,null,null,null,null,null,null,null,null,null,null,"",""]
[null,null,null,null,null,null,null,null,null,null,null,"",""]
[null,null,null,null,null,null,null,null,null,null,null,"",""]
[null,null,null,null,null,null,null,null,null,null,null,"",""]
[null,null,null,null,null,null,null,null,null,null,null,"",""]
[null,null,null,null,null,null,null,null,null,null,null,"",""]
[null,null,null,null,null,null,null,null,null,null,null,"",""]
[null,null,null,null,null,null,null,null,null,null,null,"",""]
[null,null,null,null,null,null,null,null,null,null,null,"",""]
[null,null,null,null,null,null,null,null,null,null,null,"",""]
[null,null,null,null,null,null,null,null,null,null,null,"",""]
[null,null,null,null,null,null,null,null,null,null,null,"",""]
[null,null,null,null,null,null,null,null,null,null,null,"",""]
[null,null,null,null,null,null,null,null,null,null,null,"",""]
[null,null,null,null,null,null,null,null,null,null,null,"",""]
[null,null,null,null,null,null,null,null,null,null,null,"",""]
[null,null,null,null,null,null,null,null,null,null,null,"",""]
[null,null,null,null,null,null,null,null,null,null,null,"",""]
[null,null,null,null,null,null,null,null,null,null,null,"",""]
[null,null,null,null,null,null,null,null,null,null,null,"",""]
[null,null,null,null,null,null,null,null,null,null,null,"",""]
[null,null,null,null,null,null,null,null,null,null,null,"",""]
[null,null,null,null,null,null,null,null,null,null,null,"",""]
[null,null,null,null,null,null,null,null,null,null,null,"",""]
[null,null,null,null,null,null,null,null,null,null,null,"",""]
[null,null,null,null,null,null,null,null,null,null,null,"",""]
[null,null,null,null,null,null,null,null,null,null,null,"",""]
[null,null,null,null,null,null,null,null,null,null,null,"",""]
[null,null,null,null,null,null,null,null,null,null,null,"",""]
[null,null,null,null,null,null,null,null,null,null,null,"",""]
[null,null,null,null,null,null,null,null,null,null,null,"",""]
[null,null,null,null,null,null,null,null,null,null,null,"",""]
[null,null,null,null,null,null,null,null,null,null,null,"",""]
[null,null,null,null,null,null,null,null,null,null,null,"",""]
[null,null,null,null,null,null,null,null,null,null,null,"",""]
[null,null,null,null,null,null,null,null,null,null,null,"",""]
[null,null,null,null,null,null,null,null,null,null,null,"",""]
[null,null,null,null,null,null,null,null,null,null,null,"",""]
[null,null,null,null,null,null,null,null,null,null,null,"",""]
[null,null,null,null,null,null,null,null,null,null,null,"",""]
[null,null,null,null,null,null,null,null,null,null,null,"",""]
[null,null,null,null,null,null,null,null,null,null,null,"",""]
[null,null,null,null,null,null,null,null,null,null,null,"",""]
[null,null,null,null,null,null,null,null,null,null,null,"",""]
[null,null,null,null,null,null,null,null,null,null,null,"",""]
[null,null,null,null,null,null,null,null,null,null,null,"",""]
[null,null,null,null,null,null,null,null,null,null,null,"",""]
[null,null,null,null,null,null,null,null,null,null,null,"",""]
[null,null,null,null,null,null,null,null,null,null,null,"",""]
[null,null,null,null,null,null,null,null,null,null,null,"",""]
[null,null,null,null,null,null,null,null,null,null,null,"",""]
[null,null,null,null,null,null,null,null,null,null,null,"",""]
[null,null,null,null,null,null,null,null,null,null,null,"",""]
[null,null,null,null,null,null,null,null,null,null,null,"",""]
[null,null,null,null,null,null,null,null,null,null,null,"",""]
[null,null,null,null,null,null,null,null,null,null,null,"",""]
[null,null,null,null,null,null,null,null,null,null,null,"",""]
[null,null,null,null,null,null,null,null,null,null,null,"",""]
[null,null,null,null,null,null,null,null,null,null,null,"",""]
[null,null,null,null,null,null,null,null,null,null,null,"",""]
[null,null,null,null,null,null,null,null,null,null,null,"",""]
[null,null,null,null,null,null,null,null,null,null,null,"",""]
[null,null,null,null,null,null,null,null,null,null,null,"",""]
[null,null,null,null,null,null,null,null,null,null,null,"",""]
[null,null,null,null,null,null,null,null,null,null,null,"",""]
[null,null,null,null,null,null,null,null,null,null,null,"",""]
[null,null,null,null,null,null,null,null,null,null,null,"",""]
[null,null,null,null,null,null,null,null,null,null,null,"",""]
[null,null,null,null,null,null,null,null,null,null,null,"",""]
[null,null,null,null,null,null,null,null,null,null,null,"",""]
[null,null,null,null,null,null,null,null,null,null,null,"",""]
[null,null,null,null,null,null,null,null,null,null,null,"",""]
[null,null,null,null,null,null,null,null,null,null,null,"",""]
[null,null,null,null,null,null,null,null,null,null,null,"",""]
[null,null,null,null,null,null,null,null,null,null,null,"",""]
[null,null,null,null,null,null,null,null,null,null,null,"",""]
[null,null,null,null,null,null,null,null,null,null,null,"",""]
[null,null,null,null,null,null,null,null,null,null,null,"",""]
[null,null,null,null,null,null,null,null,null,null,null,"",""]
[null,null,null,null,null,null,null,null,null,null,null,"",""]
[null,null,null,null,null,null,null,null,null,null,null,"",""]
[null,null,null,null,null,null,null,null,null,null,null,"",""]
[null,null,null,null,null,null,null,null,null,null,null,"",""]
[null,null,null,null,null,null,null,null,null,null,null,"",""]
[null,null,null,null,null,null,null,null,null,null,null,"",""]
[null,null,null,null,null,null,null,null,null,null,null,"",""]
[null,null,null,null,null,null,null,null,null,null,null,"",""]
[null,null,null,null,null,null,null,null,null,null,null,"",""]
[null,null,null,null,null,null,null,null,null,null,null,"",""]
[null,null,null,null,null,null,null,null,null,null,null,"",""]
[null,null,null,null,null,null,null,null,null,null,null,"",""]
[null,null,null,null,null,null,null,null,null,null,null,"",""]
[null,null,null,null,null,null,null,null,null,null,null,"",""]
[null,null,null,null,null,null,null,null,null,null,null,"",""]
[null,null,null,null,null,null,null,null,null,null,null,"",""]
[null,null,null,null,null,null,null,null,null,null,null,"",""]
[null,null,null,null,null,null,null,null,null,null,null,"",""]
[null,null,null,null,null,null,null,null,null,null,null,"",""]
[null,null,null,null,null,null,null,null,null,null,null,"",""]
[null,null,null,null,null,null,null,null,null,null,null,"",""]
[null,null,null,null,null,null,null,null,null,null,null,"",""]
[null,null,null,null,null,null,null,null,null,null,null,"",""]
[null,null,null,null,null,null,null,null,null,null,null,"",""]
[null,null,null,null,null,null,null,null,null,null,null,"",""]
[null,null,null,null,null,null,null,null,null,null,null,"",""]
[null,null,null,null,null,null,null,null,null,null,null,"",""]
[null,null,null,null,null,null,null,null,null,null,null,"",""]
[null,null,null,null,null,null,null,null,null,null,null,"",""]
[null,null,null,null,null,null,null,null,null,null,null,"",""]
[null,null,null,null,null,null,null,null,null,null,null,"",""]
[null,null,null,null,null,null,null,null,null,null,null,"",""]
[null,null,null,null,null,null,null,null,null,null,null,"",""]
[null,null,null,null,null,null,null,null,null,null,null,"",""]
[null,null,null,null,null,null,null,null,null,null,null,"",""]
[null,null,null,null,null,null,null,null,null,null,null,"",""]
[null,null,null,null,null,null,null,null,null,null,null,"",""]
[null,null,null,null,null,null,null,null,null,null,null,"",""]
[null,null,null,null,null,null,null,null,null,null,null,"",""]
[null,null,null,null,null,null,null,null,null,null,null,"",""]
[null,null,null,null,null,null,null,null,null,null,null,"",""]
[null,null,null,null,null,null,null,null,null,null,null,"",""]
[null,null,null,null,null,null,null,null,null,null,null,"",""]
[null,null,null,null,null,null,null,null,null,null,null,"",""]
[null,null,null,null,null,null,null,null,null,null,null,"",""]
[null,null,null,null,null,null,null,null,null,null,null,"",""]
[null,null,null,null,null,null,null,null,null,null,null,"",""]
[null,null,null,null,null,null,null,null,null,null,null,"",""]
[null,null,null,null,null,null,null,null,null,null,null,"",""]
[null,null,null,null,null,null,null,null,null,null,null,"",""]
[null,null,null,null,null,null,null,null,null,null,null,"",""]
[null,null,null,null,null,null,null,null,null,null,null,"",""]
[null,null,null,null,null,null,null,null,null,null,null,"",""]
[null,null,null,null,null,null,null,null,null,null,null,"",""]
[null,null,null,null,null,null,null,null,null,null,null,"",""]
[null,null,null,null,null,null,null,null,null,null,null,"",""]
[null,null,null,null,null,null,null,null,null,null,null,"",""]
[null,null,null,null,null,null,null,null,null,null,null,"",""]
[null,null,null,null,null,null,null,null,null,null,null,"",""]
[null,null,null,null,null,null,null,null,null,null,null,"",""]
[null,null,null,null,null,null,null,null,null,null,null,"",""]
[null,null,null,null,null,null,null,null,null,null,null,"",""]
[null,null,null,null,null,null,null,null,null,null,null,"",""]
[null,null,null,null,null,null,null,null,null,null,null,"",""]
[null,null,null,null,null,null,null,null,null,null,null,"",""]
[null,null,null,null,null,null,null,null,null,null,null,"",""]
[null,null,null,null,null,null,null,null,null,null,null,"",""]
[null,null,null,null,null,null,null,null,null,null,null,"",""]
[null,null,null,null,null,null,null,null,null,null,null,"",""]
[null,null,null,null,null,null,null,null,null,null,null,"",""]
[null,null,null,null,null,null,null,null,null,null,null,"",""]
[null,null,null,null,null,null,null,null,null,null,null,"",""]
[null,null,null,null,null,null,null,null,null,null,null,"",""]
[null,null,null,null,null,null,null,null,null,null,null,"",""]
[null,null,null,null,null,null,null,null,null,null,null,"",""]
[null,null,null,null,null,null,null,null,null,null,null,"",""]
[null,null,null,null,null,null,null,null,null,null,null,"",""]
[null,null,null,null,null,null,null,null,null,null,null,"",""]
[null,null,null,null,null,null,null,null,null,null,null,"",""]
[null,null,null,null,null,null,null,null,null,null,null,"",""]
[null,null,null,null,null,null,null,null,null,null,null,"",""]
[null,null,null,null,null,null,null,null,null,null,null,"",""]
[null,null,null,null,null,null,null,null,null,null,null,"",""]
[null,null,null,null,null,null,null,null,null,null,null,"",""]
[null,null,null,null,null,null,null,null,null,null,null,"",""]
[null,null,null,null,null,null,null,null,null,null,null,"",""]
[null,null,null,null,null,null,null,null,null,null,null,"",""]
[null,null,null,null,null,null,null,null,null,null,null,"",""]
[null,null,null,null,null,null,null,null,null,null,null,"",""]
[null,null,null,null,null,null,null,null,null,null,null,"",""]
[null,null,null,null,null,null,null,null,null,null,null,"",""]
[null,null,null,null,null,null,null,null,null,null,null,"",""]
[null,null,null,null,null,null,null,null,null,null,null,"",""]
[null,null,null,null,null,null,null,null,null,null,null,"",""]
[null,null,null,null,null,null,null,null,null,null,null,"",""]
[null,null,null,null,null,null,null,null,null,null,null,"",""]
[null,null,null,null,null,null,null,null,null,null,null,"",""]
[null,null,null,null,null,null,null,null,null,null,null,"",""]
[null,null,null,null,null,null,null,null,null,null,null,"",""]
[null,null,null,null,null,null,null,null,null,null,null,"",""]
[null,null,null,null,null,null,null,null,null,null,null,"",""]
[null,null,null,null,null,null,null,null,null,null,null,"",""]
[null,null,null,null,null,null,null,null,null,null,null,"",""]
[null,null,null,null,null,null,null,null,null,null,null,"",""]
[null,null,null,null,null,null,null,null,null,null,null,"",""]
[null,null,null,null,null,null,null,null,null,null,null,"",""]
[null,null,null,null,null,null,null,null,null,null,null,"",""]
[null,null,null,null,null,null,null,null,null,null,null,"",""]
[null,null,null,null,null,null,null,null,null,null,null,"",""]
[null,null,null,null,null,null,null,null,null,null,null,"",""]
[null,null,null,null,null,null,null,null,null,null,null,"",""]
[null,null,null,null,null,null,null,null,null,null,null,"",""]
[null,null,null,null,null,null,null,null,null,null,null,"",""]
[null,null,null,null,null,null,null,null,null,null,null,"",""]
[null,null,null,null,null,null,null,null,null,null,null,"",""]
[null,null,null,null,null,null,null,null,null,null,null,"",""]
[null,null,null,null,null,null,null,null,null,null,null,"",""]
[null,null,null,null,null,null,null,null,null,null,null,"",""]
[null,null,null,null,null,null,null,null,null,null,null,"",""]
[null,null,null,null,null,null,null,null,null,null,null,"",""]
[null,null,null,null,null,null,null,null,null,null,null,"",""]
[null,null,null,null,null,null,null,null,null,null,null,"",""]
[null,null,null,null,null,null,null,null,null,null,null,"",""]
[null,null,null,null,null,null,null,null,null,null,null,"",""]
[null,null,null,null,null,null,null,null,null,null,null,"",""]
[null,null,null,null,null,null,null,null,null,null,null,"",""]
[null,null,null,null,null,null,null,null,null,null,null,"",""]
[null,null,null,null,null,null,null,null,null,null,null,"",""]
[null,null,null,null,null,null,null,null,null,null,null,"",""]
[null,null,null,null,null,null,null,null,null,null,null,"",""]
[null,null,null,null,null,null,null,null,null,null,null,"",""]
[null,null,null,null,null,null,null,null,null,null,null,"",""]
[null,null,null,null,null,null,null,null,null,null,null,"",""]
[null,null,null,null,null,null,null,null,null,null,null,"",""]
[null,null,null,null,null,null,null,null,null,null,null,"",""]
[null,null,null,null,null,null,null,null,null,null,null,"",""]
[null,null,null,null,null,null,null,null,null,null,null,"",""]
[null,null,null,null,null,null,null,null,null,null,null,"",""]
[null,null,null,null,null,null,null,null,null,null,null,"",""]
[null,null,null,null,null,null,null,null,null,null,null,"",""]
[null,null,null,null,null,null,null,null,null,null,null,"",""]
[null,null,null,null,null,null,null,null,null,null,null,"",""]
[null,null,null,null,null,null,null,null,null,null,null,"",""]
[null,null,null,null,null,null,null,null,null,null,null,"",""]
[null,null,null,null,null,null,null,null,null,null,null,"",""]
[null,null,null,null,null,null,null,null,null,null,null,"",""]
[null,null,null,null,null,null,null,null,null,null,null,"",""]
[null,null,null,null,null,null,null,null,null,null,null,"",""]
[null,null,null,null,null,null,null,null,null,null,null,"",""]
[null,null,null,null,null,null,null,null,null,null,null,"",""]
[null,null,null,null,null,null,null,null,null,null,null,"",""]
[null,null,null,null,null,null,null,null,null,null,null,"",""]
[null,null,null,null,null,null,null,null,null,null,null,"",""]
[null,null,null,null,null,null,null,null,null,null,null,"",""]
[null,null,null,null,null,null,null,null,null,null,null,"",""]
[null,null,null,null,null,null,null,null,null,null,null,"",""]
[null,null,null,null,null,null,null,null,null,null,null,"",""]
[null,null,null,null,null,null,null,null,null,null,null,"",""]
[null,null,null,null,null,null,null,null,null,null,null,"",""]
[null,null,null,null,null,null,null,null,null,null,null,"",""]
[null,null,null,null,null,null,null,null,null,null,null,"",""]
[null,null,null,null,null,null,null,null,null,null,null,"",""]
[null,null,null,null,null,null,null,null,null,null,null,"",""]
[null,null,null,null,null,null,null,null,null,null,null,"",""]
[null,null,null,null,null,null,null,null,null,null,null,"",""]
[null,null,null,null,null,null,null,null,null,null,null,"",""]
[null,null,null,null,null,null,null,null,null,null,null,"",""]
[null,null,null,null,null,null,null,null,null,null,null,"",""]
[null,null,null,null,null,null,null,null,null,null,null,"",""]
[null,null,null,null,null,null,null,null,null,null,null,"",""]
[null,null,null,null,null,null,null,null,null,null,null,"",""]
[null,null,null,null,null,null,null,null,null,null,null,"",""]
[null,null,null,null,null,null,null,null,null,null,null,"",""]
[null,null,null,null,null,null,null,null,null,null,null,"",""]
[null,null,null,null,null,null,null,null,null,null,null,"",""]
[null,null,null,null,null,null,null,null,null,null,null,"",""]
[null,null,null,null,null,null,null,null,null,null,null,"",""]
[null,null,null,null,null,null,null,null,null,null,null,"",""]
[null,null,null,null,null,null,null,null,null,null,null,"",""]
[null,null,null,null,null,null,null,null,null,null,null,"",""]
[null,null,null,null,null,null,null,null,null,null,null,"",""]
[null,null,null,null,null,null,null,null,null,null,null,"",""]
[null,null,null,null,null,null,null,null,null,null,null,"",""]
[null,null,null,null,null,null,null,null,null,null,null,"",""]
[null,null,null,null,null,null,null,null,null,null,null,"",""]
[null,null,null,null,null,null,null,null,null,null,null,"",""]
[null,null,null,null,null,null,null,null,null,null,null,"",""]
[null,null,null,null,null,null,null,null,null,null,null,"",""]
[null,null,null,null,null,null,null,null,null,null,null,"",""]
[null,null,null,null,null,null,null,null,null,null,null,"",""]
[null,null,null,null,null,null,null,null,null,null,null,"",""]
[null,null,null,null,null,null,null,null,null,null,null,"",""]
[null,null,null,null,null,null,null,null,null,null,null,"",""]
[null,null,null,null,null,null,null,null,null,null,null,"",""]
[null,null,null,null,null,null,null,null,null,null,null,"",""]
[null,null,null,null,null,null,null,null,null,null,null,"",""]
[null,null,null,null,null,null,null,null,null,null,null,"",""]
[null,null,null,null,null,null,null,null,null,null,null,"",""]
[null,null,null,null,null,null,null,null,null,null,null,"",""]
[null,null,null,null,null,null,null,null,null,null,null,"",""]
[null,null,null,null,null,null,null,null,null,null,null,"",""]
[null,null,null,null,null,null,null,null,null,null,null,"",""]
[null,null,null,null,null,null,null,null,null,null,null,"",""]
[null,null,null,null,null,null,null,null,null,null,null,"",""]
[null,null,null,null,null,null,null,null,null,null,null,"",""]
[null,null,null,null,null,null,null,null,null,null,null,"",""]
[null,null,null,null,null,null,null,null,null,null,null,"",""]
[null,null,null,null,null,null,null,null,null,null,null,"",""]
[null,null,null,null,null,null,null,null,null,null,null,"",""]
[null,null,null,null,null,null,null,null,null,null,null,"",""]
[null,null,null,null,null,null,null,null,null,null,null,"",""]
[null,null,null,null,null,null,null,null,null,null,null,"",""]
[null,null,null,null,null,null,null,null,null,null,null,"",""]
[null,null,null,null,null,null,null,null,null,null,null,"",""]
[null,null,null,null,null,null,null,null,null,null,null,"",""]
[null,null,null,null,null,null,null,null,null,null,null,"",""]
[null,null,null,null,null,null,null,null,null,null,null,"",""]
[null,null,null,null,null,null,null,null,null,null,null,"",""]
[null,null,null,null,null,null,null,null,null,null,null,"",""]
[null,null,null,null,null,null,null,null,null,null,null,"",""]
[null,null,null,null,null,null,null,null,null,null,null,"",""]
[null,null,null,null,null,null,null,null,null,null,null,"",""]
[null,null,null,null,null,null,null,null,null,null,null,"",""]
[null,null,null,null,null,null,null,null,null,null,null,"",""]
[null,null,null,null,null,null,null,null,null,null,null,"",""]
[null,null,null,null,null,null,null,null,null,null,null,"",""]
[null,null,null,null,null,null,null,null,null,null,null,"",""]
[null,null,null,null,null,null,null,null,null,null,null,"",""]
[null,null,null,null,null,null,null,null,null,null,null,"",""]
[null,null,null,null,null,null,null,null,null,null,null,"",""]
[null,null,null,null,null,null,null,null,null,null,null,"",""]
[null,null,null,null,null,null,null,null,null,null,null,"",""]
[null,null,null,null,null,null,null,null,null,null,null,"",""]
[null,null,null,null,null,null,null,null,null,null,null,"",""]
[null,null,null,null,null,null,null,null,null,null,null,"",""]
[null,null,null,null,null,null,null,null,null,null,null,"",""]
[null,null,null,null,null,null,null,null,null,null,null,"",""]
[null,null,null,null,null,null,null,null,null,null,null,"",""]
[null,null,null,null,null,null,null,null,null,null,null,"",""]
[null,null,null,null,null,null,null,null,null,null,null,"",""]
[null,null,null,null,null,null,null,null,null,null,null,"",""]
[null,null,null,null,null,null,null,null,null,null,null,"",""]
[null,null,null,null,null,null,null,null,null,null,null,"",""]
[null,null,null,null,null,null,null,null,null,null,null,"",""]
[null,null,null,null,null,null,null,null,null,null,null,"",""]
[null,null,null,null,null,null,null,null,null,null,null,"",""]
[null,null,null,null,null,null,null,null,null,null,null,"",""]
[null,null,null,null,null,null,null,null,null,null,null,"",""]
[null,null,null,null,null,null,null,null,null,null,null,"",""]
[null,null,null,null,null,null,null,null,null,null,null,"",""]
[null,null,null,null,null,null,null,null,null,null,null,"",""]
[null,null,null,null,null,null,null,null,null,null,null,"",""]
[null,null,null,null,null,null,null,null,null,null,null,"",""]
[null,null,null,null,null,null,null,null,null,null,null,"",""]
[null,null,null,null,null,null,null,null,null,null,null,"",""]
[null,null,null,null,null,null,null,null,null,null,null,"",""]
[null,null,null,null,null,null,null,null,null,null,null,"",""]
[null,null,null,null,null,null,null,null,null,null,null,"",""]
[null,null,null,null,null,null,null,null,null,null,null,"",""]
[null,null,null,null,null,null,null,null,null,null,null,"",""]
[null,null,null,null,null,null,null,null,null,null,null,"",""]
[null,null,null,null,null,null,null,null,null,null,null,"",""]
[null,null,null,null,null,null,null,null,null,null,null,"",""]
[null,null,null,null,null,null,null,null,null,null,null,"",""]
[null,null,null,null,null,null,null,null,null,null,null,"",""]
[null,null,null,null,null,null,null,null,null,null,null,"",""]
[null,null,null,null,null,null,null,null,null,null,null,"",""]
[null,null,null,null,null,null,null,null,null,null,null,"",""]
[null,null,null,null,null,null,null,null,null,null,null,"",""]
[null,null,null,null,null,null,null,null,null,null,null,"",""]
[null,null,null,null,null,null,null,null,null,null,null,"",""]
[null,null,null,null,null,null,null,null,null,null,null,"",""]
[null,null,null,null,null,null,null,null,null,null,null,"",""]
[null,null,null,null,null,null,null,null,null,null,null,"",""]
[null,null,null,null,null,null,null,null,null,null,null,"",""]
[null,null,null,null,null,null,null,null,null,null,null,"",""]
[null,null,null,null,null,null,null,null,null,null,null,"",""]
[null,null,null,null,null,null,null,null,null,null,null,"",""]
[null,null,null,null,null,null,null,null,null,null,null,"",""]
[null,null,null,null,null,null,null,null,null,null,null,"",""]
[null,null,null,null,null,null,null,null,null,null,null,"",""]
[null,null,null,null,null,null,null,null,null,null,null,"",""]
[null,null,null,null,null,null,null,null,null,null,null,"",""]
[null,null,null,null,null,null,null,null,null,null,null,"",""]
[null,null,null,null,null,null,null,null,null,null,null,"",""]
[null,null,null,null,null,null,null,null,null,null,null,"",""]
[null,null,null,null,null,null,null,null,null,null,null,"",""]
[null,null,null,null,null,null,null,null,null,null,null,"",""]
[null,null,null,null,null,null,null,null,null,null,null,"",""]
[null,null,null,null,null,null,null,null,null,null,null,"",""]
[null,null,null,null,null,null,null,null,null,null,null,"",""]
[null,null,null,null,null,null,null,null,null,null,null,"",""]
[null,null,null,null,null,null,null,null,null,null,null,"",""]
[null,null,null,null,null,null,null,null,null,null,null,"",""]
[null,null,null,null,null,null,null,null,null,null,null,"",""]
[null,null,null,null,null,null,null,null,null,null,null,"",""]
[null,null,null,null,null,null,null,null,null,null,null,"",""]
[null,null,null,null,null,null,null,null,null,null,null,"",""]
[null,null,null,null,null,null,null,null,null,null,null,"",""]
[null,null,null,null,null,null,null,null,null,null,null,"",""]
[null,null,null,null,null,null,null,null,null,null,null,"",""]
[null,null,null,null,null,null,null,null,null,null,null,"",""]
[null,null,null,null,null,null,null,null,null,null,null,"",""]
[null,null,null,null,null,null,null,null,null,null,null,"",""]
[null,null,null,null,null,null,null,null,null,null,null,"",""]
[null,null,null,null,null,null,null,null,null,null,null,"",""]
[null,null,null,null,null,null,null,null,null,null,null,"",""]
[null,null,null,null,null,null,null,null,null,null,null,"",""]
[null,null,null,null,null,null,null,null,null,null,null,"",""]
[null,null,null,null,null,null,null,null,null,null,null,"",""]
[null,null,null,null,null,null,null,null,null,null,null,"",""]
[null,null,null,null,null,null,null,null,null,null,null,"",""]
[null,null,null,null,null,null,null,null,null,null,null,"",""]
[null,null,null,null,null,null,null,null,null,null,null,"",""]
[null,null,null,null,null,null,null,null,null,null,null,"",""]
[null,null,null,null,null,null,null,null,null,null,null,"",""]
[null,null,null,null,null,null,null,null,null,null,null,"",""]
[null,null,null,null,null,null,null,null,null,null,null,"",""]
[null,null,null,null,null,null,null,null,null,null,null,"",""]
[null,null,null,null,null,null,null,null,null,null,null,"",""]
[null,null,null,null,null,null,null,null,null,null,null,"",""]
[null,null,null,null,null,null,null,null,null,null,null,"",""]
[null,null,null,null,null,null,null,null,null,null,null,"",""]
[null,null,null,null,null,null,null,null,null,null,null,"",""]
[null,null,null,null,null,null,null,null,null,null,null,"",""]
[null,null,null,null,null,null,null,null,null,null,null,"",""]
[null,null,null,null,null,null,null,null,null,null,null,"",""]
[null,null,null,null,null,null,null,null,null,null,null,"",""]
[null,null,null,null,null,null,null,null,null,null,null,"",""]
[null,null,null,null,null,null,null,null,null,null,null,"",""]
[null,null,null,null,null,null,null,null,null,null,null,"",""]
[null,null,null,null,null,null,null,null,null,null,null,"",""]
[null,null,null,null,null,null,null,null,null,null,null,"",""]
[null,null,null,null,null,null,null,null,null,null,null,"",""]
[null,null,null,null,null,null,null,null,null,null,null,"",""]
[null,null,null,null,null,null,null,null,null,null,null,"",""]
[null,null,null,null,null,null,null,null,null,null,null,"",""]
[null,null,null,null,null,null,null,null,null,null,null,"",""]
[null,null,null,null,null,null,null,null,null,null,null,"",""]
[null,null,null,null,null,null,null,null,null,null,null,"",""]
[null,null,null,null,null,null,null,null,null,null,null,"",""]
[null,null,null,null,null,null,null,null,null,null,null,"",""]
[null,null,null,null,null,null,null,null,null,null,null,"",""]
[null,null,null,null,null,null,null,null,null,null,null,"",""]
[null,null,null,null,null,null,null,null,null,null,null,"",""]
[null,null,null,null,null,null,null,null,null,null,null,"",""]
[null,null,null,null,null,null,null,null,null,null,null,"",""]
[null,null,null,null,null,null,null,null,null,null,null,"",""]
[null,null,null,null,null,null,null,null,null,null,null,"",""]
[null,null,null,null,null,null,null,null,null,null,null,"",""]
[null,null,null,null,null,null,null,null,null,null,null,"",""]
[null,null,null,null,null,null,null,null,null,null,null,"",""]
[null,null,null,null,null,null,null,null,null,null,null,"",""]
[null,null,null,null,null,null,null,null,null,null,null,"",""]
[null,null,null,null,null,null,null,null,null,null,null,"",""]
[null,null,null,null,null,null,null,null,null,null,null,"",""]
[null,null,null,null,null,null,null,null,null,null,null,"",""]
[null,null,null,null,null,null,null,null,null,null,null,"",""]
[null,null,null,null,null,null,null,null,null,null,null,"",""]
[null,null,null,null,null,null,null,null,null,null,null,"",""]
[null,null,null,null,null,null,null,null,null,null,null,"",""]
[null,null,null,null,null,null,null,null,null,null,null,"",""]
[null,null,null,null,null,null,null,null,null,null,null,"",""]
[null,null,null,null,null,null,null,null,null,null,null,"",""]
[null,null,null,null,null,null,null,null,null,null,null,"",""]
[null,null,null,null,null,null,null,null,null,null,null,"",""]
[null,null,null,null,null,null,null,null,null,null,null,"",""]
[null,null,null,null,null,null,null,null,null,null,null,"",""]
[null,null,null,null,null,null,null,null,null,null,null,"",""]
[null,null,null,null,null,null,null,null,null,null,null,"",""]
[null,null,null,null,null,null,null,null,null,null,null,"",""]
[null,null,null,null,null,null,null,null,null,null,null,"",""]
[null,null,null,null,null,null,null,null,null,null,null,"",""]
[null,null,null,null,null,null,null,null,null,null,null,"",""]
[null,null,null,null,null,null,null,null,null,null,null,"",""]
[null,null,null,null,null,null,null,null,null,null,null,"",""]
[null,null,null,null,null,null,null,null,null,null,null,"",""]
[null,null,null,null,null,null,null,null,null,null,null,"",""]
[null,null,null,null,null,null,null,null,null,null,null,"",""]
[null,null,null,null,null,null,null,null,null,null,null,"",""]
[null,null,null,null,null,null,null,null,null,null,null,"",""]
[null,null,null,null,null,null,null,null,null,null,null,"",""]
[null,null,null,null,null,null,null,null,null,null,null,"",""]
[null,null,null,null,null,null,null,null,null,null,null,"",""]
[null,null,null,null,null,null,null,null,null,null,null,"",""]
[null,null,null,null,null,null,null,null,null,null,null,"",""]
[null,null,null,null,null,null,null,null,null,null,null,"",""]
[null,null,null,null,null,null,null,null,null,null,null,"",""]
[null,null,null,null,null,null,null,null,null,null,null,"",""]
[null,null,null,null,null,null,null,null,null,null,null,"",""]
[null,null,null,null,null,null,null,null,null,null,null,"",""]
[null,null,null,null,null,null,null,null,null,null,null,"",""]
[null,null,null,null,null,null,null,null,null,null,null,"",""]
[null,null,null,null,null,null,null,null,null,null,null,"",""]
[null,null,null,null,null,null,null,null,null,null,null,"",""]
[null,null,null,null,null,null,null,null,null,null,null,"",""]
[null,null,null,null,null,null,null,null,null,null,null,"",""]
[null,null,null,null,null,null,null,null,null,null,null,"",""]
[null,null,null,null,null,null,null,null,null,null,null,"",""]
[null,null,null,null,null,null,null,null,null,null,null,"",""]
[null,null,null,null,null,null,null,null,null,null,null,"",""]
[null,null,null,null,null,null,null,null,null,null,null,"",""]
[null,null,null,null,null,null,null,null,null,null,null,"",""]
[null,null,null,null,null,null,null,null,null,null,null,"",""]
[null,null,null,null,null,null,null,null,null,null,null,"",""]
[null,null,null,null,null,null,null,null,null,null,null,"",""]
[null,null,null,null,null,null,null,null,null,null,null,"",""]
[null,null,null,null,null,null,null,null,null,null,null,"",""]
[null,null,null,null,null,null,null,null,null,null,null,"",""]
[null,null,null,null,null,null,null,null,null,null,null,"",""]
[null,null,null,null,null,null,null,null,null,null,null,"",""]
[null,null,null,null,null,null,null,null,null,null,null,"",""]
[null,null,null,null,null,null,null,null,null,null,null,"",""]
[null,null,null,null,null,null,null,null,null,null,null,"",""]
[null,null,null,null,null,null,null,null,null,null,null,"",""]
[null,null,null,null,null,null,null,null,null,null,null,"",""]
[null,null,null,null,null,null,null,null,null,null,null,"",""]
[null,null,null,null,null,null,null,null,null,null,null,"",""]
[null,null,null,null,null,null,null,null,null,null,null,"",""]
[null,null,null,null,null,null,null,null,null,null,null,"",""]
[null,null,null,null,null,null,null,null,null,null,null,"",""]
[null,null,null,null,null,null,null,null,null,null,null,"",""]
[null,null,null,null,null,null,null,null,null,null,null,"",""]
[null,null,null,null,null,null,null,null,null,null,null,"",""]
[null,null,null,null,null,null,null,null,null,null,null,"",""]
[null,null,null,null,null,null,null,null,null,null,null,"",""]
[null,null,null,null,null,null,null,null,null,null,null,"",""]
[null,null,null,null,null,null,null,null,null,null,null,"",""]
[null,null,null,null,null,null,null,null,null,null,null,"",""]
[null,null,null,null,null,null,null,null,null,null,null,"",""]
[null,null,null,null,null,null,null,null,null,null,null,"",""]
[null,null,null,null,null,null,null,null,null,null,null,"",""]
[null,null,null,null,null,null,null,null,null,null,null,"",""]
[null,null,null,null,null,null,null,null,null,null,null,"",""]
[null,null,null,null,null,null,null,null,null,null,null,"",""]
[null,null,null,null,null,null,null,null,null,null,null,"",""]
[null,null,null,null,null,null,null,null,null,null,null,"",""]
[null,null,null,null,null,null,null,null,null,null,null,"",""]
[null,null,null,null,null,null,null,null,null,null,null,"",""]
[null,null,null,null,null,null,null,null,null,null,null,"",""]
[null,null,null,null,null,null,null,null,null,null,null,"",""]
[null,null,null,null,null,null,null,null,null,null,null,"",""]
[null,null,null,null,null,null,null,null,null,null,null,"",""]
[null,null,null,null,null,null,null,null,null,null,null,"",""]
[null,null,null,null,null,null,null,null,null,null,null,"",""]
[null,null,null,null,null,null,null,null,null,null,null,"",""]
[null,null,null,null,null,null,null,null,null,null,null,"",""]
[null,null,null,null,null,null,null,null,null,null,null,"",""]
[null,null,null,null,null,null,null,null,null,null,null,"",""]
[null,null,null,null,null,null,null,null,null,null,null,"",""]
[null,null,null,null,null,null,null,null,null,null,null,"",""]
[null,null,null,null,null,null,null,null,null,null,null,"",""]
[null,null,null,null,null,null,null,null,null,null,null,"",""]
[null,null,null,null,null,null,null,null,null,null,null,"",""]
[null,null,null,null,null,null,null,null,null,null,null,"",""]
[null,null,null,null,null,null,null,null,null,null,null,"",""]
[null,null,null,null,null,null,null,null,null,null,null,"",""]
[null,null,null,null,null,null,null,null,null,null,null,"",""]
[null,null,null,null,null,null,null,null,null,null,null,"",""]
[null,null,null,null,null,null,null,null,null,null,null,"",""]
[null,null,null,null,null,null,null,null,null,null,null,"",""]
[null,null,null,null,null,null,null,null,null,null,null,"",""]
[null,null,null,null,null,null,null,null,null,null,null,"",""]
[null,null,null,null,null,null,null,null,null,null,null,"",""]
[null,null,null,null,null,null,null,null,null,null,null,"",""]
[null,null,null,null,null,null,null,null,null,null,null,"",""]
[null,null,null,null,null,null,null,null,null,null,null,"",""]
[null,null,null,null,null,null,null,null,null,null,null,"",""]
[null,null,null,null,null,null,null,null,null,null,null,"",""]
[null,null,null,null,null,null,null,null,null,null,null,"",""]
[null,null,null,null,null,null,null,null,null,null,null,"",""]
[null,null,null,null,null,null,null,null,null,null,null,"",""]
[null,null,null,null,null,null,null,null,null,null,null,"",""]
[null,null,null,null,null,null,null,null,null,null,null,"",""]
[null,null,null,null,null,null,null,null,null,null,null,"",""]
[null,null,null,null,null,null,null,null,null,null,null,"",""]
[null,null,null,null,null,null,null,null,null,null,null,"",""]
[null,null,null,null,null,null,null,null,null,null,null,"",""]
[null,null,null,null,null,null,null,null,null,null,null,"",""]
[null,null,null,null,null,null,null,null,null,null,null,"",""]
[null,null,null,null,null,null,null,null,null,null,null,"",""]
[null,null,null,null,null,null,null,null,null,null,null,"",""]
[null,null,null,null,null,null,null,null,null,null,null,"",""]
[null,null,null,null,null,null,null,null,null,null,null,"",""]
[null,null,null,null,null,null,null,null,null,null,null,"",""]
[null,null,null,null,null,null,null,null,null,null,null,"",""]
[null,null,null,null,null,null,null,null,null,null,null,"",""]
[null,null,null,null,null,null,null,null,null,null,null,"",""]
[null,null,null,null,null,null,null,null,null,null,null,"",""]
[null,null,null,null,null,null,null,null,null,null,null,"",""]
[null,null,null,null,null,null,null,null,null,null,null,"",""]
[null,null,null,null,null,null,null,null,null,null,null,"",""]
[null,null,null,null,null,null,null,null,null,null,null,"",""]
[null,null,null,null,null,null,null,null,null,null,null,"",""]
[null,null,null,null,null,null,null,null,null,null,null,"",""]
[null,null,null,null,null,null,null,null,null,null,null,"",""]
[null,null,null,null,null,null,null,null,null,null,null,"",""]
[null,null,null,null,null,null,null,null,null,null,null,"",""]
[null,null,null,null,null,null,null,null,null,null,null,"",""]
[null,null,null,null,null,null,null,null,null,null,null,"",""]
[null,null,null,null,null,null,null,null,null,null,null,"",""]
[null,null,null,null,null,null,null,null,null,null,null,"",""]
[null,null,null,null,null,null,null,null,null,null,null,"",""]
[null,null,null,null,null,null,null,null,null,null,null,"",""]
[null,null,null,null,null,null,null,null,null,null,null,"",""]
[null,null,null,null,null,null,null,null,null,null,null,"",""]
[null,null,null,null,null,null,null,null,null,null,null,"",""]
[null,null,null,null,null,null,null,null,null,null,null,"",""]
[null,null,null,null,null,null,null,null,null,null,null,"",""]
[null,null,null,null,null,null,null,null,null,null,null,"",""]
[null,null,null,null,null,null,null,null,null,null,null,"",""]
[null,null,null,null,null,null,null,null,null,null,null,"",""]
[null,null,null,null,null,null,null,null,null,null,null,"",""]
[null,null,null,null,null,null,null,null,null,null,null,"",""]
[null,null,null,null,null,null,null,null,null,null,null,"",""]
[null,null,null,null,null,null,null,null,null,null,null,"",""]
[null,null,null,null,null,null,null,null,null,null,null,"",""]
[null,null,null,null,null,null,null,null,null,null,null,"",""]
[null,null,null,null,null,null,null,null,null,null,null,"",""]
[null,null,null,null,null,null,null,null,null,null,null,"",""]
[null,null,null,null,null,null,null,null,null,null,null,"",""]
[null,null,null,null,null,null,null,null,null,null,null,"",""]
[null,null,null,null,null,null,null,null,null,null,null,"",""]
[null,null,null,null,null,null,null,null,null,null,null,"",""]
[null,null,null,null,null,null,null,null,null,null,null,"",""]
[null,null,null,null,null,null,null,null,null,null,null,"",""]
[null,null,null,null,null,null,null,null,null,null,null,"",""]
[null,null,null,null,null,null,null,null,null,null,null,"",""]
[null,null,null,null,null,null,null,null,null,null,null,"",""]
[null,null,null,null,null,null,null,null,null,null,null,"",""]
[null,null,null,null,null,null,null,null,null,null,null,"",""]
[null,null,null,null,null,null,null,null,null,null,null,"",""]
[null,null,null,null,null,null,null,null,null,null,null,"",""]
[null,null,null,null,null,null,null,null,null,null,null,"",""]
[null,null,null,null,null,null,null,null,null,null,null,"",""]
[null,null,null,null,null,null,null,null,null,null,null,"",""]
[null,null,null,null,null,null,null,null,null,null,null,"",""]
[null,null,null,null,null,null,null,null,null,null,null,"",""]
[null,null,null,null,null,null,null,null,null,null,null,"",""]
[null,null,null,null,null,null,null,null,null,null,null,"",""]
[null,null,null,null,null,null,null,null,null,null,null,"",""]
[null,null,null,null,null,null,null,null,null,null,null,"",""]
[null,null,null,null,null,null,null,null,null,null,null,"",""]
[null,null,null,null,null,null,null,null,null,null,null,"",""]
[null,null,null,null,null,null,null,null,null,null,null,"",""]
[null,null,null,null,null,null,null,null,null,null,null,"",""]
[null,null,null,null,null,null,null,null,null,null,null,"",""]
[null,null,null,null,null,null,null,null,null,null,null,"",""]
[null,null,null,null,null,null,null,null,null,null,null,"",""]
[null,null,null,null,null,null,null,null,null,null,null,"",""]
[null,null,null,null,null,null,null,null,null,null,null,"",""]
[null,null,null,null,null,null,null,null,null,null,null,"",""]
[null,null,null,null,null,null,null,null,null,null,null,"",""]
[null,null,null,null,null,null,null,null,null,null,null,"",""]
[null,null,null,null,null,null,null,null,null,null,null,"",""]
[null,null,null,null,null,null,null,null,null,null,null,"",""]
[null,null,null,null,null,null,null,null,null,null,null,"",""]
[null,null,null,null,null,null,null,null,null,null,null,"",""]
[null,null,null,null,null,null,null,null,null,null,null,"",""]
[null,null,null,null,null,null,null,null,null,null,null,"",""]
[null,null,null,null,null,null,null,null,null,null,null,"",""]
[null,null,null,null,null,null,null,null,null,null,null,"",""]
[null,null,null,null,null,null,null,null,null,null,null,"",""]
[null,null,null,null,null,null,null,null,null,null,null,"",""]
[null,null,null,null,null,null,null,null,null,null,null,"",""]
[null,null,null,null,null,null,null,null,null,null,null,"",""]
[null,null,null,null,null,null,null,null,null,null,null,"",""]
[null,null,null,null,null,null,null,null,null,null,null,"",""]
[null,null,null,null,null,null,null,null,null,null,null,"",""]
[null,null,null,null,null,null,null,null,null,null,null,"",""]
[null,null,null,null,null,null,null,null,null,null,null,"",""]
[null,null,null,null,null,null,null,null,null,null,null,"",""]
[null,null,null,null,null,null,null,null,null,null,null,"",""]
[null,null,null,null,null,null,null,null,null,null,null,"",""]
[null,null,null,null,null,null,null,null,null,null,null,"",""]
[null,null,null,null,null,null,null,null,null,null,null,"",""]
[null,null,null,null,null,null,null,null,null,null,null,"",""]
[null,null,null,null,null,null,null,null,null,null,null,"",""]
[null,null,null,null,null,null,null,null,null,null,null,"",""]
[null,null,null,null,null,null,null,null,null,null,null,"",""]
[null,null,null,null,null,null,null,null,null,null,null,"",""]
[null,null,null,null,null,null,null,null,null,null,null,"",""]
[null,null,null,null,null,null,null,null,null,null,null,"",""]
[null,null,null,null,null,null,null,null,null,null,null,"",""]
[null,null,null,null,null,null,null,null,null,null,null,"",""]
[null,null,null,null,null,null,null,null,null,null,null,"",""]
[null,null,null,null,null,null,null,null,null,null,null,"",""]
[null,null,null,null,null,null,null,null,null,null,null,"",""]
[null,null,null,null,null,null,null,null,null,null,null,"",""]
[null,null,null,null,null,null,null,null,null,null,null,"",""]
[null,null,null,null,null,null,null,null,null,null,null,"",""]
[null,null,null,null,null,null,null,null,null,null,null,"",""]
[null,null,null,null,null,null,null,null,null,null,null,"",""]
[null,null,null,null,null,null,null,null,null,null,null,"",""]
[null,null,null,null,null,null,null,null,null,null,null,"",""]
[null,null,null,null,null,null,null,null,null,null,null,"",""]
[null,null,null,null,null,null,null,null,null,null,null,"",""]
[null,null,null,null,null,null,null,null,null,null,null,"",""]
[null,null,null,null,null,null,null,null,null,null,null,"",""]
[null,null,null,null,null,null,null,null,null,null,null,"",""]
[null,null,null,null,null,null,null,null,null,null,null,"",""]
[null,null,null,null,null,null,null,null,null,null,null,"",""]
[null,null,null,null,null,null,null,null,null,null,null,"",""]
[null,null,null,null,null,null,null,null,null,null,null,"",""]
[null,null,null,null,null,null,null,null,null,null,null,"",""]
[null,null,null,null,null,null,null,null,null,null,null,"",""]
[null,null,null,null,null,null,null,null,null,null,null,"",""]
[null,null,null,null,null,null,null,null,null,null,null,"",""]
[null,null,null,null,null,null,null,null,null,null,null,"",""]
[null,null,null,null,null,null,null,null,null,null,null,"",""]
[null,null,null,null,null,null,null,null,null,null,null,"",""]
[null,null,null,null,null,null,null,null,null,null,null,"",""]
[null,null,null,null,null,null,null,null,null,null,null,"",""]
[null,null,null,null,null,null,null,null,null,null,null,"",""]
[null,null,null,null,null,null,null,null,null,null,null,"",""]
[null,null,null,null,null,null,null,null,null,null,null,"",""]
[null,null,null,null,null,null,null,null,null,null,null,"",""]
[null,null,null,null,null,null,null,null,null,null,null,"",""]
[null,null,null,null,null,null,null,null,null,null,null,"",""]
[null,null,null,null,null,null,null,null,null,null,null,"",""]
[null,null,null,null,null,null,null,null,null,null,null,"",""]
[null,null,null,null,null,null,null,null,null,null,null,"",""]
[null,null,null,null,null,null,null,null,null,null,null,"",""]
[null,null,null,null,null,null,null,null,null,null,null,"",""]
[null,null,null,null,null,null,null,null,null,null,null,"",""]
[null,null,null,null,null,null,null,null,null,null,null,"",""]
[null,null,null,null,null,null,null,null,null,null,null,"",""]
[null,null,null,null,null,null,null,null,null,null,null,"",""]
[null,null,null,null,null,null,null,null,null,null,null,"",""]
[null,null,null,null,null,null,null,null,null,null,null,"",""]
[null,null,null,null,null,null,null,null,null,null,null,"",""]
[null,null,null,null,null,null,null,null,null,null,null,"",""]
[null,null,null,null,null,null,null,null,null,null,null,"",""]
[null,null,null,null,null,null,null,null,null,null,null,"",""]
[null,null,null,null,null,null,null,null,null,null,null,"",""]
[null,null,null,null,null,null,null,null,null,null,null,"",""]
[null,null,null,null,null,null,null,null,null,null,null,"",""]
[null,null,null,null,null,null,null,null,null,null,null,"",""]
[null,null,null,null,null,null,null,null,null,null,null,"",""]
[null,null,null,null,null,null,null,null,null,null,null,"",""]
[null,null,null,null,null,null,null,null,null,null,null,"",""]
[null,null,null,null,null,null,null,null,null,null,null,"",""]
[null,null,null,null,null,null,null,null,null,null,null,"",""]
[null,null,null,null,null,null,null,null,null,null,null,"",""]
[null,null,null,null,null,null,null,null,null,null,null,"",""]
[null,null,null,null,null,null,null,null,null,null,null,"",""]
[null,null,null,null,null,null,null,null,null,null,null,"",""]
[null,null,null,null,null,null,null,null,null,null,null,"",""]
[null,null,null,null,null,null,null,null,null,null,null,"",""]
[null,null,null,null,null,null,null,null,null,null,null,"",""]
[null,null,null,null,null,null,null,null,null,null,null,"",""]
[null,null,null,null,null,null,null,null,null,null,null,"",""]
[null,null,null,null,null,null,null,null,null,null,null,"",""]
[null,null,null,null,null,null,null,null,null,null,null,"",""]
[null,null,null,null,null,null,null,null,null,null,null,"",""]
[null,null,null,null,null,null,null,null,null,null,null,"",""]
[null,null,null,null,null,null,null,null,null,null,null,"",""]
[null,null,null,null,null,null,null,null,null,null,null,"",""]
[null,null,null,null,null,null,null,null,null,null,null,"",""]
[null,null,null,null,null,null,null,null,null,null,null,"",""]
[null,null,null,null,null,null,null,null,null,null,null,"",""]
[null,null,null,null,null,null,null,null,null,null,null,"",""]
[null,null,null,null,null,null,null,null,null,null,null,"",""]
[null,null,null,null,null,null,null,null,null,null,null,"",""]
[null,null,null,null,null,null,null,null,null,null,null,"",""]
[null,null,null,null,null,null,null,null,null,null,null,"",""]
[null,null,null,null,null,null,null,null,null,null,null,"",""]
[null,null,null,null,null,null,null,null,null,null,null,"",""]
[null,null,null,null,null,null,null,null,null,null,null,"",""]
[null,null,null,null,null,null,null,null,null,null,null,"",""]
[null,null,null,null,null,null,null,null,null,null,null,"",""]
[null,null,null,null,null,null,null,null,null,null,null,"",""]
[null,null,null,null,null,null,null,null,null,null,null,"",""]
[null,null,null,null,null,null,null,null,null,null,null,"",""]
[null,null,null,null,null,null,null,null,null,null,null,"",""]
[null,null,null,null,null,null,null,null,null,null,null,"",""]
[null,null,null,null,null,null,null,null,null,null,null,"",""]
[null,null,null,null,null,null,null,null,null,null,null,"",""]
[null,null,null,null,null,null,null,null,null,null,null,"",""]
[null,null,null,null,null,null,null,null,null,null,null,"",""]
[null,null,null,null,null,null,null,null,null,null,null,"",""]
[null,null,null,null,null,null,null,null,null,null,null,"",""]
[null,null,null,null,null,null,null,null,null,null,null,"",""]
[null,null,null,null,null,null,null,null,null,null,null,"",""]
[null,null,null,null,null,null,null,null,null,null,null,"",""]
[null,null,null,null,null,null,null,null,null,null,null,"",""]
[null,null,null,null,null,null,null,null,null,null,null,"",""]
[null,null,null,null,null,null,null,null,null,null,null,"",""]
[null,null,null,null,null,null,null,null,null,null,null,"",""]
[null,null,null,null,null,null,null,null,null,null,null,"",""]
[null,null,null,null,null,null,null,null,null,null,null,"",""]
[null,null,null,null,null,null,null,null,null,null,null,"",""]
[null,null,null,null,null,null,null,null,null,null,null,"",""]
[null,null,null,null,null,null,null,null,null,null,null,"",""]
[null,null,null,null,null,null,null,null,null,null,null,"",""]
[null,null,null,null,null,null,null,null,null,null,null,"",""]
[null,null,null,null,null,null,null,null,null,null,null,"",""]
[null,null,null,null,null,null,null,null,null,null,null,"",""]
[null,null,null,null,null,null,null,null,null,null,null,"",""]
[null,null,null,null,null,null,null,null,null,null,null,"",""]
[null,null,null,null,null,null,null,null,null,null,null,"",""]
[null,null,null,null,null,null,null,null,null,null,null,"",""]
[null,null,null,null,null,null,null,null,null,null,null,"",""]
[null,null,null,null,null,null,null,null,null,null,null,"",""]
[null,null,null,null,null,null,null,null,null,null,null,"",""]
[null,null,null,null,null,null,null,null,null,null,null,"",""]
[null,null,null,null,null,null,null,null,null,null,null,"",""]
[null,null,null,null,null,null,null,null,null,null,null,"",""]
[null,null,null,null,null,null,null,null,null,null,null,"",""]
[null,null,null,null,null,null,null,null,null,null,null,"",""]
[null,null,null,null,null,null,null,null,null,null,null,"",""]
[null,null,null,null,null,null,null,null,null,null,null,"",""]
[null,null,null,null,null,null,null,null,null,null,null,"",""]
[null,null,null,null,null,null,null,null,null,null,null,"",""]
[null,null,null,null,null,null,null,null,null,null,null,"",""]
[null,null,null,null,null,null,null,null,null,null,null,"",""]
[null,null,null,null,null,null,null,null,null,null,null,"",""]
[null,null,null,null,null,null,null,null,null,null,null,"",""]
[null,null,null,null,null,null,null,null,null,null,null,"",""]
[null,null,null,null,null,null,null,null,null,null,null,"",""]
[null,null,null,null,null,null,null,null,null,null,null,"",""]
[null,null,null,null,null,null,null,null,null,null,null,"",""]
[null,null,null,null,null,null,null,null,null,null,null,"",""]
[null,null,null,null,null,null,null,null,null,null,null,"",""]
[null,null,null,null,null,null,null,null,null,null,null,"",""]
[null,null,null,null,null,null,null,null,null,null,null,"",""]
[null,null,null,null,null,null,null,null,null,null,null,"",""]
[null,null,null,null,null,null,null,null,null,null,null,"",""]
[null,null,null,null,null,null,null,null,null,null,null,"",""]
[null,null,null,null,null,null,null,null,null,null,null,"",""]
[null,null,null,null,null,null,null,null,null,null,null,"",""]
[null,null,null,null,null,null,null,null,null,null,null,"",""]
[null,null,null,null,null,null,null,null,null,null,null,"",""]
[null,null,null,null,null,null,null,null,null,null,null,"",""]
[null,null,null,null,null,null,null,null,null,null,null,"",""]
[null,null,null,null,null,null,null,null,null,null,null,"",""]
[null,null,null,null,null,null,null,null,null,null,null,"",""]
[null,null,null,null,null,null,null,null,null,null,null,"",""]
[null,null,null,null,null,null,null,null,null,null,null,"",""]
[null,null,null,null,null,null,null,null,null,null,null,"",""]
[null,null,null,null,null,null,null,null,null,null,null,"",""]
[null,null,null,null,null,null,null,null,null,null,null,"",""]
[null,null,null,null,null,null,null,null,null,null,null,"",""]
[null,null,null,null,null,null,null,null,null,null,null,"",""]
[null,null,null,null,null,null,null,null,null,null,null,"",""]
[null,null,null,null,null,null,null,null,null,null,null,"",""]
[null,null,null,null,null,null,null,null,null,null,null,"",""]
[null,null,null,null,null,null,null,null,null,null,null,"",""]
[null,null,null,null,null,null,null,null,null,null,null,"",""]
[null,null,null,null,null,null,null,null,null,null,null,"",""]
[null,null,null,null,null,null,null,null,null,null,null,"",""]
[null,null,null,null,null,null,null,null,null,null,null,"",""]
[null,null,null,null,null,null,null,null,null,null,null,"",""]
[null,null,null,null,null,null,null,null,null,null,null,"",""]
[null,null,null,null,null,null,null,null,null,null,null,"",""]
[null,null,null,null,null,null,null,null,null,null,null,"",""]
[null,null,null,null,null,null,null,null,null,null,null,"",""]
[null,null,null,null,null,null,null,null,null,null,null,"",""]
[null,null,null,null,null,null,null,null,null,null,null,"",""]
[null,null,null,null,null,null,null,null,null,null,null,"",""]
[null,null,null,null,null,null,null,null,null,null,null,"",""]
[null,null,null,null,null,null,null,null,null,null,null,"",""]
[null,null,null,null,null,null,null,null,null,null,null,"",""]
[null,null,null,null,null,null,null,null,null,null,null,"",""]
[null,null,null,null,null,null,null,null,null,null,null,"",""]
[null,null,null,null,null,null,null,null,null,null,null,"",""]
[null,null,null,null,null,null,null,null,null,null,null,"",""]
[null,null,null,null,null,null,null,null,null,null,null,"",""]
[null,null,null,null,null,null,null,null,null,null,null,"",""]
[null,null,null,null,null,null,null,null,null,null,null,"",""]
[null,null,null,null,null,null,null,null,null,null,null,"",""]
[null,null,null,null,null,null,null,null,null,null,null,"",""]
[null,null,null,null,null,null,null,null,null,null,null,"",""]
[null,null,null,null,null,null,null,null,null,null,null,"",""]
[null,null,null,null,null,null,null,null,null,null,null,"",""]
[null,null,null,null,null,null,null,null,null,null,null,"",""]
[null,null,null,null,null,null,null,null,null,null,null,"",""]
[null,null,null,null,null,null,null,null,null,null,null,"",""]
[null,null,null,null,null,null,null,null,null,null,null,"",""]
[null,null,null,null,null,null,null,null,null,null,null,"",""]
[null,null,null,null,null,null,null,null,null,null,null,"",""]
[null,null,null,null,null,null,null,null,null,null,null,"",""]
[null,null,null,null,null,null,null,null,null,null,null,"",""]
[null,null,null,null,null,null,null,null,null,null,null,"",""]
[null,null,null,null,null,null,null,null,null,null,null,"",""]
[null,null,null,null,null,null,null,null,null,null,null,"",""]
[null,null,null,null,null,null,null,null,null,null,null,"",""]
[null,null,null,null,null,null,null,null,null,null,null,"",""]
[null,null,null,null,null,null,null,null,null,null,null,"",""]
[null,null,null,null,null,null,null,null,null,null,null,"",""]
[null,null,null,null,null,null,null,null,null,null,null,"",""]
[null,null,null,null,null,null,null,null,null,null,null,"",""]
[null,null,null,null,null,null,null,null,null,null,null,"",""]
[null,null,null,null,null,null,null,null,null,null,null,"",""]
[null,null,null,null,null,null,null,null,null,null,null,"",""]
[null,null,null,null,null,null,null,null,null,null,null,"",""]
[null,null,null,null,null,null,null,null,null,null,null,"",""]
[null,null,null,null,null,null,null,null,null,null,null,"",""]
[null,null,null,null,null,null,null,null,null,null,null,"",""]
[null,null,null,null,null,null,null,null,null,null,null,"",""]
[null,null,null,null,null,null,null,null,null,null,null,"",""]
[null,null,null,null,null,null,null,null,null,null,null,"",""]
[null,null,null,null,null,null,null,null,null,null,null,"",""]
[null,null,null,null,null,null,null,null,null,null,null,"",""]
[null,null,null,null,null,null,null,null,null,null,null,"",""]
[null,null,null,null,null,null,null,null,null,null,null,"",""]
[null,null,null,null,null,null,null,null,null,null,null,"",""]
[null,null,null,null,null,null,null,null,null,null,null,"",""]
[null,null,null,null,null,null,null,null,null,null,null,"",""]
[null,null,null,null,null,null,null,null,null,null,null,"",""]
[null,null,null,null,null,null,null,null,null,null,null,"",""]
[null,null,null,null,null,null,null,null,null,null,null,"",""]
[null,null,null,null,null,null,null,null,null,null,null,"",""]
[null,null,null,null,null,null,null,null,null,null,null,"",""]
[null,null,null,null,null,null,null,null,null,null,null,"",""]
[null,null,null,null,null,null,null,null,null,null,null,"",""]
[null,null,null,null,null,null,null,null,null,null,null,"",""]
[null,null,null,null,null,null,null,null,null,null,null,"",""]
[null,null,null,null,null,null,null,null,null,null,null,"",""]
[null,null,null,null,null,null,null,null,null,null,null,"",""]
[null,null,null,null,null,null,null,null,null,null,null,"",""]
[null,null,null,null,null,null,null,null,null,null,null,"",""]
[null,null,null,null,null,null,null,null,null,null,null,"",""]
[null,null,null,null,null,null,null,null,null,null,null,"",""]
[null,null,null,null,null,null,null,null,null,null,null,"",""]
[null,null,null,null,null,null,null,null,null,null,null,"",""]
[null,null,null,null,null,null,null,null,null,null,null,"",""]
[null,null,null,null,null,null,null,null,null,null,null,"",""]
[null,null,null,null,null,null,null,null,null,null,null,"",""]
[null,null,null,null,null,null,null,null,null,null,null,"",""]
[null,null,null,null,null,null,null,null,null,null,null,"",""]
[null,null,null,null,null,null,null,null,null,null,null,"",""]
[null,null,null,null,null,null,null,null,null,null,null,"",""]
[null,null,null,null,null,null,null,null,null,null,null,"",""]
[null,null,null,null,null,null,null,null,null,null,null,"",""]
[null,null,null,null,null,null,null,null,null,null,null,"",""]
[null,null,null,null,null,null,null,null,null,null,null,"",""]
[null,null,null,null,null,null,null,null,null,null,null,"",""]
[null,null,null,null,null,null,null,null,null,null,null,"",""]
[null,null,null,null,null,null,null,null,null,null,null,"",""]
[null,null,null,null,null,null,null,null,null,null,null,"",""]
[null,null,null,null,null,null,null,null,null,null,null,"",""]
[null,null,null,null,null,null,null,null,null,null,null,"",""]
[null,null,null,null,null,null,null,null,null,null,null,"",""]
[null,null,null,null,null,null,null,null,null,null,null,"",""]
[null,null,null,null,null,null,null,null,null,null,null,"",""]
[null,null,null,null,null,null,null,null,null,null,null,"",""]
[null,null,null,null,null,null,null,null,null,null,null,"",""]
[null,null,null,null,null,null,null,null,null,null,null,"",""]
[null,null,null,null,null,null,null,null,null,null,null,"",""]
[null,null,null,null,null,null,null,null,null,null,null,"",""]
[null,null,null,null,null,null,null,null,null,null,null,"",""]
[null,null,null,null,null,null,null,null,null,null,null,"",""]
[null,null,null,null,null,null,null,null,null,null,null,"",""]
[null,null,null,null,null,null,null,null,null,null,null,"",""]
[null,null,null,null,null,null,null,null,null,null,null,"",""]
[null,null,null,null,null,null,null,null,null,null,null,"",""]
[null,null,null,null,null,null,null,null,null,null,null,"",""]
[null,null,null,null,null,null,null,null,null,null,null,"",""]
[null,null,null,null,null,null,null,null,null,null,null,"",""]
[null,null,null,null,null,null,null,null,null,null,null,"",""]
[null,null,null,null,null,null,null,null,null,null,null,"",""]
[null,null,null,null,null,null,null,null,null,null,null,"",""]
[null,null,null,null,null,null,null,null,null,null,null,"",""]
[null,null,null,null,null,null,null,null,null,null,null,"",""]
[null,null,null,null,null,null,null,null,null,null,null,"",""]
[null,null,null,null,null,null,null,null,null,null,null,"",""]
[null,null,null,null,null,null,null,null,null,null,null,"",""]
[null,null,null,null,null,null,null,null,null,null,null,"",""]
[null,null,null,null,null,null,null,null,null,null,null,"",""]
[null,null,null,null,null,null,null,null,null,null,null,"",""]
[null,null,null,null,null,null,null,null,null,null,null,"",""]
[null,null,null,null,null,null,null,null,null,null,null,"",""]
[null,null,null,null,null,null,null,null,null,null,null,"",""]
[null,null,null,null,null,null,null,null,null,null,null,"",""]
[null,null,null,null,null,null,null,null,null,null,null,"",""]
[null,null,null,null,null,null,null,null,null,null,null,"",""]
[null,null,null,null,null,null,null,null,null,null,null,"",""]
[null,null,null,null,null,null,null,null,null,null,null,"",""]
[null,null,null,null,null,null,null,null,null,null,null,"",""]
[null,null,null,null,null,null,null,null,null,null,null,"",""]
[null,null,null,null,null,null,null,null,null,null,null,"",""]
[null,null,null,null,null,null,null,null,null,null,null,"",""]
[null,null,null,null,null,null,null,null,null,null,null,"",""]
[null,null,null,null,null,null,null,null,null,null,null,"",""]
[null,null,null,null,null,null,null,null,null,null,null,"",""]
[null,null,null,null,null,null,null,null,null,null,null,"",""]
[null,null,null,null,null,null,null,null,null,null,null,"",""]
[null,null,null,null,null,null,null,null,null,null,null,"",""]
[null,null,null,null,null,null,null,null,null,null,null,"",""]
[null,null,null,null,null,null,null,null,null,null,null,"",""]
[null,null,null,null,null,null,null,null,null,null,null,"",""]
[null,null,null,null,null,null,null,null,null,null,null,"",""]
[null,null,null,null,null,null,null,null,null,null,null,"",""]
[null,null,null,null,null,null,null,null,null,null,null,"",""]
[null,null,null,null,null,null,null,null,null,null,null,"",""]
[null,null,null,null,null,null,null,null,null,null,null,"",""]
[null,null,null,null,null,null,null,null,null,null,null,"",""]
[null,null,null,null,null,null,null,null,null,null,null,"",""]
[null,null,null,null,null,null,null,null,null,null,null,"",""]
[null,null,null,null,null,null,null,null,null,null,null,"",""]
[null,null,null,null,null,null,null,null,null,null,null,"",""]
[null,null,null,null,null,null,null,null,null,null,null,"",""]
[null,null,null,null,null,null,null,null,null,null,null,"",""]
[null,null,null,null,null,null,null,null,null,null,null,"",""]
[null,null,null,null,null,null,null,null,null,null,null,"",""]
[null,null,null,null,null,null,null,null,null,null,null,"",""]
[null,null,null,null,null,null,null,null,null,null,null,"",""]
[null,null,null,null,null,null,null,null,null,null,null,"",""]
[null,null,null,null,null,null,null,null,null,null,null,"",""]
[null,null,null,null,null,null,null,null,null,null,null,"",""]
[null,null,null,null,null,null,null,null,null,null,null,"",""]
[null,null,null,null,null,null,null,null,null,null,null,"",""]
[null,null,null,null,null,null,null,null,null,null,null,"",""]
[null,null,null,null,null,null,null,null,null,null,null,"",""]
[null,null,null,null,null,null,null,null,null,null,null,"",""]
[null,null,null,null,null,null,null,null,null,null,null,"",""]
[null,null,null,null,null,null,null,null,null,null,null,"",""]
[null,null,null,null,null,null,null,null,null,null,null,"",""]
[null,null,null,null,null,null,null,null,null,null,null,"",""]
[null,null,null,null,null,null,null,null,null,null,null,"",""]
[null,null,null,null,null,null,null,null,null,null,null,"",""]
[null,null,null,null,null,null,null,null,null,null,null,"",""]
[null,null,null,null,null,null,null,null,null,null,null,"",""]
[null,null,null,null,null,null,null,null,null,null,null,"",""]
[null,null,null,null,null,null,null,null,null,null,null,"",""]
[null,null,null,null,null,null,null,null,null,null,null,"",""]
[null,null,null,null,null,null,null,null,null,null,null,"",""]
[null,null,null,null,null,null,null,null,null,null,null,"",""]
[null,null,null,null,null,null,null,null,null,null,null,"",""]
[null,null,null,null,null,null,null,null,null,null,null,"",""]
[null,null,null,null,null,null,null,null,null,null,null,"",""]
[null,null,null,null,null,null,null,null,null,null,null,"",""]
[null,null,null,null,null,null,null,null,null,null,null,"",""]
[null,null,null,null,null,null,null,null,null,null,null,"",""]
[null,null,null,null,null,null,null,null,null,null,null,"",""]
[null,null,null,null,null,null,null,null,null,null,null,"",""]
[null,null,null,null,null,null,null,null,null,null,null,"",""]
[null,null,null,null,null,null,null,null,null,null,null,"",""]
[null,null,null,null,null,null,null,null,null,null,null,"",""]
[null,null,null,null,null,null,null,null,null,null,null,"",""]
[null,null,null,null,null,null,null,null,null,null,null,"",""]
[null,null,null,null,null,null,null,null,null,null,null,"",""]
[null,null,null,null,null,null,null,null,null,null,null,"",""]
[null,null,null,null,null,null,null,null,null,null,null,"",""]
[null,null,null,null,null,null,null,null,null,null,null,"",""]
[null,null,null,null,null,null,null,null,null,null,null,"",""]
[null,null,null,null,null,null,null,null,null,null,null,"",""]
[null,null,null,null,null,null,null,null,null,null,null,"",""]
[null,null,null,null,null,null,null,null,null,null,null,"",""]
[null,null,null,null,null,null,null,null,null,null,null,"",""]
[null,null,null,null,null,null,null,null,null,null,null,"",""]
[null,null,null,null,null,null,null,null,null,null,null,"",""]
[null,null,null,null,null,null,null,null,null,null,null,"",""]
[null,null,null,null,null,null,null,null,null,null,null,"",""]
[null,null,null,null,null,null,null,null,null,null,null,"",""]
[null,null,null,null,null,null,null,null,null,null,null,"",""]
[null,null,null,null,null,null,null,null,null,null,null,"",""]
[null,null,null,null,null,null,null,null,null,null,null,"",""]
[null,null,null,null,null,null,null,null,null,null,null,"",""]
[null,null,null,null,null,null,null,null,null,null,null,"",""]
[null,null,null,null,null,null,null,null,null,null,null,"",""]
[null,null,null,null,null,null,null,null,null,null,null,"",""]
[null,null,null,null,null,null,null,null,null,null,null,"",""]
[null,null,null,null,null,null,null,null,null,null,null,"",""]
[null,null,null,null,null,null,null,null,null,null,null,"",""]
[null,null,null,null,null,null,null,null,null,null,null,"",""]
[null,null,null,null,null,null,null,null,null,null,null,"",""]
[null,null,null,null,null,null,null,null,null,null,null,"",""]
[null,null,null,null,null,null,null,null,null,null,null,"",""]
[null,null,null,null,null,null,null,null,null,null,null,"",""]
[null,null,null,null,null,null,null,null,null,null,null,"",""]
[null,null,null,null,null,null,null,null,null,null,null,"",""]
[null,null,null,null,null,null,null,null,null,null,null,"",""]
[null,null,null,null,null,null,null,null,null,null,null,"",""]
[null,null,null,null,null,null,null,null,null,null,null,"",""]
[null,null,null,null,null,null,null,null,null,null,null,"",""]
[null,null,null,null,null,null,null,null,null,null,null,"",""]
[null,null,null,null,null,null,null,null,null,null,null,"",""]
[null,null,null,null,null,null,null,null,null,null,null,"",""]
[null,null,null,null,null,null,null,null,null,null,null,"",""]
[null,null,null,null,null,null,null,null,null,null,null,"",""]
[null,null,null,null,null,null,null,null,null,null,null,"",""]
[null,null,null,null,null,null,null,null,null,null,null,"",""]
[null,null,null,null,null,null,null,null,null,null,null,"",""]
[null,null,null,null,null,null,null,null,null,null,null,"",""]
[null,null,null,null,null,null,null,null,null,null,null,"",""]
[null,null,null,null,null,null,null,null,null,null,null,"",""]
[null,null,null,null,null,null,null,null,null,null,null,"",""]
[null,null,null,null,null,null,null,null,null,null,null,"",""]
[null,null,null,null,null,null,null,null,null,null,null,"",""]
[null,null,null,null,null,null,null,null,null,null,null,"",""]
[null,null,null,null,null,null,null,null,null,null,null,"",""]
[null,null,null,null,null,null,null,null,null,null,null,"",""]
[null,null,null,null,null,null,null,null,null,null,null,"",""]
[null,null,null,null,null,null,null,null,null,null,null,"",""]
[null,null,null,null,null,null,null,null,null,null,null,"",""]
[null,null,null,null,null,null,null,null,null,null,null,"",""]
[null,null,null,null,null,null,null,null,null,null,null,"",""]
[null,null,null,null,null,null,null,null,null,null,null,"",""]
[null,null,null,null,null,null,null,null,null,null,null,"",""]
[null,null,null,null,null,null,null,null,null,null,null,"",""]
[null,null,null,null,null,null,null,null,null,null,null,"",""]
[null,null,null,null,null,null,null,null,null,null,null,"",""]
[null,null,null,null,null,null,null,null,null,null,null,"",""]
[null,null,null,null,null,null,null,null,null,null,null,"",""]
[null,null,null,null,null,null,null,null,null,null,null,"",""]
[null,null,null,null,null,null,null,null,null,null,null,"",""]
[null,null,null,null,null,null,null,null,null,null,null,"",""]
[null,null,null,null,null,null,null,null,null,null,null,"",""]
[null,null,null,null,null,null,null,null,null,null,null,"",""]
[null,null,null,null,null,null,null,null,null,null,null,"",""]
[null,null,null,null,null,null,null,null,null,null,null,"",""]
[null,null,null,null,null,null,null,null,null,null,null,"",""]
[null,null,null,null,null,null,null,null,null,null,null,"",""]
[null,null,null,null,null,null,null,null,null,null,null,"",""]
[null,null,null,null,null,null,null,null,null,null,null,"",""]
[null,null,null,null,null,null,null,null,null,null,null,"",""]
[null,null,null,null,null,null,null,null,null,null,null,"",""]
[null,null,null,null,null,null,null,null,null,null,null,"",""]
[null,null,null,null,null,null,null,null,null,null,null,"",""]
[null,null,null,null,null,null,null,null,null,null,null,"",""]
[null,null,null,null,null,null,null,null,null,null,null,"",""]
[null,null,null,null,null,null,null,null,null,null,null,"",""]
[null,null,null,null,null,null,null,null,null,null,null,"",""]
[null,null,null,null,null,null,null,null,null,null,null,"",""]
[null,null,null,null,null,null,null,null,null,null,null,"",""]
[null,null,null,null,null,null,null,null,null,null,null,"",""]
[null,null,null,null,null,null,null,null,null,null,null,"",""]
[null,null,null,null,null,null,null,null,null,null,null,"",""]
[null,null,null,null,null,null,null,null,null,null,null,"",""]
[null,null,null,null,null,null,null,null,null,null,null,"",""]
[null,null,null,null,null,null,null,null,null,null,null,"",""]
[null,null,null,null,null,null,null,null,null,null,null,"",""]
[null,null,null,null,null,null,null,null,null,null,null,"",""]
[null,null,null,null,null,null,null,null,null,null,null,"",""]
[null,null,null,null,null,null,null,null,null,null,null,"",""]
[null,null,null,null,null,null,null,null,null,null,null,"",""]
[null,null,null,null,null,null,null,null,null,null,null,"",""]
[null,null,null,null,null,null,null,null,null,null,null,"",""]
[null,null,null,null,null,null,null,null,null,null,null,"",""]
[null,null,null,null,null,null,null,null,null,null,null,"",""]
[null,null,null,null,null,null,null,null,null,null,null,"",""]
[null,null,null,null,null,null,null,null,null,null,null,"",""]
[null,null,null,null,null,null,null,null,null,null,null,"",""]
[null,null,null,null,null,null,null,null,null,null,null,"",""]
[null,null,null,null,null,null,null,null,null,null,null,"",""]
[null,null,null,null,null,null,null,null,null,null,null,"",""]
[null,null,null,null,null,null,null,null,null,null,null,"",""]
[null,null,null,null,null,null,null,null,null,null,null,"",""]
[null,null,null,null,null,null,null,null,null,null,null,"",""]
[null,null,null,null,null,null,null,null,null,null,null,"",""]
[null,null,null,null,null,null,null,null,null,null,null,"",""]
[null,null,null,null,null,null,null,null,null,null,null,"",""]
[null,null,null,null,null,null,null,null,null,null,null,"",""]
[null,null,null,null,null,null,null,null,null,null,null,"",""]
[null,null,null,null,null,null,null,null,null,null,null,"",""]
[null,null,null,null,null,null,null,null,null,null,null,"",""]
[null,null,null,null,null,null,null,null,null,null,null,"",""]
[null,null,null,null,null,null,null,null,null,null,null,"",""]
[null,null,null,null,null,null,null,null,null,null,null,"",""]
[null,null,null,null,null,null,null,null,null,null,null,"",""]
[null,null,null,null,null,null,null,null,null,null,null,"",""]
[null,null,null,null,null,null,null,null,null,null,null,"",""]
[null,null,null,null,null,null,null,null,null,null,null,"",""]
[null,null,null,null,null,null,null,null,null,null,null,"",""]
[null,null,null,null,null,null,null,null,null,null,null,"",""]
[null,null,null,null,null,null,null,null,null,null,null,"",""]
[null,null,null,null,null,null,null,null,null,null,null,"",""]
[null,null,null,null,null,null,null,null,null,null,null,"",""]
[null,null,null,null,null,null,null,null,null,null,null,"",""]
[null,null,null,null,null,null,null,null,null,null,null,"",""]
[null,null,null,null,null,null,null,null,null,null,null,"",""]
[null,null,null,null,null,null,null,null,null,null,null,"",""]
[null,null,null,null,null,null,null,null,null,null,null,"",""]
[null,null,null,null,null,null,null,null,null,null,null,"",""]
[null,null,null,null,null,null,null,null,null,null,null,"",""]
[null,null,null,null,null,null,null,null,null,null,null,"",""]
[null,null,null,null,null,null,null,null,null,null,null,"",""]
[null,null,null,null,null,null,null,null,null,null,null,"",""]
[null,null,null,null,null,null,null,null,null,null,null,"",""]
[null,null,null,null,null,null,null,null,null,null,null,"",""]
[null,null,null,null,null,null,null,null,null,null,null,"",""]
[null,null,null,null,null,null,null,null,null,null,null,"",""]
[null,null,null,null,null,null,null,null,null,null,null,"",""]
[null,null,null,null,null,null,null,null,null,null,null,"",""]
[null,null,null,null,null,null,null,null,null,null,null,"",""]
[null,null,null,null,null,null,null,null,null,null,null,"",""]
[null,null,null,null,null,null,null,null,null,null,null,"",""]
[null,null,null,null,null,null,null,null,null,null,null,"",""]
[null,null,null,null,null,null,null,null,null,null,null,"",""]
[null,null,null,null,null,null,null,null,null,null,null,"",""]
[null,null,null,null,null,null,null,null,null,null,null,"",""]
[null,null,null,null,null,null,null,null,null,null,null,"",""]
[null,null,null,null,null,null,null,null,null,null,null,"",""]
[null,null,null,null,null,null,null,null,null,null,null,"",""]
[null,null,null,null,null,null,null,null,null,null,null,"",""]
[null,null,null,null,null,null,null,null,null,null,null,"",""]
[null,null,null,null,null,null,null,null,null,null,null,"",""]
[null,null,null,null,null,null,null,null,null,null,null,"",""]
[null,null,null,null,null,null,null,null,null,null,null,"",""]
[null,null,null,null,null,null,null,null,null,null,null,"",""]
[null,null,null,null,null,null,null,null,null,null,null,"",""]
[null,null,null,null,null,null,null,null,null,null,null,"",""]
[null,null,null,null,null,null,null,null,null,null,null,"",""]
[null,null,null,null,null,null,null,null,null,null,null,"",""]
[null,null,null,null,null,null,null,null,null,null,null,"",""]
[null,null,null,null,null,null,null,null,null,null,null,"",""]
[null,null,null,null,null,null,null,null,null,null,null,"",""]
[null,null,null,null,null,null,null,null,null,null,null,"",""]
[null,null,null,null,null,null,null,null,null,null,null,"",""]
[null,null,null,null,null,null,null,null,null,null,null,"",""]
[null,null,null,null,null,null,null,null,null,null,null,"",""]
[null,null,null,null,null,null,null,null,null,null,null,"",""]
[null,null,null,null,null,null,null,null,null,null,null,"",""]
[null,null,null,null,null,null,null,null,null,null,null,"",""]
[null,null,null,null,null,null,null,null,null,null,null,"",""]
[null,null,null,null,null,null,null,null,null,null,null,"",""]
[null,null,null,null,null,null,null,null,null,null,null,"",""]
[null,null,null,null,null,null,null,null,null,null,null,"",""]
[null,null,null,null,null,null,null,null,null,null,null,"",""]
[null,null,null,null,null,null,null,null,null,null,null,"",""]
[null,null,null,null,null,null,null,null,null,null,null,"",""]
[null,null,null,null,null,null,null,null,null,null,null,"",""]
[null,null,null,null,null,null,null,null,null,null,null,"",""]
[null,null,null,null,null,null,null,null,null,null,null,"",""]
[null,null,null,null,null,null,null,null,null,null,null,"",""]
[null,null,null,null,null,null,null,null,null,null,null,"",""]
[null,null,null,null,null,null,null,null,null,null,null,"",""]
[null,null,null,null,null,null,null,null,null,null,null,"",""]
[null,null,null,null,null,null,null,null,null,null,null,"",""]
[null,null,null,null,null,null,null,null,null,null,null,"",""]
[null,null,null,null,null,null,null,null,null,null,null,"",""]
[null,null,null,null,null,null,null,null,null,null,null,"",""]
[null,null,null,null,null,null,null,null,null,null,null,"",""]
[null,null,null,null,null,null,null,null,null,null,null,"",""]
[null,null,null,null,null,null,null,null,null,null,null,"",""]
[null,null,null,null,null,null,null,null,null,null,null,"",""]
[null,null,null,null,null,null,null,null,null,null,null,"",""]
[null,null,null,null,null,null,null,null,null,null,null,"",""]
[null,null,null,null,null,null,null,null,null,null,null,"",""]
[null,null,null,null,null,null,null,null,null,null,null,"",""]
[null,null,null,null,null,null,null,null,null,null,null,"",""]
[null,null,null,null,null,null,null,null,null,null,null,"",""]
[null,null,null,null,null,null,null,null,null,null,null,"",""]
[null,null,null,null,null,null,null,null,null,null,null,"",""]
[null,null,null,null,null,null,null,null,null,null,null,"",""]
[null,null,null,null,null,null,null,null,null,null,null,"",""]
[null,null,null,null,null,null,null,null,null,null,null,"",""]
[null,null,null,null,null,null,null,null,null,null,null,"",""]
[null,null,null,null,null,null,null,null,null,null,null,"",""]
[null,null,null,null,null,null,null,null,null,null,null,"",""]
[null,null,null,null,null,null,null,null,null,null,null,"",""]
[null,null,null,null,null,null,null,null,null,null,null,"",""]
[null,null,null,null,null,null,null,null,null,null,null,"",""]
[null,null,null,null,null,null,null,null,null,null,null,"",""]
[null,null,null,null,null,null,null,null,null,null,null,"",""]
[null,null,null,null,null,null,null,null,null,null,null,"",""]
[null,null,null,null,null,null,null,null,null,null,null,"",""]
[null,null,null,null,null,null,null,null,null,null,null,"",""]
[null,null,null,null,null,null,null,null,null,null,null,"",""]
[null,null,null,null,null,null,null,null,null,null,null,"",""]
[null,null,null,null,null,null,null,null,null,null,null,"",""]
[null,null,null,null,null,null,null,null,null,null,null,"",""]
[null,null,null,null,null,null,null,null,null,null,null,"",""]
[null,null,null,null,null,null,null,null,null,null,null,"",""]
[null,null,null,null,null,null,null,null,null,null,null,"",""]
[null,null,null,null,null,null,null,null,null,null,null,"",""]
[null,null,null,null,null,null,null,null,null,null,null,"",""]
[null,null,null,null,null,null,null,null,null,null,null,"",""]
[null,null,null,null,null,null,null,null,null,null,null,"",""]
[null,null,null,null,null,null,null,null,null,null,null,"",""]
[null,null,null,null,null,null,null,null,null,null,null,"",""]
[null,null,null,null,null,null,null,null,null,null,null,"",""]
[null,null,null,null,null,null,null,null,null,null,null,"",""]
[null,null,null,null,null,null,null,null,null,null,null,"",""]
[null,null,null,null,null,null,null,null,null,null,null,"",""]
[null,null,null,null,null,null,null,null,null,null,null,"",""]
[null,null,null,null,null,null,null,null,null,null,null,"",""]
[null,null,null,null,null,null,null,null,null,null,null,"",""]
[null,null,null,null,null,null,null,null,null,null,null,"",""]
[null,null,null,null,null,null,null,null,null,null,null,"",""]
[null,null,null,null,null,null,null,null,null,null,null,"",""]
[null,null,null,null,null,null,null,null,null,null,null,"",""]
[null,null,null,null,null,null,null,null,null,null,null,"",""]
[null,null,null,null,null,null,null,null,null,null,null,"",""]
[null,null,null,null,null,null,null,null,null,null,null,"",""]
[null,null,null,null,null,null,null,null,null,null,null,"",""]
[null,null,null,null,null,null,null,null,null,null,null,"",""]
[null,null,null,null,null,null,null,null,null,null,null,"",""]
[null,null,null,null,null,null,null,null,null,null,null,"",""]
[null,null,null,null,null,null,null,null,null,null,null,"",""]
[null,null,null,null,null,null,null,null,null,null,null,"",""]
[null,null,null,null,null,null,null,null,null,null,null,"",""]
[null,null,null,null,null,null,null,null,null,null,null,"",""]
[null,null,null,null,null,null,null,null,null,null,null,"",""]
[null,null,null,null,null,null,null,null,null,null,null,"",""]
[null,null,null,null,null,null,null,null,null,null,null,"",""]
[null,null,null,null,null,null,null,null,null,null,null,"",""]
[null,null,null,null,null,null,null,null,null,null,null,"",""]
[null,null,null,null,null,null,null,null,null,null,null,"",""]
[null,null,null,null,null,null,null,null,null,null,null,"",""]
[null,null,null,null,null,null,null,null,null,null,null,"",""]
[null,null,null,null,null,null,null,null,null,null,null,"",""]
[null,null,null,null,null,null,null,null,null,null,null,"",""]
[null,null,null,null,null,null,null,null,null,null,null,"",""]
[null,null,null,null,null,null,null,null,null,null,null,"",""]
[null,null,null,null,null,null,null,null,null,null,null,"",""]
[null,null,null,null,null,null,null,null,null,null,null,"",""]
[null,null,null,null,null,null,null,null,null,null,null,"",""]
[null,null,null,null,null,null,null,null,null,null,null,"",""]
[null,null,null,null,null,null,null,null,null,null,null,"",""]
[null,null,null,null,null,null,null,null,null,null,null,"",""]
[null,null,null,null,null,null,null,null,null,null,null,"",""]
[null,null,null,null,null,null,null,null,null,null,null,"",""]
[null,null,null,null,null,null,null,null,null,null,null,"",""]
[null,null,null,null,null,null,null,null,null,null,null,"",""]
[null,null,null,null,null,null,null,null,null,null,null,"",""]
[null,null,null,null,null,null,null,null,null,null,null,"",""]
[null,null,null,null,null,null,null,null,null,null,null,"",""]
[null,null,null,null,null,null,null,null,null,null,null,"",""]
[null,null,null,null,null,null,null,null,null,null,null,"",""]
[null,null,null,null,null,null,null,null,null,null,null,"",""]
[null,null,null,null,null,null,null,null,null,null,null,"",""]
[null,null,null,null,null,null,null,null,null,null,null,"",""]
[null,null,null,null,null,null,null,null,null,null,null,"",""]
[null,null,null,null,null,null,null,null,null,null,null,"",""]
[null,null,null,null,null,null,null,null,null,null,null,"",""]
[null,null,null,null,null,null,null,null,null,null,null,"",""]
[null,null,null,null,null,null,null,null,null,null,null,"",""]
[null,null,null,null,null,null,null,null,null,null,null,"",""]
[null,null,null,null,null,null,null,null,null,null,null,"",""]
[null,null,null,null,null,null,null,null,null,null,null,"",""]
[null,null,null,null,null,null,null,null,null,null,null,"",""]
[null,null,null,null,null,null,null,null,null,null,null,"",""]
[null,null,null,null,null,null,null,null,null,null,null,"",""]
[null,null,null,null,null,null,null,null,null,null,null,"",""]
[null,null,null,null,null,null,null,null,null,null,null,"",""]
[null,null,null,null,null,null,null,null,null,null,null,"",""]
[null,null,null,null,null,null,null,null,null,null,null,"",""]
[null,null,null,null,null,null,null,null,null,null,null,"",""]
[null,null,null,null,null,null,null,null,null,null,null,"",""]
[null,null,null,null,null,null,null,null,null,null,null,"",""]
[null,null,null,null,null,null,null,null,null,null,null,"",""]
[null,null,null,null,null,null,null,null,null,null,null,"",""]
[null,null,null,null,null,null,null,null,null,null,null,"",""]
[null,null,null,null,null,null,null,null,null,null,null,"",""]
[null,null,null,null,null,null,null,null,null,null,null,"",""]
[null,null,null,null,null,null,null,null,null,null,null,"",""]
[null,null,null,null,null,null,null,null,null,null,null,"",""]
[null,null,null,null,null,null,null,null,null,null,null,"",""]
[null,null,null,null,null,null,null,null,null,null,null,"",""]
[null,null,null,null,null,null,null,null,null,null,null,"",""]
[null,null,null,null,null,null,null,null,null,null,null,"",""]
[null,null,null,null,null,null,null,null,null,null,null,"",""]
[null,null,null,null,null,null,null,null,null,null,null,"",""]
[null,null,null,null,null,null,null,null,null,null,null,"",""]
[null,null,null,null,null,null,null,null,null,null,null,"",""]
[null,null,null,null,null,null,null,null,null,null,null,"",""]
[null,null,null,null,null,null,null,null,null,null,null,"",""]
[null,null,null,null,null,null,null,null,null,null,null,"",""]
[null,null,null,null,null,null,null,null,null,null,null,"",""]
[null,null,null,null,null,null,null,null,null,null,null,"",""]
[null,null,null,null,null,null,null,null,null,null,null,"",""]
[null,null,null,null,null,null,null,null,null,null,null,"",""]
[null,null,null,null,null,null,null,null,null,null,null,"",""]
[null,null,null,null,null,null,null,null,null,null,null,"",""]
[null,null,null,null,null,null,null,null,null,null,null,"",""]
[null,null,null,null,null,null,null,null,null,null,null,"",""]
[null,null,null,null,null,null,null,null,null,null,null,"",""]
[null,null,null,null,null,null,null,null,null,null,null,"",""]
[null,null,null,null,null,null,null,null,null,null,null,"",""]
[null,null,null,null,null,null,null,null,null,null,null,"",""]
[null,null,null,null,null,null,null,null,null,null,null,"",""]
[null,null,null,null,null,null,null,null,null,null,null,"",""]
[null,null,null,null,null,null,null,null,null,null,null,"",""]
[null,null,null,null,null,null,null,null,null,null,null,"",""]
[null,null,null,null,null,null,null,null,null,null,null,"",""]
[null,null,null,null,null,null,null,null,null,null,null,"",""]
[null,null,null,null,null,null,null,null,null,null,null,"",""]
[null,null,null,null,null,null,null,null,null,null,null,"",""]
[null,null,null,null,null,null,null,null,null,null,null,"",""]
[null,null,null,null,null,null,null,null,null,null,null,"",""]
[null,null,null,null,null,null,null,null,null,null,null,"",""]
[null,null,null,null,null,null,null,null,null,null,null,"",""]
[null,null,null,null,null,null,null,null,null,null,null,"",""]
[null,null,null,null,null,null,null,null,null,null,null,"",""]
[null,null,null,null,null,null,null,null,null,null,null,"",""]
[null,null,null,null,null,null,null,null,null,null,null,"",""]
[null,null,null,null,null,null,null,null,null,null,null,"",""]
[null,null,null,null,null,null,null,null,null,null,null,"",""]
[null,null,null,null,null,null,null,null,null,null,null,"",""]
[null,null,null,null,null,null,null,null,null,null,null,"",""]
[null,null,null,null,null,null,null,null,null,null,null,"",""]
[null,null,null,null,null,null,null,null,null,null,null,"",""]
[null,null,null,null,null,null,null,null,null,null,null,"",""]
[null,null,null,null,null,null,null,null,null,null,null,"",""]
[null,null,null,null,null,null,null,null,null,null,null,"",""]
[null,null,null,null,null,null,null,null,null,null,null,"",""]
[null,null,null,null,null,null,null,null,null,null,null,"",""]
[null,null,null,null,null,null,null,null,null,null,null,"",""]
[null,null,null,null,null,null,null,null,null,null,null,"",""]
[null,null,null,null,null,null,null,null,null,null,null,"",""]
[null,null,null,null,null,null,null,null,null,null,null,"",""]
[null,null,null,null,null,null,null,null,null,null,null,"",""]
[null,null,null,null,null,null,null,null,null,null,null,"",""]
[null,null,null,null,null,null,null,null,null,null,null,"",""]
[null,null,null,null,null,null,null,null,null,null,null,"",""]
[null,null,null,null,null,null,null,null,null,null,null,"",""]
[null,null,null,null,null,null,null,null,null,null,null,"",""]
[null,null,null,null,null,null,null,null,null,null,null,"",""]
[null,null,null,null,null,null,null,null,null,null,null,"",""]
[null,null,null,null,null,null,null,null,null,null,null,"",""]
[null,null,null,null,null,null,null,null,null,null,null,"",""]
[null,null,null,null,null,null,null,null,null,null,null,"",""]
[null,null,null,null,null,null,null,null,null,null,null,"",""]
[null,null,null,null,null,null,null,null,null,null,null,"",""]
[null,null,null,null,null,null,null,null,null,null,null,"",""]
[null,null,null,null,null,null,null,null,null,null,null,"",""]
[null,null,null,null,null,null,null,null,null,null,null,"",""]
[null,null,null,null,null,null,null,null,null,null,null,"",""]
[null,null,null,null,null,null,null,null,null,null,null,"",""]
[null,null,null,null,null,null,null,null,null,null,null,"",""]
[null,null,null,null,null,null,null,null,null,null,null,"",""]
[null,null,null,null,null,null,null,null,null,null,null,"",""]
[null,null,null,null,null,null,null,null,null,null,null,"",""]
[null,null,null,null,null,null,null,null,null,null,null,"",""]
[null,null,null,null,null,null,null,null,null,null,null,"",""]
[null,null,null,null,null,null,null,null,null,null,null,"",""]
[null,null,null,null,null,null,null,null,null,null,null,"",""]
[null,null,null,null,null,null,null,null,null,null,null,"",""]
[null,null,null,null,null,null,null,null,null,null,null,"",""]
[null,null,null,null,null,null,null,null,null,null,null,"",""]
[null,null,null,null,null,null,null,null,null,null,null,"",""]
[null,null,null,null,null,null,null,null,null,null,null,"",""]
[null,null,null,null,null,null,null,null,null,null,null,"",""]
[null,null,null,null,null,null,null,null,null,null,null,"",""]
[null,null,null,null,null,null,null,null,null,null,null,"",""]
[null,null,null,null,null,null,null,null,null,null,null,"",""]
[null,null,null,null,null,null,null,null,null,null,null,"",""]
[null,null,null,null,null,null,null,null,null,null,null,"",""]
[null,null,null,null,null,null,null,null,null,null,null,"",""]
[null,null,null,null,null,null,null,null,null,null,null,"",""]
[null,null,null,null,null,null,null,null,null,null,null,"",""]
[null,null,null,null,null,null,null,null,null,null,null,"",""]
[null,null,null,null,null,null,null,null,null,null,null,"",""]
[null,null,null,null,null,null,null,null,null,null,null,"",""]
[null,null,null,null,null,null,null,null,null,null,null,"",""]
[null,null,null,null,null,null,null,null,null,null,null,"",""]
[null,null,null,null,null,null,null,null,null,null,null,"",""]
[null,null,null,null,null,null,null,null,null,null,null,"",""]
[null,null,null,null,null,null,null,null,null,null,null,"",""]
[null,null,null,null,null,null,null,null,null,null,null,"",""]
[null,null,null,null,null,null,null,null,null,null,null,"",""]
[null,null,null,null,null,null,null,null,null,null,null,"",""]
[null,null,null,null,null,null,null,null,null,null,null,"",""]
[null,null,null,null,null,null,null,null,null,null,null,"",""]
[null,null,null,null,null,null,null,null,null,null,null,"",""]
[null,null,null,null,null,null,null,null,null,null,null,"",""]
[null,null,null,null,null,null,null,null,null,null,null,"",""]
[null,null,null,null,null,null,null,null,null,null,null,"",""]
[null,null,null,null,null,null,null,null,null,null,null,"",""]
[null,null,null,null,null,null,null,null,null,null,null,"",""]
[null,null,null,null,null,null,null,null,null,null,null,"",""]
[null,null,null,null,null,null,null,null,null,null,null,"",""]
[null,null,null,null,null,null,null,null,null,null,null,"",""]
[null,null,null,null,null,null,null,null,null,null,null,"",""]
[null,null,null,null,null,null,null,null,null,null,null,"",""]
[null,null,null,null,null,null,null,null,null,null,null,"",""]
[null,null,null,null,null,null,null,null,null,null,null,"",""]
[null,null,null,null,null,null,null,null,null,null,null,"",""]
[null,null,null,null,null,null,null,null,null,null,null,"",""]
[null,null,null,null,null,null,null,null,null,null,null,"",""]
[null,null,null,null,null,null,null,null,null,null,null,"",""]
[null,null,null,null,null,null,null,null,null,null,null,"",""]
[null,null,null,null,null,null,null,null,null,null,null,"",""]
[null,null,null,null,null,null,null,null,null,null,null,"",""]
[null,null,null,null,null,null,null,null,null,null,null,"",""]
[null,null,null,null,null,null,null,null,null,null,null,"",""]
[null,null,null,null,null,null,null,null,null,null,null,"",""]
[null,null,null,null,null,null,null,null,null,null,null,"",""]
[null,null,null,null,null,null,null,null,null,null,null,"",""]
[null,null,null,null,null,null,null,null,null,null,null,"",""]
[null,null,null,null,null,null,null,null,null,null,null,"",""]
[null,null,null,null,null,null,null,null,null,null,null,"",""]
[null,null,null,null,null,null,null,null,null,null,null,"",""]
[null,null,null,null,null,null,null,null,null,null,null,"",""]
[null,null,null,null,null,null,null,null,null,null,null,"",""]
[null,null,null,null,null,null,null,null,null,null,null,"",""]
[null,null,null,null,null,null,null,null,null,null,null,"",""]
[null,null,null,null,null,null,null,null,null,null,null,"",""]
[null,null,null,null,null,null,null,null,null,null,null,"",""]
[null,null,null,null,null,null,null,null,null,null,null,"",""]
[null,null,null,null,null,null,null,null,null,null,null,"",""]
[null,null,null,null,null,null,null,null,null,null,null,"",""]
[null,null,null,null,null,null,null,null,null,null,null,"",""]
[null,null,null,null,null,null,null,null,null,null,null,"",""]
[null,null,null,null,null,null,null,null,null,null,null,"",""]
[null,null,null,null,null,null,null,null,null,null,null,"",""]
[null,null,null,null,null,null,null,null,null,null,null,"",""]
[null,null,null,null,null,null,null,null,null,null,null,"",""]
[null,null,null,null,null,null,null,null,null,null,null,"",""]
[null,null,null,null,null,null,null,null,null,null,null,"",""]
[null,null,null,null,null,null,null,null,null,null,null,"",""]
[null,null,null,null,null,null,null,null,null,null,null,"",""]
[null,null,null,null,null,null,null,null,null,null,null,"",""]
[null,null,null,null,null,null,null,null,null,null,null,"",""]
[null,null,null,null,null,null,null,null,null,null,null,"",""]
[null,null,null,null,null,null,null,null,null,null,null,"",""]
[null,null,null,null,null,null,null,null,null,null,null,"",""]
[null,null,null,null,null,null,null,null,null,null,null,"",""]
[null,null,null,null,null,null,null,null,null,null,null,"",""]
[null,null,null,null,null,null,null,null,null,null,null,"",""]
[null,null,null,null,null,null,null,null,null,null,null,"",""]
[null,null,null,null,null,null,null,null,null,null,null,"",""]
[null,null,null,null,null,null,null,null,null,null,null,"",""]
[null,null,null,null,null,null,null,null,null,null,null,"",""]
[null,null,null,null,null,null,null,null,null,null,null,"",""]
[null,null,null,null,null,null,null,null,null,null,null,"",""]
[null,null,null,null,null,null,null,null,null,null,null,"",""]
[null,null,null,null,null,null,null,null,null,null,null,"",""]
[null,null,null,null,null,null,null,null,null,null,null,"",""]
[null,null,null,null,null,null,null,null,null,null,null,"",""]
[null,null,null,null,null,null,null,null,null,null,null,"",""]
[null,null,null,null,null,null,null,null,null,null,null,"",""]
[null,null,null,null,null,null,null,null,null,null,null,"",""]
[null,null,null,null,null,null,null,null,null,null,null,"",""]
[null,null,null,null,null,null,null,null,null,null,null,"",""]
[null,null,null,null,null,null,null,null,null,null,null,"",""]
[null,null,null,null,null,null,null,null,null,null,null,"",""]
[null,null,null,null,null,null,null,null,null,null,null,"",""]
[null,null,null,null,null,null,null,null,null,null,null,"",""]
[null,null,null,null,null,null,null,null,null,null,null,"",""]
[null,null,null,null,null,null,null,null,null,null,null,"",""]
[null,null,null,null,null,null,null,null,null,null,null,"",""]
[null,null,null,null,null,null,null,null,null,null,null,"",""]
[null,null,null,null,null,null,null,null,null,null,null,"",""]
[null,null,null,null,null,null,null,null,null,null,null,"",""]
[null,null,null,null,null,null,null,null,null,null,null,"",""]
[null,null,null,null,null,null,null,null,null,null,null,"",""]
[null,null,null,null,null,null,null,null,null,null,null,"",""]
[null,null,null,null,null,null,null,null,null,null,null,"",""]
[null,null,null,null,null,null,null,null,null,null,null,"",""]
[null,null,null,null,null,null,null,null,null,null,null,"",""]
[null,null,null,null,null,null,null,null,null,null,null,"",""]
[null,null,null,null,null,null,null,null,null,null,null,"",""]
[null,null,null,null,null,null,null,null,null,null,null,"",""]
[null,null,null,null,null,null,null,null,null,null,null,"",""]
[null,null,null,null,null,null,null,null,null,null,null,"",""]
[null,null,null,null,null,null,null,null,null,null,null,"",""]
[null,null,null,null,null,null,null,null,null,null,null,"",""]
[null,null,null,null,null,null,null,null,null,null,null,"",""]
[null,null,null,null,null,null,null,null,null,null,null,"",""]
[null,null,null,null,null,null,null,null,null,null,null,"",""]
[null,null,null,null,null,null,null,null,null,null,null,"",""]
[null,null,null,null,null,null,null,null,null,null,null,"",""]
[null,null,null,null,null,null,null,null,null,null,null,"",""]
[null,null,null,null,null,null,null,null,null,null,null,"",""]
[null,null,null,null,null,null,null,null,null,null,null,"",""]
[null,null,null,null,null,null,null,null,null,null,null,"",""]
[null,null,null,null,null,null,null,null,null,null,null,"",""]
[null,null,null,null,null,null,null,null,null,null,null,"",""]
[null,null,null,null,null,null,null,null,null,null,null,"",""]
[null,null,null,null,null,null,null,null,null,null,null,"",""]
[null,null,null,null,null,null,null,null,null,null,null,"",""]
[null,null,null,null,null,null,null,null,null,null,null,"",""]
[null,null,null,null,null,null,null,null,null,null,null,"",""]
[null,null,null,null,null,null,null,null,null,null,null,"",""]
[null,null,null,null,null,null,null,null,null,null,null,"",""]
[null,null,null,null,null,null,null,null,null,null,null,"",""]
[null,null,null,null,null,null,null,null,null,null,null,"",""]
[null,null,null,null,null,null,null,null,null,null,null,"",""]
[null,null,null,null,null,null,null,null,null,null,null,"",""]
[null,null,null,null,null,null,null,null,null,null,null,"",""]
[null,null,null,null,null,null,null,null,null,null,null,"",""]
[null,null,null,null,null,null,null,null,null,null,null,"",""]
[null,null,null,null,null,null,null,null,null,null,null,"",""]
[null,null,null,null,null,null,null,null,null,null,null,"",""]
[null,null,null,null,null,null,null,null,null,null,null,"",""]
[null,null,null,null,null,null,null,null,null,null,null,"",""]
[null,null,null,null,null,null,null,null,null,null,null,"",""]
[null,null,null,null,null,null,null,null,null,null,null,"",""]
[null,null,null,null,null,null,null,null,null,null,null,"",""]
[null,null,null,null,null,null,null,null,null,null,null,"",""]
[null,null,null,null,null,null,null,null,null,null,null,"",""]
[null,null,null,null,null,null,null,null,null,null,null,"",""]
[null,null,null,null,null,null,null,null,null,null,null,"",""]
[null,null,null,null,null,null,null,null,null,null,null,"",""]
[null,null,null,null,null,null,null,null,null,null,null,"",""]
[null,null,null,null,null,null,null,null,null,null,null,"",""]
[null,null,null,null,null,null,null,null,null,null,null,"",""]
[null,null,null,null,null,null,null,null,null,null,null,"",""]
[null,null,null,null,null,null,null,null,null,null,null,"",""]
[null,null,null,null,null,null,null,null,null,null,null,"",""]
[null,null,null,null,null,null,null,null,null,null,null,"",""]
[null,null,null,null,null,null,null,null,null,null,null,"",""]
[null,null,null,null,null,null,null,null,null,null,null,"",""]
[null,null,null,null,null,null,null,null,null,null,null,"",""]
[null,null,null,null,null,null,null,null,null,null,null,"",""]
[null,null,null,null,null,null,null,null,null,null,null,"",""]
[null,null,null,null,null,null,null,null,null,null,null,"",""]
[null,null,null,null,null,null,null,null,null,null,null,"",""]
[null,null,null,null,null,null,null,null,null,null,null,"",""]
[null,null,null,null,null,null,null,null,null,null,null,"",""]
[null,null,null,null,null,null,null,null,null,null,null,"",""]
[null,null,null,null,null,null,null,null,null,null,null,"",""]
[null,null,null,null,null,null,null,null,null,null,null,"",""]
[null,null,null,null,null,null,null,null,null,null,null,"",""]
[null,null,null,null,null,null,null,null,null,null,null,"",""]
[null,null,null,null,null,null,null,null,null,null,null,"",""]
[null,null,null,null,null,null,null,null,null,null,null,"",""]
[null,null,null,null,null,null,null,null,null,null,null,"",""]
[null,null,null,null,null,null,null,null,null,null,null,"",""]
[null,null,null,null,null,null,null,null,null,null,null,"",""]
[null,null,null,null,null,null,null,null,null,null,null,"",""]
[null,null,null,null,null,null,null,null,null,null,null,"",""]
[null,null,null,null,null,null,null,null,null,null,null,"",""]
[null,null,null,null,null,null,null,null,null,null,null,"",""]
[null,null,null,null,null,null,null,null,null,null,null,"",""]
[null,null,null,null,null,null,null,null,null,null,null,"",""]
[null,null,null,null,null,null,null,null,null,null,null,"",""]
[null,null,null,null,null,null,null,null,null,null,null,"",""]
[null,null,null,null,null,null,null,null,null,null,null,"",""]
[null,null,null,null,null,null,null,null,null,null,null,"",""]
[null,null,null,null,null,null,null,null,null,null,null,"",""]
[null,null,null,null,null,null,null,null,null,null,null,"",""]
[null,null,null,null,null,null,null,null,null,null,null,"",""]
[null,null,null,null,null,null,null,null,null,null,null,"",""]
[null,null,null,null,null,null,null,null,null,null,null,"",""]
[null,null,null,null,null,null,null,null,null,null,null,"",""]
[null,null,null,null,null,null,null,null,null,null,null,"",""]
[null,null,null,null,null,null,null,null,null,null,null,"",""]
[null,null,null,null,null,null,null,null,null,null,null,"",""]
[null,null,null,null,null,null,null,null,null,null,null,"",""]
[null,null,null,null,null,null,null,null,null,null,null,"",""]
[null,null,null,null,null,null,null,null,null,null,null,"",""]
[null,null,null,null,null,null,null,null,null,null,null,"",""]
[null,null,null,null,null,null,null,null,null,null,null,"",""]
[null,null,null,null,null,null,null,null,null,null,null,"",""]
[null,null,null,null,null,null,null,null,null,null,null,"",""]
[null,null,null,null,null,null,null,null,null,null,null,"",""]
[null,null,null,null,null,null,null,null,null,null,null,"",""]
[null,null,null,null,null,null,null,null,null,null,null,"",""]
[null,null,null,null,null,null,null,null,null,null,null,"",""]
[null,null,null,null,null,null,null,null,null,null,null,"",""]
[null,null,null,null,null,null,null,null,null,null,null,"",""]
[null,null,null,null,null,null,null,null,null,null,null,"",""]
[null,null,null,null,null,null,null,null,null,null,null,"",""]
[null,null,null,null,null,null,null,null,null,null,null,"",""]
[null,null,null,null,null,null,null,null,null,null,null,"",""]
[null,null,null,null,null,null,null,null,null,null,null,"",""]
[null,null,null,null,null,null,null,null,null,null,null,"",""]
[null,null,null,null,null,null,null,null,null,null,null,"",""]
[null,null,null,null,null,null,null,null,null,null,null,"",""]
[null,null,null,null,null,null,null,null,null,null,null,"",""]

{"sheet":"Historical_SDMX_Period","index":3,"n_rows":1,"n_cols":1,"rows_kept":1,"cut":false,"hidden":true,"merged":[]}
["TIME"]

{"sheet":"Historical","index":4,"n_rows":1,"n_cols":11,"rows_kept":1,"cut":false,"hidden":true,"merged":[]}
["COUNTRY","QUEST","PRODUCT","DATATYPE","ITEM1","ITEM2","TIME","VALUE","OBSERVATION","CONFIDENTIALITY","KEYREC"]

{"sheet":"Input_ISO","index":5,"n_rows":1,"n_cols":10,"rows_kept":1,"cut":false,"hidden":true,"merged":[]}
["COUNTRY","QUEST","PRODUCT","DATATYPE","ITEM1","ITEM2","TIME","VALUE","OBSERVATION","CONFIDENTIALITY"]

{"sheet":"Input_ISO_Period","index":6,"n_rows":1,"n_cols":1,"rows_kept":1,"cut":false,"hidden":true,"merged":[]}
["ExternalData_3"]

{"sheet":"Input_SDMX","index":7,"n_rows":2810,"n_cols":13,"rows_kept":2810,"cut":false,"hidden":true,"merged":[]}
["REF_AREA","DATAFLOW","PRODUCT","DATATYPE","ITEM1","ITEM2","TIME","VALUE","OBSERVATION","CONFIDENTIALITY","Record"]
[]
[null,null,null,null,null,null,null,null,"",null,null,null,""]
[null,null,null,null,null,null,null,null,"",null,null,null,""]
[null,null,null,null,null,null,null,null,"",null,null,null,""]
[null,null,null,null,null,null,null,null,"",null,null,null,""]
[null,null,null,null,null,null,null,null,"",null,null,null,""]
[null,null,null,null,null,null,null,null,"",null,null,null,""]
[null,null,null,null,null,null,null,null,"",null,null,null,""]
[null,null,null,null,null,null,null,null,"",null,null,null,""]
[null,null,null,null,null,null,null,null,"",null,null,null,""]
[null,null,null,null,null,null,null,null,"",null,null,null,""]
[null,null,null,null,null,null,null,null,"",null,null,null,""]
[null,null,null,null,null,null,null,null,"",null,null,null,""]
[null,null,null,null,null,null,null,null,"",null,null,null,""]
[null,null,null,null,null,null,null,null,"",null,null,null,""]
[null,null,null,null,null,null,null,null,"",null,null,null,""]
[null,null,null,null,null,null,null,null,"",null,null,null,""]
[null,null,null,null,null,null,null,null,"",null,null,null,""]
[null,null,null,null,null,null,null,null,"",null,null,null,""]
[null,null,null,null,null,null,null,null,"",null,null,null,""]
[null,null,null,null,null,null,null,null,"",null,null,null,""]
[null,null,null,null,null,null,null,null,"",null,null,null,""]
[null,null,null,null,null,null,null,null,"",null,null,null,""]
[null,null,null,null,null,null,null,null,"",null,null,null,""]
[null,null,null,null,null,null,null,null,"",null,null,null,""]
[null,null,null,null,null,null,null,null,"",null,null,null,""]
[null,null,null,null,null,null,null,null,"",null,null,null,""]
[null,null,null,null,null,null,null,null,"",null,null,null,""]
[null,null,null,null,null,null,null,null,"",null,null,null,""]
[null,null,null,null,null,null,null,null,"",null,null,null,""]
[null,null,null,null,null,null,null,null,"",null,null,null,""]
[null,null,null,null,null,null,null,null,"",null,null,null,""]
[null,null,null,null,null,null,null,null,"",null,null,null,""]
[null,null,null,null,null,null,null,null,"",null,null,null,""]
[null,null,null,null,null,null,null,null,"",null,null,null,""]
[null,null,null,null,null,null,null,null,"",null,null,null,""]
[null,null,null,null,null,null,null,null,"",null,null,null,""]
[null,null,null,null,null,null,null,null,"",null,null,null,""]
[null,null,null,null,null,null,null,null,"",null,null,null,""]
[null,null,null,null,null,null,null,null,"",null,null,null,""]
[null,null,null,null,null,null,null,null,"",null,null,null,""]
[null,null,null,null,null,null,null,null,"",null,null,null,""]
[null,null,null,null,null,null,null,null,"",null,null,null,""]
[null,null,null,null,null,null,null,null,"",null,null,null,""]
[null,null,null,null,null,null,null,null,"",null,null,null,""]
[null,null,null,null,null,null,null,null,"",null,null,null,""]
[null,null,null,null,null,null,null,null,"",null,null,null,""]
[null,null,null,null,null,null,null,null,"",null,null,null,""]
[null,null,null,null,null,null,null,null,"",null,null,null,""]
[null,null,null,null,null,null,null,null,"",null,null,null,""]
[null,null,null,null,null,null,null,null,"",null,null,null,""]
[null,null,null,null,null,null,null,null,"",null,null,null,""]
[null,null,null,null,null,null,null,null,"",null,null,null,""]
[null,null,null,null,null,null,null,null,"",null,null,null,""]
[null,null,null,null,null,null,null,null,"",null,null,null,""]
[null,null,null,null,null,null,null,null,"",null,null,null,""]
[null,null,null,null,null,null,null,null,"",null,null,null,""]
[null,null,null,null,null,null,null,null,"",null,null,null,""]
[null,null,null,null,null,null,null,null,"",null,null,null,""]
[null,null,null,null,null,null,null,null,"",null,null,null,""]
[null,null,null,null,null,null,null,null,"",null,null,null,""]
[null,null,null,null,null,null,null,null,"",null,null,null,""]
[null,null,null,null,null,null,null,null,"",null,null,null,""]
[null,null,null,null,null,null,null,null,"",null,null,null,""]
[null,null,null,null,null,null,null,null,"",null,null,null,""]
[null,null,null,null,null,null,null,null,"",null,null,null,""]
[null,null,null,null,null,null,null,null,"",null,null,null,""]
[null,null,null,null,null,null,null,null,"",null,null,null,""]
[null,null,null,null,null,null,null,null,"",null,null,null,""]
[null,null,null,null,null,null,null,null,"",null,null,null,""]
[null,null,null,null,null,null,null,null,"",null,null,null,""]
[null,null,null,null,null,null,null,null,"",null,null,null,""]
[null,null,null,null,null,null,null,null,"",null,null,null,""]
[null,null,null,null,null,null,null,null,"",null,null,null,""]
[null,null,null,null,null,null,null,null,"",null,null,null,""]
[null,null,null,null,null,null,null,null,"",null,null,null,""]
[null,null,null,null,null,null,null,null,"",null,null,null,""]
[null,null,null,null,null,null,null,null,"",null,null,null,""]
[null,null,null,null,null,null,null,null,"",null,null,null,""]
[null,null,null,null,null,null,null,null,"",null,null,null,""]
[null,null,null,null,null,null,null,null,"",null,null,null,""]
[null,null,null,null,null,null,null,null,"",null,null,null,""]
[null,null,null,null,null,null,null,null,"",null,null,null,""]
[null,null,null,null,null,null,null,null,"",null,null,null,""]
[null,null,null,null,null,null,null,null,"",null,null,null,""]
[null,null,null,null,null,null,null,null,"",null,null,null,""]
[null,null,null,null,null,null,null,null,"",null,null,null,""]
[null,null,null,null,null,null,null,null,"",null,null,null,""]
[null,null,null,null,null,null,null,null,"",null,null,null,""]
[null,null,null,null,null,null,null,null,"",null,null,null,""]
[null,null,null,null,null,null,null,null,"",null,null,null,""]
[null,null,null,null,null,null,null,null,"",null,null,null,""]
[null,null,null,null,null,null,null,null,"",null,null,null,""]
[null,null,null,null,null,null,null,null,"",null,null,null,""]
[null,null,null,null,null,null,null,null,"",null,null,null,""]
[null,null,null,null,null,null,null,null,"",null,null,null,""]
[null,null,null,null,null,null,null,null,"",null,null,null,""]
[null,null,null,null,null,null,null,null,"",null,null,null,""]
[null,null,null,null,null,null,null,null,"",null,null,null,""]
[null,null,null,null,null,null,null,null,"",null,null,null,""]
[null,null,null,null,null,null,null,null,"",null,null,null,""]
[null,null,null,null,null,null,null,null,"",null,null,null,""]
[null,null,null,null,null,null,null,null,"",null,null,null,""]
[null,null,null,null,null,null,null,null,"",null,null,null,""]
[null,null,null,null,null,null,null,null,"",null,null,null,""]
[null,null,null,null,null,null,null,null,"",null,null,null,""]
[null,null,null,null,null,null,null,null,"",null,null,null,""]
[null,null,null,null,null,null,null,null,"",null,null,null,""]
[null,null,null,null,null,null,null,null,"",null,null,null,""]
[null,null,null,null,null,null,null,null,"",null,null,null,""]
[null,null,null,null,null,null,null,null,"",null,null,null,""]
[null,null,null,null,null,null,null,null,"",null,null,null,""]
[null,null,null,null,null,null,null,null,"",null,null,null,""]
[null,null,null,null,null,null,null,null,"",null,null,null,""]
[null,null,null,null,null,null,null,null,"",null,null,null,""]
[null,null,null,null,null,null,null,null,"",null,null,null,""]
[null,null,null,null,null,null,null,null,"",null,null,null,""]
[null,null,null,null,null,null,null,null,"",null,null,null,""]
[null,null,null,null,null,null,null,null,"",null,null,null,""]
[null,null,null,null,null,null,null,null,"",null,null,null,""]
[null,null,null,null,null,null,null,null,"",null,null,null,""]
[null,null,null,null,null,null,null,null,"",null,null,null,""]
[null,null,null,null,null,null,null,null,"",null,null,null,""]
[null,null,null,null,null,null,null,null,"",null,null,null,""]
[null,null,null,null,null,null,null,null,"",null,null,null,""]
[null,null,null,null,null,null,null,null,"",null,null,null,""]
[null,null,null,null,null,null,null,null,"",null,null,null,""]
[null,null,null,null,null,null,null,null,"",null,null,null,""]
[null,null,null,null,null,null,null,null,"",null,null,null,""]
[null,null,null,null,null,null,null,null,"",null,null,null,""]
[null,null,null,null,null,null,null,null,"",null,null,null,""]
[null,null,null,null,null,null,null,null,"",null,null,null,""]
[null,null,null,null,null,null,null,null,"",null,null,null,""]
[null,null,null,null,null,null,null,null,"",null,null,null,""]
[null,null,null,null,null,null,null,null,"",null,null,null,""]
[null,null,null,null,null,null,null,null,"",null,null,null,""]
[null,null,null,null,null,null,null,null,"",null,null,null,""]
[null,null,null,null,null,null,null,null,"",null,null,null,""]
[null,null,null,null,null,null,null,null,"",null,null,null,""]
[null,null,null,null,null,null,null,null,"",null,null,null,""]
[null,null,null,null,null,null,null,null,"",null,null,null,""]
[null,null,null,null,null,null,null,null,"",null,null,null,""]
[null,null,null,null,null,null,null,null,"",null,null,null,""]
[null,null,null,null,null,null,null,null,"",null,null,null,""]
[null,null,null,null,null,null,null,null,"",null,null,null,""]
[null,null,null,null,null,null,null,null,"",null,null,null,""]
[null,null,null,null,null,null,null,null,"",null,null,null,""]
[null,null,null,null,null,null,null,null,"",null,null,null,""]
[null,null,null,null,null,null,null,null,"",null,null,null,""]
[null,null,null,null,null,null,null,null,"",null,null,null,""]
[null,null,null,null,null,null,null,null,"",null,null,null,""]
[null,null,null,null,null,null,null,null,"",null,null,null,""]
[null,null,null,null,null,null,null,null,"",null,null,null,""]
[null,null,null,null,null,null,null,null,"",null,null,null,""]
[null,null,null,null,null,null,null,null,"",null,null,null,""]
[null,null,null,null,null,null,null,null,"",null,null,null,""]
[null,null,null,null,null,null,null,null,"",null,null,null,""]
[null,null,null,null,null,null,null,null,"",null,null,null,""]
[null,null,null,null,null,null,null,null,"",null,null,null,""]
[null,null,null,null,null,null,null,null,"",null,null,null,""]
[null,null,null,null,null,null,null,null,"",null,null,null,""]
[null,null,null,null,null,null,null,null,"",null,null,null,""]
[null,null,null,null,null,null,null,null,"",null,null,null,""]
[null,null,null,null,null,null,null,null,"",null,null,null,""]
[null,null,null,null,null,null,null,null,"",null,null,null,""]
[null,null,null,null,null,null,null,null,"",null,null,null,""]
[null,null,null,null,null,null,null,null,"",null,null,null,""]
[null,null,null,null,null,null,null,null,"",null,null,null,""]
[null,null,null,null,null,null,null,null,"",null,null,null,""]
[null,null,null,null,null,null,null,null,"",null,null,null,""]
[null,null,null,null,null,null,null,null,"",null,null,null,""]
[null,null,null,null,null,null,null,null,"",null,null,null,""]
[null,null,null,null,null,null,null,null,"",null,null,null,""]
[null,null,null,null,null,null,null,null,"",null,null,null,""]
[null,null,null,null,null,null,null,null,"",null,null,null,""]
[null,null,null,null,null,null,null,null,"",null,null,null,""]
[null,null,null,null,null,null,null,null,"",null,null,null,""]
[null,null,null,null,null,null,null,null,"",null,null,null,""]
[null,null,null,null,null,null,null,null,"",null,null,null,""]
[null,null,null,null,null,null,null,null,"",null,null,null,""]
[null,null,null,null,null,null,null,null,"",null,null,null,""]
[null,null,null,null,null,null,null,null,"",null,null,null,""]
[null,null,null,null,null,null,null,null,"",null,null,null,""]
[null,null,null,null,null,null,null,null,"",null,null,null,""]
[null,null,null,null,null,null,null,null,"",null,null,null,""]
[null,null,null,null,null,null,null,null,"",null,null,null,""]
[null,null,null,null,null,null,null,null,"",null,null,null,""]
[null,null,null,null,null,null,null,null,"",null,null,null,""]
[null,null,null,null,null,null,null,null,"",null,null,null,""]
[null,null,null,null,null,null,null,null,"",null,null,null,""]
[null,null,null,null,null,null,null,null,"",null,null,null,""]
[null,null,null,null,null,null,null,null,"",null,null,null,""]
[null,null,null,null,null,null,null,null,"",null,null,null,""]
[null,null,null,null,null,null,null,null,"",null,null,null,""]
[null,null,null,null,null,null,null,null,"",null,null,null,""]
[null,null,null,null,null,null,null,null,"",null,null,null,""]
[null,null,null,null,null,null,null,null,"",null,null,null,""]
[null,null,null,null,null,null,null,null,"",null,null,null,""]
[null,null,null,null,null,null,null,null,"",null,null,null,""]
[null,null,null,null,null,null,null,null,"",null,null,null,""]
[null,null,null,null,null,null,null,null,"",null,null,null,""]
[null,null,null,null,null,null,null,null,"",null,null,null,""]
[null,null,null,null,null,null,null,null,"",null,null,null,""]
[null,null,null,null,null,null,null,null,"",null,null,null,""]
[null,null,null,null,null,null,null,null,"",null,null,null,""]
[null,null,null,null,null,null,null,null,"",null,null,null,""]
[null,null,null,null,null,null,null,null,"",null,null,null,""]
[null,null,null,null,null,null,null,null,"",null,null,null,""]
[null,null,null,null,null,null,null,null,"",null,null,null,""]
[null,null,null,null,null,null,null,null,"",null,null,null,""]
[null,null,null,null,null,null,null,null,"",null,null,null,""]
[null,null,null,null,null,null,null,null,"",null,null,null,""]
[null,null,null,null,null,null,null,null,"",null,null,null,""]
[null,null,null,null,null,null,null,null,"",null,null,null,""]
[null,null,null,null,null,null,null,null,"",null,null,null,""]
[null,null,null,null,null,null,null,null,"",null,null,null,""]
[null,null,null,null,null,null,null,null,"",null,null,null,""]
[null,null,null,null,null,null,null,null,"",null,null,null,""]
[null,null,null,null,null,null,null,null,"",null,null,null,""]
[null,null,null,null,null,null,null,null,"",null,null,null,""]
[null,null,null,null,null,null,null,null,"",null,null,null,""]
[null,null,null,null,null,null,null,null,"",null,null,null,""]
[null,null,null,null,null,null,null,null,"",null,null,null,""]
[null,null,null,null,null,null,null,null,"",null,null,null,""]
[null,null,null,null,null,null,null,null,"",null,null,null,""]
[null,null,null,null,null,null,null,null,"",null,null,null,""]
[null,null,null,null,null,null,null,null,"",null,null,null,""]
[null,null,null,null,null,null,null,null,"",null,null,null,""]
[null,null,null,null,null,null,null,null,"",null,null,null,""]
[null,null,null,null,null,null,null,null,"",null,null,null,""]
[null,null,null,null,null,null,null,null,"",null,null,null,""]
[null,null,null,null,null,null,null,null,"",null,null,null,""]
[null,null,null,null,null,null,null,null,"",null,null,null,""]
[null,null,null,null,null,null,null,null,"",null,null,null,""]
[null,null,null,null,null,null,null,null,"",null,null,null,""]
[null,null,null,null,null,null,null,null,"",null,null,null,""]
[null,null,null,null,null,null,null,null,"",null,null,null,""]
[null,null,null,null,null,null,null,null,"",null,null,null,""]
[null,null,null,null,null,null,null,null,"",null,null,null,""]
[null,null,null,null,null,null,null,null,"",null,null,null,""]
[null,null,null,null,null,null,null,null,"",null,null,null,""]
[null,null,null,null,null,null,null,null,"",null,null,null,""]
[null,null,null,null,null,null,null,null,"",null,null,null,""]
[null,null,null,null,null,null,null,null,"",null,null,null,""]
[null,null,null,null,null,null,null,null,"",null,null,null,""]
[null,null,null,null,null,null,null,null,"",null,null,null,""]
[null,null,null,null,null,null,null,null,"",null,null,null,""]
[null,null,null,null,null,null,null,null,"",null,null,null,""]
[null,null,null,null,null,null,null,null,"",null,null,null,""]
[null,null,null,null,null,null,null,null,"",null,null,null,""]
[null,null,null,null,null,null,null,null,"",null,null,null,""]
[null,null,null,null,null,null,null,null,"",null,null,null,""]
[null,null,null,null,null,null,null,null,"",null,null,null,""]
[null,null,null,null,null,null,null,null,"",null,null,null,""]
[null,null,null,null,null,null,null,null,"",null,null,null,""]
[null,null,null,null,null,null,null,null,"",null,null,null,""]
[null,null,null,null,null,null,null,null,"",null,null,null,""]
[null,null,null,null,null,null,null,null,"",null,null,null,""]
[null,null,null,null,null,null,null,null,"",null,null,null,""]
[null,null,null,null,null,null,null,null,"",null,null,null,""]
[null,null,null,null,null,null,null,null,"",null,null,null,""]
[null,null,null,null,null,null,null,null,"",null,null,null,""]
[null,null,null,null,null,null,null,null,"",null,null,null,""]
[null,null,null,null,null,null,null,null,"",null,null,null,""]
[null,null,null,null,null,null,null,null,"",null,null,null,""]
[null,null,null,null,null,null,null,null,"",null,null,null,""]
[null,null,null,null,null,null,null,null,"",null,null,null,""]
[null,null,null,null,null,null,null,null,"",null,null,null,""]
[null,null,null,null,null,null,null,null,"",null,null,null,""]
[null,null,null,null,null,null,null,null,"",null,null,null,""]
[null,null,null,null,null,null,null,null,"",null,null,null,""]
[null,null,null,null,null,null,null,null,"",null,null,null,""]
[null,null,null,null,null,null,null,null,"",null,null,null,""]
[null,null,null,null,null,null,null,null,"",null,null,null,""]
[null,null,null,null,null,null,null,null,"",null,null,null,""]
[null,null,null,null,null,null,null,null,"",null,null,null,""]
[null,null,null,null,null,null,null,null,"",null,null,null,""]
[null,null,null,null,null,null,null,null,"",null,null,null,""]
[null,null,null,null,null,null,null,null,"",null,null,null,""]
[null,null,null,null,null,null,null,null,"",null,null,null,""]
[null,null,null,null,null,null,null,null,"",null,null,null,""]
[null,null,null,null,null,null,null,null,"",null,null,null,""]
[null,null,null,null,null,null,null,null,"",null,null,null,""]
[null,null,null,null,null,null,null,null,"",null,null,null,""]
[null,null,null,null,null,null,null,null,"",null,null,null,""]
[null,null,null,null,null,null,null,null,"",null,null,null,""]
[null,null,null,null,null,null,null,null,"",null,null,null,""]
[null,null,null,null,null,null,null,null,"",null,null,null,""]
[null,null,null,null,null,null,null,null,"",null,null,null,""]
[null,null,null,null,null,null,null,null,"",null,null,null,""]
[null,null,null,null,null,null,null,null,"",null,null,null,""]
[null,null,null,null,null,null,null,null,"",null,null,null,""]
[null,null,null,null,null,null,null,null,"",null,null,null,""]
[null,null,null,null,null,null,null,null,"",null,null,null,""]
[null,null,null,null,null,null,null,null,"",null,null,null,""]
[null,null,null,null,null,null,null,null,"",null,null,null,""]
[null,null,null,null,null,null,null,null,"",null,null,null,""]
[null,null,null,null,null,null,null,null,"",null,null,null,""]
[null,null,null,null,null,null,null,null,"",null,null,null,""]
[null,null,null,null,null,null,null,null,"",null,null,null,""]
[null,null,null,null,null,null,null,null,"",null,null,null,""]
[null,null,null,null,null,null,null,null,"",null,null,null,""]
[null,null,null,null,null,null,null,null,"",null,null,null,""]
[null,null,null,null,null,null,null,null,"",null,null,null,""]
[null,null,null,null,null,null,null,null,"",null,null,null,""]
[null,null,null,null,null,null,null,null,"",null,null,null,""]
[null,null,null,null,null,null,null,null,"",null,null,null,""]
[null,null,null,null,null,null,null,null,"",null,null,null,""]
[null,null,null,null,null,null,null,null,"",null,null,null,""]
[null,null,null,null,null,null,null,null,"",null,null,null,""]
[null,null,null,null,null,null,null,null,"",null,null,null,""]
[null,null,null,null,null,null,null,null,"",null,null,null,""]
[null,null,null,null,null,null,null,null,"",null,null,null,""]
[null,null,null,null,null,null,null,null,"",null,null,null,""]
[null,null,null,null,null,null,null,null,"",null,null,null,""]
[null,null,null,null,null,null,null,null,"",null,null,null,""]
[null,null,null,null,null,null,null,null,"",null,null,null,""]
[null,null,null,null,null,null,null,null,"",null,null,null,""]
[null,null,null,null,null,null,null,null,"",null,null,null,""]
[null,null,null,null,null,null,null,null,"",null,null,null,""]
[null,null,null,null,null,null,null,null,"",null,null,null,""]
[null,null,null,null,null,null,null,null,"",null,null,null,""]
[null,null,null,null,null,null,null,null,"",null,null,null,""]
[null,null,null,null,null,null,null,null,"",null,null,null,""]
[null,null,null,null,null,null,null,null,"",null,null,null,""]
[null,null,null,null,null,null,null,null,"",null,null,null,""]
[null,null,null,null,null,null,null,null,"",null,null,null,""]
[null,null,null,null,null,null,null,null,"",null,null,null,""]
[null,null,null,null,null,null,null,null,"",null,null,null,""]
[null,null,null,null,null,null,null,null,"",null,null,null,""]
[null,null,null,null,null,null,null,null,"",null,null,null,""]
[null,null,null,null,null,null,null,null,"",null,null,null,""]
[null,null,null,null,null,null,null,null,"",null,null,null,""]
[null,null,null,null,null,null,null,null,"",null,null,null,""]
[null,null,null,null,null,null,null,null,"",null,null,null,""]
[null,null,null,null,null,null,null,null,"",null,null,null,""]
[null,null,null,null,null,null,null,null,"",null,null,null,""]
[null,null,null,null,null,null,null,null,"",null,null,null,""]
[null,null,null,null,null,null,null,null,"",null,null,null,""]
[null,null,null,null,null,null,null,null,"",null,null,null,""]
[null,null,null,null,null,null,null,null,"",null,null,null,""]
[null,null,null,null,null,null,null,null,"",null,null,null,""]
[null,null,null,null,null,null,null,null,"",null,null,null,""]
[null,null,null,null,null,null,null,null,"",null,null,null,""]
[null,null,null,null,null,null,null,null,"",null,null,null,""]
[null,null,null,null,null,null,null,null,"",null,null,null,""]
[null,null,null,null,null,null,null,null,"",null,null,null,""]
[null,null,null,null,null,null,null,null,"",null,null,null,""]
[null,null,null,null,null,null,null,null,"",null,null,null,""]
[null,null,null,null,null,null,null,null,"",null,null,null,""]
[null,null,null,null,null,null,null,null,"",null,null,null,""]
[null,null,null,null,null,null,null,null,"",null,null,null,""]
[null,null,null,null,null,null,null,null,"",null,null,null,""]
[null,null,null,null,null,null,null,null,"",null,null,null,""]
[null,null,null,null,null,null,null,null,"",null,null,null,""]
[null,null,null,null,null,null,null,null,"",null,null,null,""]
[null,null,null,null,null,null,null,null,"",null,null,null,""]
[null,null,null,null,null,null,null,null,"",null,null,null,""]
[null,null,null,null,null,null,null,null,"",null,null,null,""]
[null,null,null,null,null,null,null,null,"",null,null,null,""]
[null,null,null,null,null,null,null,null,"",null,null,null,""]
[null,null,null,null,null,null,null,null,"",null,null,null,""]
[null,null,null,null,null,null,null,null,"",null,null,null,""]
[null,null,null,null,null,null,null,null,"",null,null,null,""]
[null,null,null,null,null,null,null,null,"",null,null,null,""]
[null,null,null,null,null,null,null,null,"",null,null,null,""]
[null,null,null,null,null,null,null,null,"",null,null,null,""]
[null,null,null,null,null,null,null,null,"",null,null,null,""]
[null,null,null,null,null,null,null,null,"",null,null,null,""]
[null,null,null,null,null,null,null,null,"",null,null,null,""]
[null,null,null,null,null,null,null,null,"",null,null,null,""]
[null,null,null,null,null,null,null,null,"",null,null,null,""]
[null,null,null,null,null,null,null,null,"",null,null,null,""]
[null,null,null,null,null,null,null,null,"",null,null,null,""]
[null,null,null,null,null,null,null,null,"",null,null,null,""]
[null,null,null,null,null,null,null,null,"",null,null,null,""]
[null,null,null,null,null,null,null,null,"",null,null,null,""]
[null,null,null,null,null,null,null,null,"",null,null,null,""]
[null,null,null,null,null,null,null,null,"",null,null,null,""]
[null,null,null,null,null,null,null,null,"",null,null,null,""]
[null,null,null,null,null,null,null,null,"",null,null,null,""]
[null,null,null,null,null,null,null,null,"",null,null,null,""]
[null,null,null,null,null,null,null,null,"",null,null,null,""]
[null,null,null,null,null,null,null,null,"",null,null,null,""]
[null,null,null,null,null,null,null,null,"",null,null,null,""]
[null,null,null,null,null,null,null,null,"",null,null,null,""]
[null,null,null,null,null,null,null,null,"",null,null,null,""]
[null,null,null,null,null,null,null,null,"",null,null,null,""]
[null,null,null,null,null,null,null,null,"",null,null,null,""]
[null,null,null,null,null,null,null,null,"",null,null,null,""]
[null,null,null,null,null,null,null,null,"",null,null,null,""]
[null,null,null,null,null,null,null,null,"",null,null,null,""]
[null,null,null,null,null,null,null,null,"",null,null,null,""]
[null,null,null,null,null,null,null,null,"",null,null,null,""]
[null,null,null,null,null,null,null,null,"",null,null,null,""]
[null,null,null,null,null,null,null,null,"",null,null,null,""]
[null,null,null,null,null,null,null,null,"",null,null,null,""]
[null,null,null,null,null,null,null,null,"",null,null,null,""]
[null,null,null,null,null,null,null,null,"",null,null,null,""]
[null,null,null,null,null,null,null,null,"",null,null,null,""]
[null,null,null,null,null,null,null,null,"",null,null,null,""]
[null,null,null,null,null,null,null,null,"",null,null,null,""]
[null,null,null,null,null,null,null,null,"",null,null,null,""]
[null,null,null,null,null,null,null,null,"",null,null,null,""]
[null,null,null,null,null,null,null,null,"",null,null,null,""]
[null,null,null,null,null,null,null,null,"",null,null,null,""]
[null,null,null,null,null,null,null,null,"",null,null,null,""]
[null,null,null,null,null,null,null,null,"",null,null,null,""]
[null,null,null,null,null,null,null,null,"",null,null,null,""]
[null,null,null,null,null,null,null,null,"",null,null,null,""]
[null,null,null,null,null,null,null,null,"",null,null,null,""]
[null,null,null,null,null,null,null,null,"",null,null,null,""]
[null,null,null,null,null,null,null,null,"",null,null,null,""]
[null,null,null,null,null,null,null,null,"",null,null,null,""]
[null,null,null,null,null,null,null,null,"",null,null,null,""]
[null,null,null,null,null,null,null,null,"",null,null,null,""]
[null,null,null,null,null,null,null,null,"",null,null,null,""]
[null,null,null,null,null,null,null,null,"",null,null,null,""]
[null,null,null,null,null,null,null,null,"",null,null,null,""]
[null,null,null,null,null,null,null,null,"",null,null,null,""]
[null,null,null,null,null,null,null,null,"",null,null,null,""]
[null,null,null,null,null,null,null,null,"",null,null,null,""]
[null,null,null,null,null,null,null,null,"",null,null,null,""]
[null,null,null,null,null,null,null,null,"",null,null,null,""]
[null,null,null,null,null,null,null,null,"",null,null,null,""]
[null,null,null,null,null,null,null,null,"",null,null,null,""]
[null,null,null,null,null,null,null,null,"",null,null,null,""]
[null,null,null,null,null,null,null,null,"",null,null,null,""]
[null,null,null,null,null,null,null,null,"",null,null,null,""]
[null,null,null,null,null,null,null,null,"",null,null,null,""]
[null,null,null,null,null,null,null,null,"",null,null,null,""]
[null,null,null,null,null,null,null,null,"",null,null,null,""]
[null,null,null,null,null,null,null,null,"",null,null,null,""]
[null,null,null,null,null,null,null,null,"",null,null,null,""]
[null,null,null,null,null,null,null,null,"",null,null,null,""]
[null,null,null,null,null,null,null,null,"",null,null,null,""]
[null,null,null,null,null,null,null,null,"",null,null,null,""]
[null,null,null,null,null,null,null,null,"",null,null,null,""]
[null,null,null,null,null,null,null,null,"",null,null,null,""]
[null,null,null,null,null,null,null,null,"",null,null,null,""]
[null,null,null,null,null,null,null,null,"",null,null,null,""]
[null,null,null,null,null,null,null,null,"",null,null,null,""]
[null,null,null,null,null,null,null,null,"",null,null,null,""]
[null,null,null,null,null,null,null,null,"",null,null,null,""]
[null,null,null,null,null,null,null,null,"",null,null,null,""]
[null,null,null,null,null,null,null,null,"",null,null,null,""]
[null,null,null,null,null,null,null,null,"",null,null,null,""]
[null,null,null,null,null,null,null,null,"",null,null,null,""]
[null,null,null,null,null,null,null,null,"",null,null,null,""]
[null,null,null,null,null,null,null,null,"",null,null,null,""]
[null,null,null,null,null,null,null,null,"",null,null,null,""]
[null,null,null,null,null,null,null,null,"",null,null,null,""]
[null,null,null,null,null,null,null,null,"",null,null,null,""]
[null,null,null,null,null,null,null,null,"",null,null,null,""]
[null,null,null,null,null,null,null,null,"",null,null,null,""]
[null,null,null,null,null,null,null,null,"",null,null,null,""]
[null,null,null,null,null,null,null,null,"",null,null,null,""]
[null,null,null,null,null,null,null,null,"",null,null,null,""]
[null,null,null,null,null,null,null,null,"",null,null,null,""]
[null,null,null,null,null,null,null,null,"",null,null,null,""]
[null,null,null,null,null,null,null,null,"",null,null,null,""]
[null,null,null,null,null,null,null,null,"",null,null,null,""]
[null,null,null,null,null,null,null,null,"",null,null,null,""]
[null,null,null,null,null,null,null,null,"",null,null,null,""]
[null,null,null,null,null,null,null,null,"",null,null,null,""]
[null,null,null,null,null,null,null,null,"",null,null,null,""]
[null,null,null,null,null,null,null,null,"",null,null,null,""]
[null,null,null,null,null,null,null,null,"",null,null,null,""]
[null,null,null,null,null,null,null,null,"",null,null,null,""]
[null,null,null,null,null,null,null,null,"",null,null,null,""]
[null,null,null,null,null,null,null,null,"",null,null,null,""]
[null,null,null,null,null,null,null,null,"",null,null,null,""]
[null,null,null,null,null,null,null,null,"",null,null,null,""]
[null,null,null,null,null,null,null,null,"",null,null,null,""]
[null,null,null,null,null,null,null,null,"",null,null,null,""]
[null,null,null,null,null,null,null,null,"",null,null,null,""]
[null,null,null,null,null,null,null,null,"",null,null,null,""]
[null,null,null,null,null,null,null,null,"",null,null,null,""]
[null,null,null,null,null,null,null,null,"",null,null,null,""]
[null,null,null,null,null,null,null,null,"",null,null,null,""]
[null,null,null,null,null,null,null,null,"",null,null,null,""]
[null,null,null,null,null,null,null,null,"",null,null,null,""]
[null,null,null,null,null,null,null,null,"",null,null,null,""]
[null,null,null,null,null,null,null,null,"",null,null,null,""]
[null,null,null,null,null,null,null,null,"",null,null,null,""]
[null,null,null,null,null,null,null,null,"",null,null,null,""]
[null,null,null,null,null,null,null,null,"",null,null,null,""]
[null,null,null,null,null,null,null,null,"",null,null,null,""]
[null,null,null,null,null,null,null,null,"",null,null,null,""]
[null,null,null,null,null,null,null,null,"",null,null,null,""]
[null,null,null,null,null,null,null,null,"",null,null,null,""]
[null,null,null,null,null,null,null,null,"",null,null,null,""]
[null,null,null,null,null,null,null,null,"",null,null,null,""]
[null,null,null,null,null,null,null,null,"",null,null,null,""]
[null,null,null,null,null,null,null,null,"",null,null,null,""]
[null,null,null,null,null,null,null,null,"",null,null,null,""]
[null,null,null,null,null,null,null,null,"",null,null,null,""]
[null,null,null,null,null,null,null,null,"",null,null,null,""]
[null,null,null,null,null,null,null,null,"",null,null,null,""]
[null,null,null,null,null,null,null,null,"",null,null,null,""]
[null,null,null,null,null,null,null,null,"",null,null,null,""]
[null,null,null,null,null,null,null,null,"",null,null,null,""]
[null,null,null,null,null,null,null,null,"",null,null,null,""]
[null,null,null,null,null,null,null,null,"",null,null,null,""]
[null,null,null,null,null,null,null,null,"",null,null,null,""]
[null,null,null,null,null,null,null,null,"",null,null,null,""]
[null,null,null,null,null,null,null,null,"",null,null,null,""]
[null,null,null,null,null,null,null,null,"",null,null,null,""]
[null,null,null,null,null,null,null,null,"",null,null,null,""]
[null,null,null,null,null,null,null,null,"",null,null,null,""]
[null,null,null,null,null,null,null,null,"",null,null,null,""]
[null,null,null,null,null,null,null,null,"",null,null,null,""]
[null,null,null,null,null,null,null,null,"",null,null,null,""]
[null,null,null,null,null,null,null,null,"",null,null,null,""]
[null,null,null,null,null,null,null,null,"",null,null,null,""]
[null,null,null,null,null,null,null,null,"",null,null,null,""]
[null,null,null,null,null,null,null,null,"",null,null,null,""]
[null,null,null,null,null,null,null,null,"",null,null,null,""]
[null,null,null,null,null,null,null,null,"",null,null,null,""]
[null,null,null,null,null,null,null,null,"",null,null,null,""]
[null,null,null,null,null,null,null,null,"",null,null,null,""]
[null,null,null,null,null,null,null,null,"",null,null,null,""]
[null,null,null,null,null,null,null,null,"",null,null,null,""]
[null,null,null,null,null,null,null,null,"",null,null,null,""]
[null,null,null,null,null,null,null,null,"",null,null,null,""]
[null,null,null,null,null,null,null,null,"",null,null,null,""]
[null,null,null,null,null,null,null,null,"",null,null,null,""]
[null,null,null,null,null,null,null,null,"",null,null,null,""]
[null,null,null,null,null,null,null,null,"",null,null,null,""]
[null,null,null,null,null,null,null,null,"",null,null,null,""]
[null,null,null,null,null,null,null,null,"",null,null,null,""]
[null,null,null,null,null,null,null,null,"",null,null,null,""]
[null,null,null,null,null,null,null,null,"",null,null,null,""]
[null,null,null,null,null,null,null,null,"",null,null,null,""]
[null,null,null,null,null,null,null,null,"",null,null,null,""]
[null,null,null,null,null,null,null,null,"",null,null,null,""]
[null,null,null,null,null,null,null,null,"",null,null,null,""]
[null,null,null,null,null,null,null,null,"",null,null,null,""]
[null,null,null,null,null,null,null,null,"",null,null,null,""]
[null,null,null,null,null,null,null,null,"",null,null,null,""]
[null,null,null,null,null,null,null,null,"",null,null,null,""]
[null,null,null,null,null,null,null,null,"",null,null,null,""]
[null,null,null,null,null,null,null,null,"",null,null,null,""]
[null,null,null,null,null,null,null,null,"",null,null,null,""]
[null,null,null,null,null,null,null,null,"",null,null,null,""]
[null,null,null,null,null,null,null,null,"",null,null,null,""]
[null,null,null,null,null,null,null,null,"",null,null,null,""]
[null,null,null,null,null,null,null,null,"",null,null,null,""]
[null,null,null,null,null,null,null,null,"",null,null,null,""]
[null,null,null,null,null,null,null,null,"",null,null,null,""]
[null,null,null,null,null,null,null,null,"",null,null,null,""]
[null,null,null,null,null,null,null,null,"",null,null,null,""]
[null,null,null,null,null,null,null,null,"",null,null,null,""]
[null,null,null,null,null,null,null,null,"",null,null,null,""]
[null,null,null,null,null,null,null,null,"",null,null,null,""]
[null,null,null,null,null,null,null,null,"",null,null,null,""]
[null,null,null,null,null,null,null,null,"",null,null,null,""]
[null,null,null,null,null,null,null,null,"",null,null,null,""]
[null,null,null,null,null,null,null,null,"",null,null,null,""]
[null,null,null,null,null,null,null,null,"",null,null,null,""]
[null,null,null,null,null,null,null,null,"",null,null,null,""]
[null,null,null,null,null,null,null,null,"",null,null,null,""]
[null,null,null,null,null,null,null,null,"",null,null,null,""]
[null,null,null,null,null,null,null,null,"",null,null,null,""]
[null,null,null,null,null,null,null,null,"",null,null,null,""]
[null,null,null,null,null,null,null,null,"",null,null,null,""]
[null,null,null,null,null,null,null,null,"",null,null,null,""]
[null,null,null,null,null,null,null,null,"",null,null,null,""]
[null,null,null,null,null,null,null,null,"",null,null,null,""]
[null,null,null,null,null,null,null,null,"",null,null,null,""]
[null,null,null,null,null,null,null,null,"",null,null,null,""]
[null,null,null,null,null,null,null,null,"",null,null,null,""]
[null,null,null,null,null,null,null,null,"",null,null,null,""]
[null,null,null,null,null,null,null,null,"",null,null,null,""]
[null,null,null,null,null,null,null,null,"",null,null,null,""]
[null,null,null,null,null,null,null,null,"",null,null,null,""]
[null,null,null,null,null,null,null,null,"",null,null,null,""]
[null,null,null,null,null,null,null,null,"",null,null,null,""]
[null,null,null,null,null,null,null,null,"",null,null,null,""]
[null,null,null,null,null,null,null,null,"",null,null,null,""]
[null,null,null,null,null,null,null,null,"",null,null,null,""]
[null,null,null,null,null,null,null,null,"",null,null,null,""]
[null,null,null,null,null,null,null,null,"",null,null,null,""]
[null,null,null,null,null,null,null,null,"",null,null,null,""]
[null,null,null,null,null,null,null,null,"",null,null,null,""]
[null,null,null,null,null,null,null,null,"",null,null,null,""]
[null,null,null,null,null,null,null,null,"",null,null,null,""]
[null,null,null,null,null,null,null,null,"",null,null,null,""]
[null,null,null,null,null,null,null,null,"",null,null,null,""]
[null,null,null,null,null,null,null,null,"",null,null,null,""]
[null,null,null,null,null,null,null,null,"",null,null,null,""]
[null,null,null,null,null,null,null,null,"",null,null,null,""]
[null,null,null,null,null,null,null,null,"",null,null,null,""]
[null,null,null,null,null,null,null,null,"",null,null,null,""]
[null,null,null,null,null,null,null,null,"",null,null,null,""]
[null,null,null,null,null,null,null,null,"",null,null,null,""]
[null,null,null,null,null,null,null,null,"",null,null,null,""]
[null,null,null,null,null,null,null,null,"",null,null,null,""]
[null,null,null,null,null,null,null,null,"",null,null,null,""]
[null,null,null,null,null,null,null,null,"",null,null,null,""]
[null,null,null,null,null,null,null,null,"",null,null,null,""]
[null,null,null,null,null,null,null,null,"",null,null,null,""]
[null,null,null,null,null,null,null,null,"",null,null,null,""]
[null,null,null,null,null,null,null,null,"",null,null,null,""]
[null,null,null,null,null,null,null,null,"",null,null,null,""]
[null,null,null,null,null,null,null,null,"",null,null,null,""]
[null,null,null,null,null,null,null,null,"",null,null,null,""]
[null,null,null,null,null,null,null,null,"",null,null,null,""]
[null,null,null,null,null,null,null,null,"",null,null,null,""]
[null,null,null,null,null,null,null,null,"",null,null,null,""]
[null,null,null,null,null,null,null,null,"",null,null,null,""]
[null,null,null,null,null,null,null,null,"",null,null,null,""]
[null,null,null,null,null,null,null,null,"",null,null,null,""]
[null,null,null,null,null,null,null,null,"",null,null,null,""]
[null,null,null,null,null,null,null,null,"",null,null,null,""]
[null,null,null,null,null,null,null,null,"",null,null,null,""]
[null,null,null,null,null,null,null,null,"",null,null,null,""]
[null,null,null,null,null,null,null,null,"",null,null,null,""]
[null,null,null,null,null,null,null,null,"",null,null,null,""]
[null,null,null,null,null,null,null,null,"",null,null,null,""]
[null,null,null,null,null,null,null,null,"",null,null,null,""]
[null,null,null,null,null,null,null,null,"",null,null,null,""]
[null,null,null,null,null,null,null,null,"",null,null,null,""]
[null,null,null,null,null,null,null,null,"",null,null,null,""]
[null,null,null,null,null,null,null,null,"",null,null,null,""]
[null,null,null,null,null,null,null,null,"",null,null,null,""]
[null,null,null,null,null,null,null,null,"",null,null,null,""]
[null,null,null,null,null,null,null,null,"",null,null,null,""]
[null,null,null,null,null,null,null,null,"",null,null,null,""]
[null,null,null,null,null,null,null,null,"",null,null,null,""]
[null,null,null,null,null,null,null,null,"",null,null,null,""]
[null,null,null,null,null,null,null,null,"",null,null,null,""]
[null,null,null,null,null,null,null,null,"",null,null,null,""]
[null,null,null,null,null,null,null,null,"",null,null,null,""]
[null,null,null,null,null,null,null,null,"",null,null,null,""]
[null,null,null,null,null,null,null,null,"",null,null,null,""]
[null,null,null,null,null,null,null,null,"",null,null,null,""]
[null,null,null,null,null,null,null,null,"",null,null,null,""]
[null,null,null,null,null,null,null,null,"",null,null,null,""]
[null,null,null,null,null,null,null,null,"",null,null,null,""]
[null,null,null,null,null,null,null,null,"",null,null,null,""]
[null,null,null,null,null,null,null,null,"",null,null,null,""]
[null,null,null,null,null,null,null,null,"",null,null,null,""]
[null,null,null,null,null,null,null,null,"",null,null,null,""]
[null,null,null,null,null,null,null,null,"",null,null,null,""]
[null,null,null,null,null,null,null,null,"",null,null,null,""]
[null,null,null,null,null,null,null,null,"",null,null,null,""]
[null,null,null,null,null,null,null,null,"",null,null,null,""]
[null,null,null,null,null,null,null,null,"",null,null,null,""]
[null,null,null,null,null,null,null,null,"",null,null,null,""]
[null,null,null,null,null,null,null,null,"",null,null,null,""]
[null,null,null,null,null,null,null,null,"",null,null,null,""]
[null,null,null,null,null,null,null,null,"",null,null,null,""]
[null,null,null,null,null,null,null,null,"",null,null,null,""]
[null,null,null,null,null,null,null,null,"",null,null,null,""]
[null,null,null,null,null,null,null,null,"",null,null,null,""]
[null,null,null,null,null,null,null,null,"",null,null,null,""]
[null,null,null,null,null,null,null,null,"",null,null,null,""]
[null,null,null,null,null,null,null,null,"",null,null,null,""]
[null,null,null,null,null,null,null,null,"",null,null,null,""]
[null,null,null,null,null,null,null,null,"",null,null,null,""]
[null,null,null,null,null,null,null,null,"",null,null,null,""]
[null,null,null,null,null,null,null,null,"",null,null,null,""]
[null,null,null,null,null,null,null,null,"",null,null,null,""]
[null,null,null,null,null,null,null,null,"",null,null,null,""]
[null,null,null,null,null,null,null,null,"",null,null,null,""]
[null,null,null,null,null,null,null,null,"",null,null,null,""]
[null,null,null,null,null,null,null,null,"",null,null,null,""]
[null,null,null,null,null,null,null,null,"",null,null,null,""]
[null,null,null,null,null,null,null,null,"",null,null,null,""]
[null,null,null,null,null,null,null,null,"",null,null,null,""]
[null,null,null,null,null,null,null,null,"",null,null,null,""]
[null,null,null,null,null,null,null,null,"",null,null,null,""]
[null,null,null,null,null,null,null,null,"",null,null,null,""]
[null,null,null,null,null,null,null,null,"",null,null,null,""]
[null,null,null,null,null,null,null,null,"",null,null,null,""]
[null,null,null,null,null,null,null,null,"",null,null,null,""]
[null,null,null,null,null,null,null,null,"",null,null,null,""]
[null,null,null,null,null,null,null,null,"",null,null,null,""]
[null,null,null,null,null,null,null,null,"",null,null,null,""]
[null,null,null,null,null,null,null,null,"",null,null,null,""]
[null,null,null,null,null,null,null,null,"",null,null,null,""]
[null,null,null,null,null,null,null,null,"",null,null,null,""]
[null,null,null,null,null,null,null,null,"",null,null,null,""]
[null,null,null,null,null,null,null,null,"",null,null,null,""]
[null,null,null,null,null,null,null,null,"",null,null,null,""]
[null,null,null,null,null,null,null,null,"",null,null,null,""]
[null,null,null,null,null,null,null,null,"",null,null,null,""]
[null,null,null,null,null,null,null,null,"",null,null,null,""]
[null,null,null,null,null,null,null,null,"",null,null,null,""]
[null,null,null,null,null,null,null,null,"",null,null,null,""]
[null,null,null,null,null,null,null,null,"",null,null,null,""]
[null,null,null,null,null,null,null,null,"",null,null,null,""]
[null,null,null,null,null,null,null,null,"",null,null,null,""]
[null,null,null,null,null,null,null,null,"",null,null,null,""]
[null,null,null,null,null,null,null,null,"",null,null,null,""]
[null,null,null,null,null,null,null,null,"",null,null,null,""]
[null,null,null,null,null,null,null,null,"",null,null,null,""]
[null,null,null,null,null,null,null,null,"",null,null,null,""]
[null,null,null,null,null,null,null,null,"",null,null,null,""]
[null,null,null,null,null,null,null,null,"",null,null,null,""]
[null,null,null,null,null,null,null,null,"",null,null,null,""]
[null,null,null,null,null,null,null,null,"",null,null,null,""]
[null,null,null,null,null,null,null,null,"",null,null,null,""]
[null,null,null,null,null,null,null,null,"",null,null,null,""]
[null,null,null,null,null,null,null,null,"",null,null,null,""]
[null,null,null,null,null,null,null,null,"",null,null,null,""]
[null,null,null,null,null,null,null,null,"",null,null,null,""]
[null,null,null,null,null,null,null,null,"",null,null,null,""]
[null,null,null,null,null,null,null,null,"",null,null,null,""]
[null,null,null,null,null,null,null,null,"",null,null,null,""]
[null,null,null,null,null,null,null,null,"",null,null,null,""]
[null,null,null,null,null,null,null,null,"",null,null,null,""]
[null,null,null,null,null,null,null,null,"",null,null,null,""]
[null,null,null,null,null,null,null,null,"",null,null,null,""]
[null,null,null,null,null,null,null,null,"",null,null,null,""]
[null,null,null,null,null,null,null,null,"",null,null,null,""]
[null,null,null,null,null,null,null,null,"",null,null,null,""]
[null,null,null,null,null,null,null,null,"",null,null,null,""]
[null,null,null,null,null,null,null,null,"",null,null,null,""]
[null,null,null,null,null,null,null,null,"",null,null,null,""]
[null,null,null,null,null,null,null,null,"",null,null,null,""]
[null,null,null,null,null,null,null,null,"",null,null,null,""]
[null,null,null,null,null,null,null,null,"",null,null,null,""]
[null,null,null,null,null,null,null,null,"",null,null,null,""]
[null,null,null,null,null,null,null,null,"",null,null,null,""]
[null,null,null,null,null,null,null,null,"",null,null,null,""]
[null,null,null,null,null,null,null,null,"",null,null,null,""]
[null,null,null,null,null,null,null,null,"",null,null,null,""]
[null,null,null,null,null,null,null,null,"",null,null,null,""]
[null,null,null,null,null,null,null,null,"",null,null,null,""]
[null,null,null,null,null,null,null,null,"",null,null,null,""]
[null,null,null,null,null,null,null,null,"",null,null,null,""]
[null,null,null,null,null,null,null,null,"",null,null,null,""]
[null,null,null,null,null,null,null,null,"",null,null,null,""]
[null,null,null,null,null,null,null,null,"",null,null,null,""]
[null,null,null,null,null,null,null,null,"",null,null,null,""]
[null,null,null,null,null,null,null,null,"",null,null,null,""]
[null,null,null,null,null,null,null,null,"",null,null,null,""]
[null,null,null,null,null,null,null,null,"",null,null,null,""]
[null,null,null,null,null,null,null,null,"",null,null,null,""]
[null,null,null,null,null,null,null,null,"",null,null,null,""]
[null,null,null,null,null,null,null,null,"",null,null,null,""]
[null,null,null,null,null,null,null,null,"",null,null,null,""]
[null,null,null,null,null,null,null,null,"",null,null,null,""]
[null,null,null,null,null,null,null,null,"",null,null,null,""]
[null,null,null,null,null,null,null,null,"",null,null,null,""]
[null,null,null,null,null,null,null,null,"",null,null,null,""]
[null,null,null,null,null,null,null,null,"",null,null,null,""]
[null,null,null,null,null,null,null,null,"",null,null,null,""]
[null,null,null,null,null,null,null,null,"",null,null,null,""]
[null,null,null,null,null,null,null,null,"",null,null,null,""]
[null,null,null,null,null,null,null,null,"",null,null,null,""]
[null,null,null,null,null,null,null,null,"",null,null,null,""]
[null,null,null,null,null,null,null,null,"",null,null,null,""]
[null,null,null,null,null,null,null,null,"",null,null,null,""]
[null,null,null,null,null,null,null,null,"",null,null,null,""]
[null,null,null,null,null,null,null,null,"",null,null,null,""]
[null,null,null,null,null,null,null,null,"",null,null,null,""]
[null,null,null,null,null,null,null,null,"",null,null,null,""]
[null,null,null,null,null,null,null,null,"",null,null,null,""]
[null,null,null,null,null,null,null,null,"",null,null,null,""]
[null,null,null,null,null,null,null,null,"",null,null,null,""]
[null,null,null,null,null,null,null,null,"",null,null,null,""]
[null,null,null,null,null,null,null,null,"",null,null,null,""]
[null,null,null,null,null,null,null,null,"",null,null,null,""]
[null,null,null,null,null,null,null,null,"",null,null,null,""]
[null,null,null,null,null,null,null,null,"",null,null,null,""]
[null,null,null,null,null,null,null,null,"",null,null,null,""]
[null,null,null,null,null,null,null,null,"",null,null,null,""]
[null,null,null,null,null,null,null,null,"",null,null,null,""]
[null,null,null,null,null,null,null,null,"",null,null,null,""]
[null,null,null,null,null,null,null,null,"",null,null,null,""]
[null,null,null,null,null,null,null,null,"",null,null,null,""]
[null,null,null,null,null,null,null,null,"",null,null,null,""]
[null,null,null,null,null,null,null,null,"",null,null,null,""]
[null,null,null,null,null,null,null,null,"",null,null,null,""]
[null,null,null,null,null,null,null,null,"",null,null,null,""]
[null,null,null,null,null,null,null,null,"",null,null,null,""]
[null,null,null,null,null,null,null,null,"",null,null,null,""]
[null,null,null,null,null,null,null,null,"",null,null,null,""]
[null,null,null,null,null,null,null,null,"",null,null,null,""]
[null,null,null,null,null,null,null,null,"",null,null,null,""]
[null,null,null,null,null,null,null,null,"",null,null,null,""]
[null,null,null,null,null,null,null,null,"",null,null,null,""]
[null,null,null,null,null,null,null,null,"",null,null,null,""]
[null,null,null,null,null,null,null,null,"",null,null,null,""]
[null,null,null,null,null,null,null,null,"",null,null,null,""]
[null,null,null,null,null,null,null,null,"",null,null,null,""]
[null,null,null,null,null,null,null,null,"",null,null,null,""]
[null,null,null,null,null,null,null,null,"",null,null,null,""]
[null,null,null,null,null,null,null,null,"",null,null,null,""]
[null,null,null,null,null,null,null,null,"",null,null,null,""]
[null,null,null,null,null,null,null,null,"",null,null,null,""]
[null,null,null,null,null,null,null,null,"",null,null,null,""]
[null,null,null,null,null,null,null,null,"",null,null,null,""]
[null,null,null,null,null,null,null,null,"",null,null,null,""]
[null,null,null,null,null,null,null,null,"",null,null,null,""]
[null,null,null,null,null,null,null,null,"",null,null,null,""]
[null,null,null,null,null,null,null,null,"",null,null,null,""]
[null,null,null,null,null,null,null,null,"",null,null,null,""]
[null,null,null,null,null,null,null,null,"",null,null,null,""]
[null,null,null,null,null,null,null,null,"",null,null,null,""]
[null,null,null,null,null,null,null,null,"",null,null,null,""]
[null,null,null,null,null,null,null,null,"",null,null,null,""]
[null,null,null,null,null,null,null,null,"",null,null,null,""]
[null,null,null,null,null,null,null,null,"",null,null,null,""]
[null,null,null,null,null,null,null,null,"",null,null,null,""]
[null,null,null,null,null,null,null,null,"",null,null,null,""]
[null,null,null,null,null,null,null,null,"",null,null,null,""]
[null,null,null,null,null,null,null,null,"",null,null,null,""]
[null,null,null,null,null,null,null,null,"",null,null,null,""]
[null,null,null,null,null,null,null,null,"",null,null,null,""]
[null,null,null,null,null,null,null,null,"",null,null,null,""]
[null,null,null,null,null,null,null,null,"",null,null,null,""]
[null,null,null,null,null,null,null,null,"",null,null,null,""]
[null,null,null,null,null,null,null,null,"",null,null,null,""]
[null,null,null,null,null,null,null,null,"",null,null,null,""]
[null,null,null,null,null,null,null,null,"",null,null,null,""]
[null,null,null,null,null,null,null,null,"",null,null,null,""]
[null,null,null,null,null,null,null,null,"",null,null,null,""]
[null,null,null,null,null,null,null,null,"",null,null,null,""]
[null,null,null,null,null,null,null,null,"",null,null,null,""]
[null,null,null,null,null,null,null,null,"",null,null,null,""]
[null,null,null,null,null,null,null,null,"",null,null,null,""]
[null,null,null,null,null,null,null,null,"",null,null,null,""]
[null,null,null,null,null,null,null,null,"",null,null,null,""]
[null,null,null,null,null,null,null,null,"",null,null,null,""]
[null,null,null,null,null,null,null,null,"",null,null,null,""]
[null,null,null,null,null,null,null,null,"",null,null,null,""]
[null,null,null,null,null,null,null,null,"",null,null,null,""]
[null,null,null,null,null,null,null,null,"",null,null,null,""]
[null,null,null,null,null,null,null,null,"",null,null,null,""]
[null,null,null,null,null,null,null,null,"",null,null,null,""]
[null,null,null,null,null,null,null,null,"",null,null,null,""]
[null,null,null,null,null,null,null,null,"",null,null,null,""]
[null,null,null,null,null,null,null,null,"",null,null,null,""]
[null,null,null,null,null,null,null,null,"",null,null,null,""]
[null,null,null,null,null,null,null,null,"",null,null,null,""]
[null,null,null,null,null,null,null,null,"",null,null,null,""]
[null,null,null,null,null,null,null,null,"",null,null,null,""]
[null,null,null,null,null,null,null,null,"",null,null,null,""]
[null,null,null,null,null,null,null,null,"",null,null,null,""]
[null,null,null,null,null,null,null,null,"",null,null,null,""]
[null,null,null,null,null,null,null,null,"",null,null,null,""]
[null,null,null,null,null,null,null,null,"",null,null,null,""]
[null,null,null,null,null,null,null,null,"",null,null,null,""]
[null,null,null,null,null,null,null,null,"",null,null,null,""]
[null,null,null,null,null,null,null,null,"",null,null,null,""]
[null,null,null,null,null,null,null,null,"",null,null,null,""]
[null,null,null,null,null,null,null,null,"",null,null,null,""]
[null,null,null,null,null,null,null,null,"",null,null,null,""]
[null,null,null,null,null,null,null,null,"",null,null,null,""]
[null,null,null,null,null,null,null,null,"",null,null,null,""]
[null,null,null,null,null,null,null,null,"",null,null,null,""]
[null,null,null,null,null,null,null,null,"",null,null,null,""]
[null,null,null,null,null,null,null,null,"",null,null,null,""]
[null,null,null,null,null,null,null,null,"",null,null,null,""]
[null,null,null,null,null,null,null,null,"",null,null,null,""]
[null,null,null,null,null,null,null,null,"",null,null,null,""]
[null,null,null,null,null,null,null,null,"",null,null,null,""]
[null,null,null,null,null,null,null,null,"",null,null,null,""]
[null,null,null,null,null,null,null,null,"",null,null,null,""]
[null,null,null,null,null,null,null,null,"",null,null,null,""]
[null,null,null,null,null,null,null,null,"",null,null,null,""]
[null,null,null,null,null,null,null,null,"",null,null,null,""]
[null,null,null,null,null,null,null,null,"",null,null,null,""]
[null,null,null,null,null,null,null,null,"",null,null,null,""]
[null,null,null,null,null,null,null,null,"",null,null,null,""]
[null,null,null,null,null,null,null,null,"",null,null,null,""]
[null,null,null,null,null,null,null,null,"",null,null,null,""]
[null,null,null,null,null,null,null,null,"",null,null,null,""]
[null,null,null,null,null,null,null,null,"",null,null,null,""]
[null,null,null,null,null,null,null,null,"",null,null,null,""]
[null,null,null,null,null,null,null,null,"",null,null,null,""]
[null,null,null,null,null,null,null,null,"",null,null,null,""]
[null,null,null,null,null,null,null,null,"",null,null,null,""]
[null,null,null,null,null,null,null,null,"",null,null,null,""]
[null,null,null,null,null,null,null,null,"",null,null,null,""]
[null,null,null,null,null,null,null,null,"",null,null,null,""]
[null,null,null,null,null,null,null,null,"",null,null,null,""]
[null,null,null,null,null,null,null,null,"",null,null,null,""]
[null,null,null,null,null,null,null,null,"",null,null,null,""]
[null,null,null,null,null,null,null,null,"",null,null,null,""]
[null,null,null,null,null,null,null,null,"",null,null,null,""]
[null,null,null,null,null,null,null,null,"",null,null,null,""]
[null,null,null,null,null,null,null,null,"",null,null,null,""]
[null,null,null,null,null,null,null,null,"",null,null,null,""]
[null,null,null,null,null,null,null,null,"",null,null,null,""]
[null,null,null,null,null,null,null,null,"",null,null,null,""]
[null,null,null,null,null,null,null,null,"",null,null,null,""]
[null,null,null,null,null,null,null,null,"",null,null,null,""]
[null,null,null,null,null,null,null,null,"",null,null,null,""]
[null,null,null,null,null,null,null,null,"",null,null,null,""]
[null,null,null,null,null,null,null,null,"",null,null,null,""]
[null,null,null,null,null,null,null,null,"",null,null,null,""]
[null,null,null,null,null,null,null,null,"",null,null,null,""]
[null,null,null,null,null,null,null,null,"",null,null,null,""]
[null,null,null,null,null,null,null,null,"",null,null,null,""]
[null,null,null,null,null,null,null,null,"",null,null,null,""]
[null,null,null,null,null,null,null,null,"",null,null,null,""]
[null,null,null,null,null,null,null,null,"",null,null,null,""]
[null,null,null,null,null,null,null,null,"",null,null,null,""]
[null,null,null,null,null,null,null,null,"",null,null,null,""]
[null,null,null,null,null,null,null,null,"",null,null,null,""]
[null,null,null,null,null,null,null,null,"",null,null,null,""]
[null,null,null,null,null,null,null,null,"",null,null,null,""]
[null,null,null,null,null,null,null,null,"",null,null,null,""]
[null,null,null,null,null,null,null,null,"",null,null,null,""]
[null,null,null,null,null,null,null,null,"",null,null,null,""]
[null,null,null,null,null,null,null,null,"",null,null,null,""]
[null,null,null,null,null,null,null,null,"",null,null,null,""]
[null,null,null,null,null,null,null,null,"",null,null,null,""]
[null,null,null,null,null,null,null,null,"",null,null,null,""]
[null,null,null,null,null,null,null,null,"",null,null,null,""]
[null,null,null,null,null,null,null,null,"",null,null,null,""]
[null,null,null,null,null,null,null,null,"",null,null,null,""]
[null,null,null,null,null,null,null,null,"",null,null,null,""]
[null,null,null,null,null,null,null,null,"",null,null,null,""]
[null,null,null,null,null,null,null,null,"",null,null,null,""]
[null,null,null,null,null,null,null,null,"",null,null,null,""]
[null,null,null,null,null,null,null,null,"",null,null,null,""]
[null,null,null,null,null,null,null,null,"",null,null,null,""]
[null,null,null,null,null,null,null,null,"",null,null,null,""]
[null,null,null,null,null,null,null,null,"",null,null,null,""]
[null,null,null,null,null,null,null,null,"",null,null,null,""]
[null,null,null,null,null,null,null,null,"",null,null,null,""]
[null,null,null,null,null,null,null,null,"",null,null,null,""]
[null,null,null,null,null,null,null,null,"",null,null,null,""]
[null,null,null,null,null,null,null,null,"",null,null,null,""]
[null,null,null,null,null,null,null,null,"",null,null,null,""]
[null,null,null,null,null,null,null,null,"",null,null,null,""]
[null,null,null,null,null,null,null,null,"",null,null,null,""]
[null,null,null,null,null,null,null,null,"",null,null,null,""]
[null,null,null,null,null,null,null,null,"",null,null,null,""]
[null,null,null,null,null,null,null,null,"",null,null,null,""]
[null,null,null,null,null,null,null,null,"",null,null,null,""]
[null,null,null,null,null,null,null,null,"",null,null,null,""]
[null,null,null,null,null,null,null,null,"",null,null,null,""]
[null,null,null,null,null,null,null,null,"",null,null,null,""]
[null,null,null,null,null,null,null,null,"",null,null,null,""]
[null,null,null,null,null,null,null,null,"",null,null,null,""]
[null,null,null,null,null,null,null,null,"",null,null,null,""]
[null,null,null,null,null,null,null,null,"",null,null,null,""]
[null,null,null,null,null,null,null,null,"",null,null,null,""]
[null,null,null,null,null,null,null,null,"",null,null,null,""]
[null,null,null,null,null,null,null,null,"",null,null,null,""]
[null,null,null,null,null,null,null,null,"",null,null,null,""]
[null,null,null,null,null,null,null,null,"",null,null,null,""]
[null,null,null,null,null,null,null,null,"",null,null,null,""]
[null,null,null,null,null,null,null,null,"",null,null,null,""]
[null,null,null,null,null,null,null,null,"",null,null,null,""]
[null,null,null,null,null,null,null,null,"",null,null,null,""]
[null,null,null,null,null,null,null,null,"",null,null,null,""]
[null,null,null,null,null,null,null,null,"",null,null,null,""]
[null,null,null,null,null,null,null,null,"",null,null,null,""]
[null,null,null,null,null,null,null,null,"",null,null,null,""]
[null,null,null,null,null,null,null,null,"",null,null,null,""]
[null,null,null,null,null,null,null,null,"",null,null,null,""]
[null,null,null,null,null,null,null,null,"",null,null,null,""]
[null,null,null,null,null,null,null,null,"",null,null,null,""]
[null,null,null,null,null,null,null,null,"",null,null,null,""]
[null,null,null,null,null,null,null,null,"",null,null,null,""]
[null,null,null,null,null,null,null,null,"",null,null,null,""]
[null,null,null,null,null,null,null,null,"",null,null,null,""]
[null,null,null,null,null,null,null,null,"",null,null,null,""]
[null,null,null,null,null,null,null,null,"",null,null,null,""]
[null,null,null,null,null,null,null,null,"",null,null,null,""]
[null,null,null,null,null,null,null,null,"",null,null,null,""]
[null,null,null,null,null,null,null,null,"",null,null,null,""]
[null,null,null,null,null,null,null,null,"",null,null,null,""]
[null,null,null,null,null,null,null,null,"",null,null,null,""]
[null,null,null,null,null,null,null,null,"",null,null,null,""]
[null,null,null,null,null,null,null,null,"",null,null,null,""]
[null,null,null,null,null,null,null,null,"",null,null,null,""]
[null,null,null,null,null,null,null,null,"",null,null,null,""]
[null,null,null,null,null,null,null,null,"",null,null,null,""]
[null,null,null,null,null,null,null,null,"",null,null,null,""]
[null,null,null,null,null,null,null,null,"",null,null,null,""]
[null,null,null,null,null,null,null,null,"",null,null,null,""]
[null,null,null,null,null,null,null,null,"",null,null,null,""]
[null,null,null,null,null,null,null,null,"",null,null,null,""]
[null,null,null,null,null,null,null,null,"",null,null,null,""]
[null,null,null,null,null,null,null,null,"",null,null,null,""]
[null,null,null,null,null,null,null,null,"",null,null,null,""]
[null,null,null,null,null,null,null,null,"",null,null,null,""]
[null,null,null,null,null,null,null,null,"",null,null,null,""]
[null,null,null,null,null,null,null,null,"",null,null,null,""]
[null,null,null,null,null,null,null,null,"",null,null,null,""]
[null,null,null,null,null,null,null,null,"",null,null,null,""]
[null,null,null,null,null,null,null,null,"",null,null,null,""]
[null,null,null,null,null,null,null,null,"",null,null,null,""]
[null,null,null,null,null,null,null,null,"",null,null,null,""]
[null,null,null,null,null,null,null,null,"",null,null,null,""]
[null,null,null,null,null,null,null,null,"",null,null,null,""]
[null,null,null,null,null,null,null,null,"",null,null,null,""]
[null,null,null,null,null,null,null,null,"",null,null,null,""]
[null,null,null,null,null,null,null,null,"",null,null,null,""]
[null,null,null,null,null,null,null,null,"",null,null,null,""]
[null,null,null,null,null,null,null,null,"",null,null,null,""]
[null,null,null,null,null,null,null,null,"",null,null,null,""]
[null,null,null,null,null,null,null,null,"",null,null,null,""]
[null,null,null,null,null,null,null,null,"",null,null,null,""]
[null,null,null,null,null,null,null,null,"",null,null,null,""]
[null,null,null,null,null,null,null,null,"",null,null,null,""]
[null,null,null,null,null,null,null,null,"",null,null,null,""]
[null,null,null,null,null,null,null,null,"",null,null,null,""]
[null,null,null,null,null,null,null,null,"",null,null,null,""]
[null,null,null,null,null,null,null,null,"",null,null,null,""]
[null,null,null,null,null,null,null,null,"",null,null,null,""]
[null,null,null,null,null,null,null,null,"",null,null,null,""]
[null,null,null,null,null,null,null,null,"",null,null,null,""]
[null,null,null,null,null,null,null,null,"",null,null,null,""]
[null,null,null,null,null,null,null,null,"",null,null,null,""]
[null,null,null,null,null,null,null,null,"",null,null,null,""]
[null,null,null,null,null,null,null,null,"",null,null,null,""]
[null,null,null,null,null,null,null,null,"",null,null,null,""]
[null,null,null,null,null,null,null,null,"",null,null,null,""]
[null,null,null,null,null,null,null,null,"",null,null,null,""]
[null,null,null,null,null,null,null,null,"",null,null,null,""]
[null,null,null,null,null,null,null,null,"",null,null,null,""]
[null,null,null,null,null,null,null,null,"",null,null,null,""]
[null,null,null,null,null,null,null,null,"",null,null,null,""]
[null,null,null,null,null,null,null,null,"",null,null,null,""]
[null,null,null,null,null,null,null,null,"",null,null,null,""]
[null,null,null,null,null,null,null,null,"",null,null,null,""]
[null,null,null,null,null,null,null,null,"",null,null,null,""]
[null,null,null,null,null,null,null,null,"",null,null,null,""]
[null,null,null,null,null,null,null,null,"",null,null,null,""]
[null,null,null,null,null,null,null,null,"",null,null,null,""]
[null,null,null,null,null,null,null,null,"",null,null,null,""]
[null,null,null,null,null,null,null,null,"",null,null,null,""]
[null,null,null,null,null,null,null,null,"",null,null,null,""]
[null,null,null,null,null,null,null,null,"",null,null,null,""]
[null,null,null,null,null,null,null,null,"",null,null,null,""]
[null,null,null,null,null,null,null,null,"",null,null,null,""]
[null,null,null,null,null,null,null,null,"",null,null,null,""]
[null,null,null,null,null,null,null,null,"",null,null,null,""]
[null,null,null,null,null,null,null,null,"",null,null,null,""]
[null,null,null,null,null,null,null,null,"",null,null,null,""]
[null,null,null,null,null,null,null,null,"",null,null,null,""]
[null,null,null,null,null,null,null,null,"",null,null,null,""]
[null,null,null,null,null,null,null,null,"",null,null,null,""]
[null,null,null,null,null,null,null,null,"",null,null,null,""]
[null,null,null,null,null,null,null,null,"",null,null,null,""]
[null,null,null,null,null,null,null,null,"",null,null,null,""]
[null,null,null,null,null,null,null,null,"",null,null,null,""]
[null,null,null,null,null,null,null,null,"",null,null,null,""]
[null,null,null,null,null,null,null,null,"",null,null,null,""]
[null,null,null,null,null,null,null,null,"",null,null,null,""]
[null,null,null,null,null,null,null,null,"",null,null,null,""]
[null,null,null,null,null,null,null,null,"",null,null,null,""]
[null,null,null,null,null,null,null,null,"",null,null,null,""]
[null,null,null,null,null,null,null,null,"",null,null,null,""]
[null,null,null,null,null,null,null,null,"",null,null,null,""]
[null,null,null,null,null,null,null,null,"",null,null,null,""]
[null,null,null,null,null,null,null,null,"",null,null,null,""]
[null,null,null,null,null,null,null,null,"",null,null,null,""]
[null,null,null,null,null,null,null,null,"",null,null,null,""]
[null,null,null,null,null,null,null,null,"",null,null,null,""]
[null,null,null,null,null,null,null,null,"",null,null,null,""]
[null,null,null,null,null,null,null,null,"",null,null,null,""]
[null,null,null,null,null,null,null,null,"",null,null,null,""]
[null,null,null,null,null,null,null,null,"",null,null,null,""]
[null,null,null,null,null,null,null,null,"",null,null,null,""]
[null,null,null,null,null,null,null,null,"",null,null,null,""]
[null,null,null,null,null,null,null,null,"",null,null,null,""]
[null,null,null,null,null,null,null,null,"",null,null,null,""]
[null,null,null,null,null,null,null,null,"",null,null,null,""]
[null,null,null,null,null,null,null,null,"",null,null,null,""]
[null,null,null,null,null,null,null,null,"",null,null,null,""]
[null,null,null,null,null,null,null,null,"",null,null,null,""]
[null,null,null,null,null,null,null,null,"",null,null,null,""]
[null,null,null,null,null,null,null,null,"",null,null,null,""]
[null,null,null,null,null,null,null,null,"",null,null,null,""]
[null,null,null,null,null,null,null,null,"",null,null,null,""]
[null,null,null,null,null,null,null,null,"",null,null,null,""]
[null,null,null,null,null,null,null,null,"",null,null,null,""]
[null,null,null,null,null,null,null,null,"",null,null,null,""]
[null,null,null,null,null,null,null,null,"",null,null,null,""]
[null,null,null,null,null,null,null,null,"",null,null,null,""]
[null,null,null,null,null,null,null,null,"",null,null,null,""]
[null,null,null,null,null,null,null,null,"",null,null,null,""]
[null,null,null,null,null,null,null,null,"",null,null,null,""]
[null,null,null,null,null,null,null,null,"",null,null,null,""]
[null,null,null,null,null,null,null,null,"",null,null,null,""]
[null,null,null,null,null,null,null,null,"",null,null,null,""]
[null,null,null,null,null,null,null,null,"",null,null,null,""]
[null,null,null,null,null,null,null,null,"",null,null,null,""]
[null,null,null,null,null,null,null,null,"",null,null,null,""]
[null,null,null,null,null,null,null,null,"",null,null,null,""]
[null,null,null,null,null,null,null,null,"",null,null,null,""]
[null,null,null,null,null,null,null,null,"",null,null,null,""]
[null,null,null,null,null,null,null,null,"",null,null,null,""]
[null,null,null,null,null,null,null,null,"",null,null,null,""]
[null,null,null,null,null,null,null,null,"",null,null,null,""]
[null,null,null,null,null,null,null,null,"",null,null,null,""]
[null,null,null,null,null,null,null,null,"",null,null,null,""]
[null,null,null,null,null,null,null,null,"",null,null,null,""]
[null,null,null,null,null,null,null,null,"",null,null,null,""]
[null,null,null,null,null,null,null,null,"",null,null,null,""]
[null,null,null,null,null,null,null,null,"",null,null,null,""]
[null,null,null,null,null,null,null,null,"",null,null,null,""]
[null,null,null,null,null,null,null,null,"",null,null,null,""]
[null,null,null,null,null,null,null,null,"",null,null,null,""]
[null,null,null,null,null,null,null,null,"",null,null,null,""]
[null,null,null,null,null,null,null,null,"",null,null,null,""]
[null,null,null,null,null,null,null,null,"",null,null,null,""]
[null,null,null,null,null,null,null,null,"",null,null,null,""]
[null,null,null,null,null,null,null,null,"",null,null,null,""]
[null,null,null,null,null,null,null,null,"",null,null,null,""]
[null,null,null,null,null,null,null,null,"",null,null,null,""]
[null,null,null,null,null,null,null,null,"",null,null,null,""]
[null,null,null,null,null,null,null,null,"",null,null,null,""]
[null,null,null,null,null,null,null,null,"",null,null,null,""]
[null,null,null,null,null,null,null,null,"",null,null,null,""]
[null,null,null,null,null,null,null,null,"",null,null,null,""]
[null,null,null,null,null,null,null,null,"",null,null,null,""]
[null,null,null,null,null,null,null,null,"",null,null,null,""]
[null,null,null,null,null,null,null,null,"",null,null,null,""]
[null,null,null,null,null,null,null,null,"",null,null,null,""]
[null,null,null,null,null,null,null,null,"",null,null,null,""]
[null,null,null,null,null,null,null,null,"",null,null,null,""]
[null,null,null,null,null,null,null,null,"",null,null,null,""]
[null,null,null,null,null,null,null,null,"",null,null,null,""]
[null,null,null,null,null,null,null,null,"",null,null,null,""]
[null,null,null,null,null,null,null,null,"",null,null,null,""]
[null,null,null,null,null,null,null,null,"",null,null,null,""]
[null,null,null,null,null,null,null,null,"",null,null,null,""]
[null,null,null,null,null,null,null,null,"",null,null,null,""]
[null,null,null,null,null,null,null,null,"",null,null,null,""]
[null,null,null,null,null,null,null,null,"",null,null,null,""]
[null,null,null,null,null,null,null,null,"",null,null,null,""]
[null,null,null,null,null,null,null,null,"",null,null,null,""]
[null,null,null,null,null,null,null,null,"",null,null,null,""]
[null,null,null,null,null,null,null,null,"",null,null,null,""]
[null,null,null,null,null,null,null,null,"",null,null,null,""]
[null,null,null,null,null,null,null,null,"",null,null,null,""]
[null,null,null,null,null,null,null,null,"",null,null,null,""]
[null,null,null,null,null,null,null,null,"",null,null,null,""]
[null,null,null,null,null,null,null,null,"",null,null,null,""]
[null,null,null,null,null,null,null,null,"",null,null,null,""]
[null,null,null,null,null,null,null,null,"",null,null,null,""]
[null,null,null,null,null,null,null,null,"",null,null,null,""]
[null,null,null,null,null,null,null,null,"",null,null,null,""]
[null,null,null,null,null,null,null,null,"",null,null,null,""]
[null,null,null,null,null,null,null,null,"",null,null,null,""]
[null,null,null,null,null,null,null,null,"",null,null,null,""]
[null,null,null,null,null,null,null,null,"",null,null,null,""]
[null,null,null,null,null,null,null,null,"",null,null,null,""]
[null,null,null,null,null,null,null,null,"",null,null,null,""]
[null,null,null,null,null,null,null,null,"",null,null,null,""]
[null,null,null,null,null,null,null,null,"",null,null,null,""]
[null,null,null,null,null,null,null,null,"",null,null,null,""]
[null,null,null,null,null,null,null,null,"",null,null,null,""]
[null,null,null,null,null,null,null,null,"",null,null,null,""]
[null,null,null,null,null,null,null,null,"",null,null,null,""]
[null,null,null,null,null,null,null,null,"",null,null,null,""]
[null,null,null,null,null,null,null,null,"",null,null,null,""]
[null,null,null,null,null,null,null,null,"",null,null,null,""]
[null,null,null,null,null,null,null,null,"",null,null,null,""]
[null,null,null,null,null,null,null,null,"",null,null,null,""]
[null,null,null,null,null,null,null,null,"",null,null,null,""]
[null,null,null,null,null,null,null,null,"",null,null,null,""]
[null,null,null,null,null,null,null,null,"",null,null,null,""]
[null,null,null,null,null,null,null,null,"",null,null,null,""]
[null,null,null,null,null,null,null,null,"",null,null,null,""]
[null,null,null,null,null,null,null,null,"",null,null,null,""]
[null,null,null,null,null,null,null,null,"",null,null,null,""]
[null,null,null,null,null,null,null,null,"",null,null,null,""]
[null,null,null,null,null,null,null,null,"",null,null,null,""]
[null,null,null,null,null,null,null,null,"",null,null,null,""]
[null,null,null,null,null,null,null,null,"",null,null,null,""]
[null,null,null,null,null,null,null,null,"",null,null,null,""]
[null,null,null,null,null,null,null,null,"",null,null,null,""]
[null,null,null,null,null,null,null,null,"",null,null,null,""]
[null,null,null,null,null,null,null,null,"",null,null,null,""]
[null,null,null,null,null,null,null,null,"",null,null,null,""]
[null,null,null,null,null,null,null,null,"",null,null,null,""]
[null,null,null,null,null,null,null,null,"",null,null,null,""]
[null,null,null,null,null,null,null,null,"",null,null,null,""]
[null,null,null,null,null,null,null,null,"",null,null,null,""]
[null,null,null,null,null,null,null,null,"",null,null,null,""]
[null,null,null,null,null,null,null,null,"",null,null,null,""]
[null,null,null,null,null,null,null,null,"",null,null,null,""]
[null,null,null,null,null,null,null,null,"",null,null,null,""]
[null,null,null,null,null,null,null,null,"",null,null,null,""]
[null,null,null,null,null,null,null,null,"",null,null,null,""]
[null,null,null,null,null,null,null,null,"",null,null,null,""]
[null,null,null,null,null,null,null,null,"",null,null,null,""]
[null,null,null,null,null,null,null,null,"",null,null,null,""]
[null,null,null,null,null,null,null,null,"",null,null,null,""]
[null,null,null,null,null,null,null,null,"",null,null,null,""]
[null,null,null,null,null,null,null,null,"",null,null,null,""]
[null,null,null,null,null,null,null,null,"",null,null,null,""]
[null,null,null,null,null,null,null,null,"",null,null,null,""]
[null,null,null,null,null,null,null,null,"",null,null,null,""]
[null,null,null,null,null,null,null,null,"",null,null,null,""]
[null,null,null,null,null,null,null,null,"",null,null,null,""]
[null,null,null,null,null,null,null,null,"",null,null,null,""]
[null,null,null,null,null,null,null,null,"",null,null,null,""]
[null,null,null,null,null,null,null,null,"",null,null,null,""]
[null,null,null,null,null,null,null,null,"",null,null,null,""]
[null,null,null,null,null,null,null,null,"",null,null,null,""]
[null,null,null,null,null,null,null,null,"",null,null,null,""]
[null,null,null,null,null,null,null,null,"",null,null,null,""]
[null,null,null,null,null,null,null,null,"",null,null,null,""]
[null,null,null,null,null,null,null,null,"",null,null,null,""]
[null,null,null,null,null,null,null,null,"",null,null,null,""]
[null,null,null,null,null,null,null,null,"",null,null,null,""]
[null,null,null,null,null,null,null,null,"",null,null,null,""]
[null,null,null,null,null,null,null,null,"",null,null,null,""]
[null,null,null,null,null,null,null,null,"",null,null,null,""]
[null,null,null,null,null,null,null,null,"",null,null,null,""]
[null,null,null,null,null,null,null,null,"",null,null,null,""]
[null,null,null,null,null,null,null,null,"",null,null,null,""]
[null,null,null,null,null,null,null,null,"",null,null,null,""]
[null,null,null,null,null,null,null,null,"",null,null,null,""]
[null,null,null,null,null,null,null,null,"",null,null,null,""]
[null,null,null,null,null,null,null,null,"",null,null,null,""]
[null,null,null,null,null,null,null,null,"",null,null,null,""]
[null,null,null,null,null,null,null,null,"",null,null,null,""]
[null,null,null,null,null,null,null,null,"",null,null,null,""]
[null,null,null,null,null,null,null,null,"",null,null,null,""]
[null,null,null,null,null,null,null,null,"",null,null,null,""]
[null,null,null,null,null,null,null,null,"",null,null,null,""]
[null,null,null,null,null,null,null,null,"",null,null,null,""]
[null,null,null,null,null,null,null,null,"",null,null,null,""]
[null,null,null,null,null,null,null,null,"",null,null,null,""]
[null,null,null,null,null,null,null,null,"",null,null,null,""]
[null,null,null,null,null,null,null,null,"",null,null,null,""]
[null,null,null,null,null,null,null,null,"",null,null,null,""]
[null,null,null,null,null,null,null,null,"",null,null,null,""]
[null,null,null,null,null,null,null,null,"",null,null,null,""]
[null,null,null,null,null,null,null,null,"",null,null,null,""]
[null,null,null,null,null,null,null,null,"",null,null,null,""]
[null,null,null,null,null,null,null,null,"",null,null,null,""]
[null,null,null,null,null,null,null,null,"",null,null,null,""]
[null,null,null,null,null,null,null,null,"",null,null,null,""]
[null,null,null,null,null,null,null,null,"",null,null,null,""]
[null,null,null,null,null,null,null,null,"",null,null,null,""]
[null,null,null,null,null,null,null,null,"",null,null,null,""]
[null,null,null,null,null,null,null,null,"",null,null,null,""]
[null,null,null,null,null,null,null,null,"",null,null,null,""]
[null,null,null,null,null,null,null,null,"",null,null,null,""]
[null,null,null,null,null,null,null,null,"",null,null,null,""]
[null,null,null,null,null,null,null,null,"",null,null,null,""]
[null,null,null,null,null,null,null,null,"",null,null,null,""]
[null,null,null,null,null,null,null,null,"",null,null,null,""]
[null,null,null,null,null,null,null,null,"",null,null,null,""]
[null,null,null,null,null,null,null,null,"",null,null,null,""]
[null,null,null,null,null,null,null,null,"",null,null,null,""]
[null,null,null,null,null,null,null,null,"",null,null,null,""]
[null,null,null,null,null,null,null,null,"",null,null,null,""]
[null,null,null,null,null,null,null,null,"",null,null,null,""]
[null,null,null,null,null,null,null,null,"",null,null,null,""]
[null,null,null,null,null,null,null,null,"",null,null,null,""]
[null,null,null,null,null,null,null,null,"",null,null,null,""]
[null,null,null,null,null,null,null,null,"",null,null,null,""]
[null,null,null,null,null,null,null,null,"",null,null,null,""]
[null,null,null,null,null,null,null,null,"",null,null,null,""]
[null,null,null,null,null,null,null,null,"",null,null,null,""]
[null,null,null,null,null,null,null,null,"",null,null,null,""]
[null,null,null,null,null,null,null,null,"",null,null,null,""]
[null,null,null,null,null,null,null,null,"",null,null,null,""]
[null,null,null,null,null,null,null,null,"",null,null,null,""]
[null,null,null,null,null,null,null,null,"",null,null,null,""]
[null,null,null,null,null,null,null,null,"",null,null,null,""]
[null,null,null,null,null,null,null,null,"",null,null,null,""]
[null,null,null,null,null,null,null,null,"",null,null,null,""]
[null,null,null,null,null,null,null,null,"",null,null,null,""]
[null,null,null,null,null,null,null,null,"",null,null,null,""]
[null,null,null,null,null,null,null,null,"",null,null,null,""]
[null,null,null,null,null,null,null,null,"",null,null,null,""]
[null,null,null,null,null,null,null,null,"",null,null,null,""]
[null,null,null,null,null,null,null,null,"",null,null,null,""]
[null,null,null,null,null,null,null,null,"",null,null,null,""]
[null,null,null,null,null,null,null,null,"",null,null,null,""]
[null,null,null,null,null,null,null,null,"",null,null,null,""]
[null,null,null,null,null,null,null,null,"",null,null,null,""]
[null,null,null,null,null,null,null,null,"",null,null,null,""]
[null,null,null,null,null,null,null,null,"",null,null,null,""]
[null,null,null,null,null,null,null,null,"",null,null,null,""]
[null,null,null,null,null,null,null,null,"",null,null,null,""]
[null,null,null,null,null,null,null,null,"",null,null,null,""]
[null,null,null,null,null,null,null,null,"",null,null,null,""]
[null,null,null,null,null,null,null,null,"",null,null,null,""]
[null,null,null,null,null,null,null,null,"",null,null,null,""]
[null,null,null,null,null,null,null,null,"",null,null,null,""]
[null,null,null,null,null,null,null,null,"",null,null,null,""]
[null,null,null,null,null,null,null,null,"",null,null,null,""]
[null,null,null,null,null,null,null,null,"",null,null,null,""]
[null,null,null,null,null,null,null,null,"",null,null,null,""]
[null,null,null,null,null,null,null,null,"",null,null,null,""]
[null,null,null,null,null,null,null,null,"",null,null,null,""]
[null,null,null,null,null,null,null,null,"",null,null,null,""]
[null,null,null,null,null,null,null,null,"",null,null,null,""]
[null,null,null,null,null,null,null,null,"",null,null,null,""]
[null,null,null,null,null,null,null,null,"",null,null,null,""]
[null,null,null,null,null,null,null,null,"",null,null,null,""]
[null,null,null,null,null,null,null,null,"",null,null,null,""]
[null,null,null,null,null,null,null,null,"",null,null,null,""]
[null,null,null,null,null,null,null,null,"",null,null,null,""]
[null,null,null,null,null,null,null,null,"",null,null,null,""]
[null,null,null,null,null,null,null,null,"",null,null,null,""]
[null,null,null,null,null,null,null,null,"",null,null,null,""]
[null,null,null,null,null,null,null,null,"",null,null,null,""]
[null,null,null,null,null,null,null,null,"",null,null,null,""]
[null,null,null,null,null,null,null,null,"",null,null,null,""]
[null,null,null,null,null,null,null,null,"",null,null,null,""]
[null,null,null,null,null,null,null,null,"",null,null,null,""]
[null,null,null,null,null,null,null,null,"",null,null,null,""]
[null,null,null,null,null,null,null,null,"",null,null,null,""]
[null,null,null,null,null,null,null,null,"",null,null,null,""]
[null,null,null,null,null,null,null,null,"",null,null,null,""]
[null,null,null,null,null,null,null,null,"",null,null,null,""]
[null,null,null,null,null,null,null,null,"",null,null,null,""]
[null,null,null,null,null,null,null,null,"",null,null,null,""]
[null,null,null,null,null,null,null,null,"",null,null,null,""]
[null,null,null,null,null,null,null,null,"",null,null,null,""]
[null,null,null,null,null,null,null,null,"",null,null,null,""]
[null,null,null,null,null,null,null,null,"",null,null,null,""]
[null,null,null,null,null,null,null,null,"",null,null,null,""]
[null,null,null,null,null,null,null,null,"",null,null,null,""]
[null,null,null,null,null,null,null,null,"",null,null,null,""]
[null,null,null,null,null,null,null,null,"",null,null,null,""]
[null,null,null,null,null,null,null,null,"",null,null,null,""]
[null,null,null,null,null,null,null,null,"",null,null,null,""]
[null,null,null,null,null,null,null,null,"",null,null,null,""]
[null,null,null,null,null,null,null,null,"",null,null,null,""]
[null,null,null,null,null,null,null,null,"",null,null,null,""]
[null,null,null,null,null,null,null,null,"",null,null,null,""]
[null,null,null,null,null,null,null,null,"",null,null,null,""]
[null,null,null,null,null,null,null,null,"",null,null,null,""]
[null,null,null,null,null,null,null,null,"",null,null,null,""]
[null,null,null,null,null,null,null,null,"",null,null,null,""]
[null,null,null,null,null,null,null,null,"",null,null,null,""]
[null,null,null,null,null,null,null,null,"",null,null,null,""]
[null,null,null,null,null,null,null,null,"",null,null,null,""]
[null,null,null,null,null,null,null,null,"",null,null,null,""]
[null,null,null,null,null,null,null,null,"",null,null,null,""]
[null,null,null,null,null,null,null,null,"",null,null,null,""]
[null,null,null,null,null,null,null,null,"",null,null,null,""]
[null,null,null,null,null,null,null,null,"",null,null,null,""]
[null,null,null,null,null,null,null,null,"",null,null,null,""]
[null,null,null,null,null,null,null,null,"",null,null,null,""]
[null,null,null,null,null,null,null,null,"",null,null,null,""]
[null,null,null,null,null,null,null,null,"",null,null,null,""]
[null,null,null,null,null,null,null,null,"",null,null,null,""]
[null,null,null,null,null,null,null,null,"",null,null,null,""]
[null,null,null,null,null,null,null,null,"",null,null,null,""]
[null,null,null,null,null,null,null,null,"",null,null,null,""]
[null,null,null,null,null,null,null,null,"",null,null,null,""]
[null,null,null,null,null,null,null,null,"",null,null,null,""]
[null,null,null,null,null,null,null,null,"",null,null,null,""]
[null,null,null,null,null,null,null,null,"",null,null,null,""]
[null,null,null,null,null,null,null,null,"",null,null,null,""]
[null,null,null,null,null,null,null,null,"",null,null,null,""]
[null,null,null,null,null,null,null,null,"",null,null,null,""]
[null,null,null,null,null,null,null,null,"",null,null,null,""]
[null,null,null,null,null,null,null,null,"",null,null,null,""]
[null,null,null,null,null,null,null,null,"",null,null,null,""]
[null,null,null,null,null,null,null,null,"",null,null,null,""]
[null,null,null,null,null,null,null,null,"",null,null,null,""]
[null,null,null,null,null,null,null,null,"",null,null,null,""]
[null,null,null,null,null,null,null,null,"",null,null,null,""]
[null,null,null,null,null,null,null,null,"",null,null,null,""]
[null,null,null,null,null,null,null,null,"",null,null,null,""]
[null,null,null,null,null,null,null,null,"",null,null,null,""]
[null,null,null,null,null,null,null,null,"",null,null,null,""]
[null,null,null,null,null,null,null,null,"",null,null,null,""]
[null,null,null,null,null,null,null,null,"",null,null,null,""]
[null,null,null,null,null,null,null,null,"",null,null,null,""]
[null,null,null,null,null,null,null,null,"",null,null,null,""]
[null,null,null,null,null,null,null,null,"",null,null,null,""]
[null,null,null,null,null,null,null,null,"",null,null,null,""]
[null,null,null,null,null,null,null,null,"",null,null,null,""]
[null,null,null,null,null,null,null,null,"",null,null,null,""]
[null,null,null,null,null,null,null,null,"",null,null,null,""]
[null,null,null,null,null,null,null,null,"",null,null,null,""]
[null,null,null,null,null,null,null,null,"",null,null,null,""]
[null,null,null,null,null,null,null,null,"",null,null,null,""]
[null,null,null,null,null,null,null,null,"",null,null,null,""]
[null,null,null,null,null,null,null,null,"",null,null,null,""]
[null,null,null,null,null,null,null,null,"",null,null,null,""]
[null,null,null,null,null,null,null,null,"",null,null,null,""]
[null,null,null,null,null,null,null,null,"",null,null,null,""]
[null,null,null,null,null,null,null,null,"",null,null,null,""]
[null,null,null,null,null,null,null,null,"",null,null,null,""]
[null,null,null,null,null,null,null,null,"",null,null,null,""]
[null,null,null,null,null,null,null,null,"",null,null,null,""]
[null,null,null,null,null,null,null,null,"",null,null,null,""]
[null,null,null,null,null,null,null,null,"",null,null,null,""]
[null,null,null,null,null,null,null,null,"",null,null,null,""]
[null,null,null,null,null,null,null,null,"",null,null,null,""]
[null,null,null,null,null,null,null,null,"",null,null,null,""]
[null,null,null,null,null,null,null,null,"",null,null,null,""]
[null,null,null,null,null,null,null,null,"",null,null,null,""]
[null,null,null,null,null,null,null,null,"",null,null,null,""]
[null,null,null,null,null,null,null,null,"",null,null,null,""]
[null,null,null,null,null,null,null,null,"",null,null,null,""]
[null,null,null,null,null,null,null,null,"",null,null,null,""]
[null,null,null,null,null,null,null,null,"",null,null,null,""]
[null,null,null,null,null,null,null,null,"",null,null,null,""]
[null,null,null,null,null,null,null,null,"",null,null,null,""]
[null,null,null,null,null,null,null,null,"",null,null,null,""]
[null,null,null,null,null,null,null,null,"",null,null,null,""]
[null,null,null,null,null,null,null,null,"",null,null,null,""]
[null,null,null,null,null,null,null,null,"",null,null,null,""]
[null,null,null,null,null,null,null,null,"",null,null,null,""]
[null,null,null,null,null,null,null,null,"",null,null,null,""]
[null,null,null,null,null,null,null,null,"",null,null,null,""]
[null,null,null,null,null,null,null,null,"",null,null,null,""]
[null,null,null,null,null,null,null,null,"",null,null,null,""]
[null,null,null,null,null,null,null,null,"",null,null,null,""]
[null,null,null,null,null,null,null,null,"",null,null,null,""]
[null,null,null,null,null,null,null,null,"",null,null,null,""]
[null,null,null,null,null,null,null,null,"",null,null,null,""]
[null,null,null,null,null,null,null,null,"",null,null,null,""]
[null,null,null,null,null,null,null,null,"",null,null,null,""]
[null,null,null,null,null,null,null,null,"",null,null,null,""]
[null,null,null,null,null,null,null,null,"",null,null,null,""]
[null,null,null,null,null,null,null,null,"",null,null,null,""]
[null,null,null,null,null,null,null,null,"",null,null,null,""]
[null,null,null,null,null,null,null,null,"",null,null,null,""]
[null,null,null,null,null,null,null,null,"",null,null,null,""]
[null,null,null,null,null,null,null,null,"",null,null,null,""]
[null,null,null,null,null,null,null,null,"",null,null,null,""]
[null,null,null,null,null,null,null,null,"",null,null,null,""]
[null,null,null,null,null,null,null,null,"",null,null,null,""]
[null,null,null,null,null,null,null,null,"",null,null,null,""]
[null,null,null,null,null,null,null,null,"",null,null,null,""]
[null,null,null,null,null,null,null,null,"",null,null,null,""]
[null,null,null,null,null,null,null,null,"",null,null,null,""]
[null,null,null,null,null,null,null,null,"",null,null,null,""]
[null,null,null,null,null,null,null,null,"",null,null,null,""]
[null,null,null,null,null,null,null,null,"",null,null,null,""]
[null,null,null,null,null,null,null,null,"",null,null,null,""]
[null,null,null,null,null,null,null,null,"",null,null,null,""]
[null,null,null,null,null,null,null,null,"",null,null,null,""]
[null,null,null,null,null,null,null,null,"",null,null,null,""]
[null,null,null,null,null,null,null,null,"",null,null,null,""]
[null,null,null,null,null,null,null,null,"",null,null,null,""]
[null,null,null,null,null,null,null,null,"",null,null,null,""]
[null,null,null,null,null,null,null,null,"",null,null,null,""]
[null,null,null,null,null,null,null,null,"",null,null,null,""]
[null,null,null,null,null,null,null,null,"",null,null,null,""]
[null,null,null,null,null,null,null,null,"",null,null,null,""]
[null,null,null,null,null,null,null,null,"",null,null,null,""]
[null,null,null,null,null,null,null,null,"",null,null,null,""]
[null,null,null,null,null,null,null,null,"",null,null,null,""]
[null,null,null,null,null,null,null,null,"",null,null,null,""]
[null,null,null,null,null,null,null,null,"",null,null,null,""]
[null,null,null,null,null,null,null,null,"",null,null,null,""]
[null,null,null,null,null,null,null,null,"",null,null,null,""]
[null,null,null,null,null,null,null,null,"",null,null,null,""]
[null,null,null,null,null,null,null,null,"",null,null,null,""]
[null,null,null,null,null,null,null,null,"",null,null,null,""]
[null,null,null,null,null,null,null,null,"",null,null,null,""]
[null,null,null,null,null,null,null,null,"",null,null,null,""]
[null,null,null,null,null,null,null,null,"",null,null,null,""]
[null,null,null,null,null,null,null,null,"",null,null,null,""]
[null,null,null,null,null,null,null,null,"",null,null,null,""]
[null,null,null,null,null,null,null,null,"",null,null,null,""]
[null,null,null,null,null,null,null,null,"",null,null,null,""]
[null,null,null,null,null,null,null,null,"",null,null,null,""]
[null,null,null,null,null,null,null,null,"",null,null,null,""]
[null,null,null,null,null,null,null,null,"",null,null,null,""]
[null,null,null,null,null,null,null,null,"",null,null,null,""]
[null,null,null,null,null,null,null,null,"",null,null,null,""]
[null,null,null,null,null,null,null,null,"",null,null,null,""]
[null,null,null,null,null,null,null,null,"",null,null,null,""]
[null,null,null,null,null,null,null,null,"",null,null,null,""]
[null,null,null,null,null,null,null,null,"",null,null,null,""]
[null,null,null,null,null,null,null,null,"",null,null,null,""]
[null,null,null,null,null,null,null,null,"",null,null,null,""]
[null,null,null,null,null,null,null,null,"",null,null,null,""]
[null,null,null,null,null,null,null,null,"",null,null,null,""]
[null,null,null,null,null,null,null,null,"",null,null,null,""]
[null,null,null,null,null,null,null,null,"",null,null,null,""]
[null,null,null,null,null,null,null,null,"",null,null,null,""]
[null,null,null,null,null,null,null,null,"",null,null,null,""]
[null,null,null,null,null,null,null,null,"",null,null,null,""]
[null,null,null,null,null,null,null,null,"",null,null,null,""]
[null,null,null,null,null,null,null,null,"",null,null,null,""]
[null,null,null,null,null,null,null,null,"",null,null,null,""]
[null,null,null,null,null,null,null,null,"",null,null,null,""]
[null,null,null,null,null,null,null,null,"",null,null,null,""]
[null,null,null,null,null,null,null,null,"",null,null,null,""]
[null,null,null,null,null,null,null,null,"",null,null,null,""]
[null,null,null,null,null,null,null,null,"",null,null,null,""]
[null,null,null,null,null,null,null,null,"",null,null,null,""]
[null,null,null,null,null,null,null,null,"",null,null,null,""]
[null,null,null,null,null,null,null,null,"",null,null,null,""]
[null,null,null,null,null,null,null,null,"",null,null,null,""]
[null,null,null,null,null,null,null,null,"",null,null,null,""]
[null,null,null,null,null,null,null,null,"",null,null,null,""]
[null,null,null,null,null,null,null,null,"",null,null,null,""]
[null,null,null,null,null,null,null,null,"",null,null,null,""]
[null,null,null,null,null,null,null,null,"",null,null,null,""]
[null,null,null,null,null,null,null,null,"",null,null,null,""]
[null,null,null,null,null,null,null,null,"",null,null,null,""]
[null,null,null,null,null,null,null,null,"",null,null,null,""]
[null,null,null,null,null,null,null,null,"",null,null,null,""]
[null,null,null,null,null,null,null,null,"",null,null,null,""]
[null,null,null,null,null,null,null,null,"",null,null,null,""]
[null,null,null,null,null,null,null,null,"",null,null,null,""]
[null,null,null,null,null,null,null,null,"",null,null,null,""]
[null,null,null,null,null,null,null,null,"",null,null,null,""]
[null,null,null,null,null,null,null,null,"",null,null,null,""]
[null,null,null,null,null,null,null,null,"",null,null,null,""]
[null,null,null,null,null,null,null,null,"",null,null,null,""]
[null,null,null,null,null,null,null,null,"",null,null,null,""]
[null,null,null,null,null,null,null,null,"",null,null,null,""]
[null,null,null,null,null,null,null,null,"",null,null,null,""]
[null,null,null,null,null,null,null,null,"",null,null,null,""]
[null,null,null,null,null,null,null,null,"",null,null,null,""]
[null,null,null,null,null,null,null,null,"",null,null,null,""]
[null,null,null,null,null,null,null,null,"",null,null,null,""]
[null,null,null,null,null,null,null,null,"",null,null,null,""]
[null,null,null,null,null,null,null,null,"",null,null,null,""]
[null,null,null,null,null,null,null,null,"",null,null,null,""]
[null,null,null,null,null,null,null,null,"",null,null,null,""]
[null,null,null,null,null,null,null,null,"",null,null,null,""]
[null,null,null,null,null,null,null,null,"",null,null,null,""]
[null,null,null,null,null,null,null,null,"",null,null,null,""]
[null,null,null,null,null,null,null,null,"",null,null,null,""]
[null,null,null,null,null,null,null,null,"",null,null,null,""]
[null,null,null,null,null,null,null,null,"",null,null,null,""]
[null,null,null,null,null,null,null,null,"",null,null,null,""]
[null,null,null,null,null,null,null,null,"",null,null,null,""]
[null,null,null,null,null,null,null,null,"",null,null,null,""]
[null,null,null,null,null,null,null,null,"",null,null,null,""]
[null,null,null,null,null,null,null,null,"",null,null,null,""]
[null,null,null,null,null,null,null,null,"",null,null,null,""]
[null,null,null,null,null,null,null,null,"",null,null,null,""]
[null,null,null,null,null,null,null,null,"",null,null,null,""]
[null,null,null,null,null,null,null,null,"",null,null,null,""]
[null,null,null,null,null,null,null,null,"",null,null,null,""]
[null,null,null,null,null,null,null,null,"",null,null,null,""]
[null,null,null,null,null,null,null,null,"",null,null,null,""]
[null,null,null,null,null,null,null,null,"",null,null,null,""]
[null,null,null,null,null,null,null,null,"",null,null,null,""]
[null,null,null,null,null,null,null,null,"",null,null,null,""]
[null,null,null,null,null,null,null,null,"",null,null,null,""]
[null,null,null,null,null,null,null,null,"",null,null,null,""]
[null,null,null,null,null,null,null,null,"",null,null,null,""]
[null,null,null,null,null,null,null,null,"",null,null,null,""]
[null,null,null,null,null,null,null,null,"",null,null,null,""]
[null,null,null,null,null,null,null,null,"",null,null,null,""]
[null,null,null,null,null,null,null,null,"",null,null,null,""]
[null,null,null,null,null,null,null,null,"",null,null,null,""]
[null,null,null,null,null,null,null,null,"",null,null,null,""]
[null,null,null,null,null,null,null,null,"",null,null,null,""]
[null,null,null,null,null,null,null,null,"",null,null,null,""]
[null,null,null,null,null,null,null,null,"",null,null,null,""]
[null,null,null,null,null,null,null,null,"",null,null,null,""]
[null,null,null,null,null,null,null,null,"",null,null,null,""]
[null,null,null,null,null,null,null,null,"",null,null,null,""]
[null,null,null,null,null,null,null,null,"",null,null,null,""]
[null,null,null,null,null,null,null,null,"",null,null,null,""]
[null,null,null,null,null,null,null,null,"",null,null,null,""]
[null,null,null,null,null,null,null,null,"",null,null,null,""]
[null,null,null,null,null,null,null,null,"",null,null,null,""]
[null,null,null,null,null,null,null,null,"",null,null,null,""]
[null,null,null,null,null,null,null,null,"",null,null,null,""]
[null,null,null,null,null,null,null,null,"",null,null,null,""]
[null,null,null,null,null,null,null,null,"",null,null,null,""]
[null,null,null,null,null,null,null,null,"",null,null,null,""]
[null,null,null,null,null,null,null,null,"",null,null,null,""]
[null,null,null,null,null,null,null,null,"",null,null,null,""]
[null,null,null,null,null,null,null,null,"",null,null,null,""]
[null,null,null,null,null,null,null,null,"",null,null,null,""]
[null,null,null,null,null,null,null,null,"",null,null,null,""]
[null,null,null,null,null,null,null,null,"",null,null,null,""]
[null,null,null,null,null,null,null,null,"",null,null,null,""]
[null,null,null,null,null,null,null,null,"",null,null,null,""]
[null,null,null,null,null,null,null,null,"",null,null,null,""]
[null,null,null,null,null,null,null,null,"",null,null,null,""]
[null,null,null,null,null,null,null,null,"",null,null,null,""]
[null,null,null,null,null,null,null,null,"",null,null,null,""]
[null,null,null,null,null,null,null,null,"",null,null,null,""]
[null,null,null,null,null,null,null,null,"",null,null,null,""]
[null,null,null,null,null,null,null,null,"",null,null,null,""]
[null,null,null,null,null,null,null,null,"",null,null,null,""]
[null,null,null,null,null,null,null,null,"",null,null,null,""]
[null,null,null,null,null,null,null,null,"",null,null,null,""]
[null,null,null,null,null,null,null,null,"",null,null,null,""]
[null,null,null,null,null,null,null,null,"",null,null,null,""]
[null,null,null,null,null,null,null,null,"",null,null,null,""]
[null,null,null,null,null,null,null,null,"",null,null,null,""]
[null,null,null,null,null,null,null,null,"",null,null,null,""]
[null,null,null,null,null,null,null,null,"",null,null,null,""]
[null,null,null,null,null,null,null,null,"",null,null,null,""]
[null,null,null,null,null,null,null,null,"",null,null,null,""]
[null,null,null,null,null,null,null,null,"",null,null,null,""]
[null,null,null,null,null,null,null,null,"",null,null,null,""]
[null,null,null,null,null,null,null,null,"",null,null,null,""]
[null,null,null,null,null,null,null,null,"",null,null,null,""]
[null,null,null,null,null,null,null,null,"",null,null,null,""]
[null,null,null,null,null,null,null,null,"",null,null,null,""]
[null,null,null,null,null,null,null,null,"",null,null,null,""]
[null,null,null,null,null,null,null,null,"",null,null,null,""]
[null,null,null,null,null,null,null,null,"",null,null,null,""]
[null,null,null,null,null,null,null,null,"",null,null,null,""]
[null,null,null,null,null,null,null,null,"",null,null,null,""]
[null,null,null,null,null,null,null,null,"",null,null,null,""]
[null,null,null,null,null,null,null,null,"",null,null,null,""]
[null,null,null,null,null,null,null,null,"",null,null,null,""]
[null,null,null,null,null,null,null,null,"",null,null,null,""]
[null,null,null,null,null,null,null,null,"",null,null,null,""]
[null,null,null,null,null,null,null,null,"",null,null,null,""]
[null,null,null,null,null,null,null,null,"",null,null,null,""]
[null,null,null,null,null,null,null,null,"",null,null,null,""]
[null,null,null,null,null,null,null,null,"",null,null,null,""]
[null,null,null,null,null,null,null,null,"",null,null,null,""]
[null,null,null,null,null,null,null,null,"",null,null,null,""]
[null,null,null,null,null,null,null,null,"",null,null,null,""]
[null,null,null,null,null,null,null,null,"",null,null,null,""]
[null,null,null,null,null,null,null,null,"",null,null,null,""]
[null,null,null,null,null,null,null,null,"",null,null,null,""]
[null,null,null,null,null,null,null,null,"",null,null,null,""]
[null,null,null,null,null,null,null,null,"",null,null,null,""]
[null,null,null,null,null,null,null,null,"",null,null,null,""]
[null,null,null,null,null,null,null,null,"",null,null,null,""]
[null,null,null,null,null,null,null,null,"",null,null,null,""]
[null,null,null,null,null,null,null,null,"",null,null,null,""]
[null,null,null,null,null,null,null,null,"",null,null,null,""]
[null,null,null,null,null,null,null,null,"",null,null,null,""]
[null,null,null,null,null,null,null,null,"",null,null,null,""]
[null,null,null,null,null,null,null,null,"",null,null,null,""]
[null,null,null,null,null,null,null,null,"",null,null,null,""]
[null,null,null,null,null,null,null,null,"",null,null,null,""]
[null,null,null,null,null,null,null,null,"",null,null,null,""]
[null,null,null,null,null,null,null,null,"",null,null,null,""]
[null,null,null,null,null,null,null,null,"",null,null,null,""]
[null,null,null,null,null,null,null,null,"",null,null,null,""]
[null,null,null,null,null,null,null,null,"",null,null,null,""]
[null,null,null,null,null,null,null,null,"",null,null,null,""]
[null,null,null,null,null,null,null,null,"",null,null,null,""]
[null,null,null,null,null,null,null,null,"",null,null,null,""]
[null,null,null,null,null,null,null,null,"",null,null,null,""]
[null,null,null,null,null,null,null,null,"",null,null,null,""]
[null,null,null,null,null,null,null,null,"",null,null,null,""]
[null,null,null,null,null,null,null,null,"",null,null,null,""]
[null,null,null,null,null,null,null,null,"",null,null,null,""]
[null,null,null,null,null,null,null,null,"",null,null,null,""]
[null,null,null,null,null,null,null,null,"",null,null,null,""]
[null,null,null,null,null,null,null,null,"",null,null,null,""]
[null,null,null,null,null,null,null,null,"",null,null,null,""]
[null,null,null,null,null,null,null,null,"",null,null,null,""]
[null,null,null,null,null,null,null,null,"",null,null,null,""]
[null,null,null,null,null,null,null,null,"",null,null,null,""]
[null,null,null,null,null,null,null,null,"",null,null,null,""]
[null,null,null,null,null,null,null,null,"",null,null,null,""]
[null,null,null,null,null,null,null,null,"",null,null,null,""]
[null,null,null,null,null,null,null,null,"",null,null,null,""]
[null,null,null,null,null,null,null,null,"",null,null,null,""]
[null,null,null,null,null,null,null,null,"",null,null,null,""]
[null,null,null,null,null,null,null,null,"",null,null,null,""]
[null,null,null,null,null,null,null,null,"",null,null,null,""]
[null,null,null,null,null,null,null,null,"",null,null,null,""]
[null,null,null,null,null,null,null,null,"",null,null,null,""]
[null,null,null,null,null,null,null,null,"",null,null,null,""]
[null,null,null,null,null,null,null,null,"",null,null,null,""]
[null,null,null,null,null,null,null,null,"",null,null,null,""]
[null,null,null,null,null,null,null,null,"",null,null,null,""]
[null,null,null,null,null,null,null,null,"",null,null,null,""]
[null,null,null,null,null,null,null,null,"",null,null,null,""]
[null,null,null,null,null,null,null,null,"",null,null,null,""]
[null,null,null,null,null,null,null,null,"",null,null,null,""]
[null,null,null,null,null,null,null,null,"",null,null,null,""]
[null,null,null,null,null,null,null,null,"",null,null,null,""]
[null,null,null,null,null,null,null,null,"",null,null,null,""]
[null,null,null,null,null,null,null,null,"",null,null,null,""]
[null,null,null,null,null,null,null,null,"",null,null,null,""]
[null,null,null,null,null,null,null,null,"",null,null,null,""]
[null,null,null,null,null,null,null,null,"",null,null,null,""]
[null,null,null,null,null,null,null,null,"",null,null,null,""]
[null,null,null,null,null,null,null,null,"",null,null,null,""]
[null,null,null,null,null,null,null,null,"",null,null,null,""]
[null,null,null,null,null,null,null,null,"",null,null,null,""]
[null,null,null,null,null,null,null,null,"",null,null,null,""]
[null,null,null,null,null,null,null,null,"",null,null,null,""]
[null,null,null,null,null,null,null,null,"",null,null,null,""]
[null,null,null,null,null,null,null,null,"",null,null,null,""]
[null,null,null,null,null,null,null,null,"",null,null,null,""]
[null,null,null,null,null,null,null,null,"",null,null,null,""]
[null,null,null,null,null,null,null,null,"",null,null,null,""]
[null,null,null,null,null,null,null,null,"",null,null,null,""]
[null,null,null,null,null,null,null,null,"",null,null,null,""]
[null,null,null,null,null,null,null,null,"",null,null,null,""]
[null,null,null,null,null,null,null,null,"",null,null,null,""]
[null,null,null,null,null,null,null,null,"",null,null,null,""]
[null,null,null,null,null,null,null,null,"",null,null,null,""]
[null,null,null,null,null,null,null,null,"",null,null,null,""]
[null,null,null,null,null,null,null,null,"",null,null,null,""]
[null,null,null,null,null,null,null,null,"",null,null,null,""]
[null,null,null,null,null,null,null,null,"",null,null,null,""]
[null,null,null,null,null,null,null,null,"",null,null,null,""]
[null,null,null,null,null,null,null,null,"",null,null,null,""]
[null,null,null,null,null,null,null,null,"",null,null,null,""]
[null,null,null,null,null,null,null,null,"",null,null,null,""]
[null,null,null,null,null,null,null,null,"",null,null,null,""]
[null,null,null,null,null,null,null,null,"",null,null,null,""]
[null,null,null,null,null,null,null,null,"",null,null,null,""]
[null,null,null,null,null,null,null,null,"",null,null,null,""]
[null,null,null,null,null,null,null,null,"",null,null,null,""]
[null,null,null,null,null,null,null,null,"",null,null,null,""]
[null,null,null,null,null,null,null,null,"",null,null,null,""]
[null,null,null,null,null,null,null,null,"",null,null,null,""]
[null,null,null,null,null,null,null,null,"",null,null,null,""]
[null,null,null,null,null,null,null,null,"",null,null,null,""]
[null,null,null,null,null,null,null,null,"",null,null,null,""]
[null,null,null,null,null,null,null,null,"",null,null,null,""]
[null,null,null,null,null,null,null,null,"",null,null,null,""]
[null,null,null,null,null,null,null,null,"",null,null,null,""]
[null,null,null,null,null,null,null,null,"",null,null,null,""]
[null,null,null,null,null,null,null,null,"",null,null,null,""]
[null,null,null,null,null,null,null,null,"",null,null,null,""]
[null,null,null,null,null,null,null,null,"",null,null,null,""]
[null,null,null,null,null,null,null,null,"",null,null,null,""]
[null,null,null,null,null,null,null,null,"",null,null,null,""]
[null,null,null,null,null,null,null,null,"",null,null,null,""]
[null,null,null,null,null,null,null,null,"",null,null,null,""]
[null,null,null,null,null,null,null,null,"",null,null,null,""]
[null,null,null,null,null,null,null,null,"",null,null,null,""]
[null,null,null,null,null,null,null,null,"",null,null,null,""]
[null,null,null,null,null,null,null,null,"",null,null,null,""]
[null,null,null,null,null,null,null,null,"",null,null,null,""]
[null,null,null,null,null,null,null,null,"",null,null,null,""]
[null,null,null,null,null,null,null,null,"",null,null,null,""]
[null,null,null,null,null,null,null,null,"",null,null,null,""]
[null,null,null,null,null,null,null,null,"",null,null,null,""]
[null,null,null,null,null,null,null,null,"",null,null,null,""]
[null,null,null,null,null,null,null,null,"",null,null,null,""]
[null,null,null,null,null,null,null,null,"",null,null,null,""]
[null,null,null,null,null,null,null,null,"",null,null,null,""]
[null,null,null,null,null,null,null,null,"",null,null,null,""]
[null,null,null,null,null,null,null,null,"",null,null,null,""]
[null,null,null,null,null,null,null,null,"",null,null,null,""]
[null,null,null,null,null,null,null,null,"",null,null,null,""]
[null,null,null,null,null,null,null,null,"",null,null,null,""]
[null,null,null,null,null,null,null,null,"",null,null,null,""]
[null,null,null,null,null,null,null,null,"",null,null,null,""]
[null,null,null,null,null,null,null,null,"",null,null,null,""]
[null,null,null,null,null,null,null,null,"",null,null,null,""]
[null,null,null,null,null,null,null,null,"",null,null,null,""]
[null,null,null,null,null,null,null,null,"",null,null,null,""]
[null,null,null,null,null,null,null,null,"",null,null,null,""]
[null,null,null,null,null,null,null,null,"",null,null,null,""]
[null,null,null,null,null,null,null,null,"",null,null,null,""]
[null,null,null,null,null,null,null,null,"",null,null,null,""]
[null,null,null,null,null,null,null,null,"",null,null,null,""]
[null,null,null,null,null,null,null,null,"",null,null,null,""]
[null,null,null,null,null,null,null,null,"",null,null,null,""]
[null,null,null,null,null,null,null,null,"",null,null,null,""]
[null,null,null,null,null,null,null,null,"",null,null,null,""]
[null,null,null,null,null,null,null,null,"",null,null,null,""]
[null,null,null,null,null,null,null,null,"",null,null,null,""]
[null,null,null,null,null,null,null,null,"",null,null,null,""]
[null,null,null,null,null,null,null,null,"",null,null,null,""]
[null,null,null,null,null,null,null,null,"",null,null,null,""]
[null,null,null,null,null,null,null,null,"",null,null,null,""]
[null,null,null,null,null,null,null,null,"",null,null,null,""]
[null,null,null,null,null,null,null,null,"",null,null,null,""]
[null,null,null,null,null,null,null,null,"",null,null,null,""]
[null,null,null,null,null,null,null,null,"",null,null,null,""]
[null,null,null,null,null,null,null,null,"",null,null,null,""]
[null,null,null,null,null,null,null,null,"",null,null,null,""]
[null,null,null,null,null,null,null,null,"",null,null,null,""]
[null,null,null,null,null,null,null,null,"",null,null,null,""]
[null,null,null,null,null,null,null,null,"",null,null,null,""]
[null,null,null,null,null,null,null,null,"",null,null,null,""]
[null,null,null,null,null,null,null,null,"",null,null,null,""]
[null,null,null,null,null,null,null,null,"",null,null,null,""]
[null,null,null,null,null,null,null,null,"",null,null,null,""]
[null,null,null,null,null,null,null,null,"",null,null,null,""]
[null,null,null,null,null,null,null,null,"",null,null,null,""]
[null,null,null,null,null,null,null,null,"",null,null,null,""]
[null,null,null,null,null,null,null,null,"",null,null,null,""]
[null,null,null,null,null,null,null,null,"",null,null,null,""]
[null,null,null,null,null,null,null,null,"",null,null,null,""]
[null,null,null,null,null,null,null,null,"",null,null,null,""]
[null,null,null,null,null,null,null,null,"",null,null,null,""]
[null,null,null,null,null,null,null,null,"",null,null,null,""]
[null,null,null,null,null,null,null,null,"",null,null,null,""]
[null,null,null,null,null,null,null,null,"",null,null,null,""]
[null,null,null,null,null,null,null,null,"",null,null,null,""]
[null,null,null,null,null,null,null,null,"",null,null,null,""]
[null,null,null,null,null,null,null,null,"",null,null,null,""]
[null,null,null,null,null,null,null,null,"",null,null,null,""]
[null,null,null,null,null,null,null,null,"",null,null,null,""]
[null,null,null,null,null,null,null,null,"",null,null,null,""]
[null,null,null,null,null,null,null,null,"",null,null,null,""]
[null,null,null,null,null,null,null,null,"",null,null,null,""]
[null,null,null,null,null,null,null,null,"",null,null,null,""]
[null,null,null,null,null,null,null,null,"",null,null,null,""]
[null,null,null,null,null,null,null,null,"",null,null,null,""]
[null,null,null,null,null,null,null,null,"",null,null,null,""]
[null,null,null,null,null,null,null,null,"",null,null,null,""]
[null,null,null,null,null,null,null,null,"",null,null,null,""]
[null,null,null,null,null,null,null,null,"",null,null,null,""]
[null,null,null,null,null,null,null,null,"",null,null,null,""]
[null,null,null,null,null,null,null,null,"",null,null,null,""]
[null,null,null,null,null,null,null,null,"",null,null,null,""]
[null,null,null,null,null,null,null,null,"",null,null,null,""]
[null,null,null,null,null,null,null,null,"",null,null,null,""]
[null,null,null,null,null,null,null,null,"",null,null,null,""]
[null,null,null,null,null,null,null,null,"",null,null,null,""]
[null,null,null,null,null,null,null,null,"",null,null,null,""]
[null,null,null,null,null,null,null,null,"",null,null,null,""]
[null,null,null,null,null,null,null,null,"",null,null,null,""]
[null,null,null,null,null,null,null,null,"",null,null,null,""]
[null,null,null,null,null,null,null,null,"",null,null,null,""]
[null,null,null,null,null,null,null,null,"",null,null,null,""]
[null,null,null,null,null,null,null,null,"",null,null,null,""]
[null,null,null,null,null,null,null,null,"",null,null,null,""]
[null,null,null,null,null,null,null,null,"",null,null,null,""]
[null,null,null,null,null,null,null,null,"",null,null,null,""]
[null,null,null,null,null,null,null,null,"",null,null,null,""]
[null,null,null,null,null,null,null,null,"",null,null,null,""]
[null,null,null,null,null,null,null,null,"",null,null,null,""]
[null,null,null,null,null,null,null,null,"",null,null,null,""]
[null,null,null,null,null,null,null,null,"",null,null,null,""]
[null,null,null,null,null,null,null,null,"",null,null,null,""]
[null,null,null,null,null,null,null,null,"",null,null,null,""]
[null,null,null,null,null,null,null,null,"",null,null,null,""]
[null,null,null,null,null,null,null,null,"",null,null,null,""]
[null,null,null,null,null,null,null,null,"",null,null,null,""]
[null,null,null,null,null,null,null,null,"",null,null,null,""]
[null,null,null,null,null,null,null,null,"",null,null,null,""]
[null,null,null,null,null,null,null,null,"",null,null,null,""]
[null,null,null,null,null,null,null,null,"",null,null,null,""]
[null,null,null,null,null,null,null,null,"",null,null,null,""]
[null,null,null,null,null,null,null,null,"",null,null,null,""]
[null,null,null,null,null,null,null,null,"",null,null,null,""]
[null,null,null,null,null,null,null,null,"",null,null,null,""]
[null,null,null,null,null,null,null,null,"",null,null,null,""]
[null,null,null,null,null,null,null,null,"",null,null,null,""]
[null,null,null,null,null,null,null,null,"",null,null,null,""]
[null,null,null,null,null,null,null,null,"",null,null,null,""]
[null,null,null,null,null,null,null,null,"",null,null,null,""]
[null,null,null,null,null,null,null,null,"",null,null,null,""]
[null,null,null,null,null,null,null,null,"",null,null,null,""]
[null,null,null,null,null,null,null,null,"",null,null,null,""]
[null,null,null,null,null,null,null,null,"",null,null,null,""]
[null,null,null,null,null,null,null,null,"",null,null,null,""]
[null,null,null,null,null,null,null,null,"",null,null,null,""]
[null,null,null,null,null,null,null,null,"",null,null,null,""]
[null,null,null,null,null,null,null,null,"",null,null,null,""]
[null,null,null,null,null,null,null,null,"",null,null,null,""]
[null,null,null,null,null,null,null,null,"",null,null,null,""]
[null,null,null,null,null,null,null,null,"",null,null,null,""]
[null,null,null,null,null,null,null,null,"",null,null,null,""]
[null,null,null,null,null,null,null,null,"",null,null,null,""]
[null,null,null,null,null,null,null,null,"",null,null,null,""]
[null,null,null,null,null,null,null,null,"",null,null,null,""]
[null,null,null,null,null,null,null,null,"",null,null,null,""]
[null,null,null,null,null,null,null,null,"",null,null,null,""]
[null,null,null,null,null,null,null,null,"",null,null,null,""]
[null,null,null,null,null,null,null,null,"",null,null,null,""]
[null,null,null,null,null,null,null,null,"",null,null,null,""]
[null,null,null,null,null,null,null,null,"",null,null,null,""]
[null,null,null,null,null,null,null,null,"",null,null,null,""]
[null,null,null,null,null,null,null,null,"",null,null,null,""]
[null,null,null,null,null,null,null,null,"",null,null,null,""]
[null,null,null,null,null,null,null,null,"",null,null,null,""]
[null,null,null,null,null,null,null,null,"",null,null,null,""]
[null,null,null,null,null,null,null,null,"",null,null,null,""]
[null,null,null,null,null,null,null,null,"",null,null,null,""]
[null,null,null,null,null,null,null,null,"",null,null,null,""]
[null,null,null,null,null,null,null,null,"",null,null,null,""]
[null,null,null,null,null,null,null,null,"",null,null,null,""]
[null,null,null,null,null,null,null,null,"",null,null,null,""]
[null,null,null,null,null,null,null,null,"",null,null,null,""]
[null,null,null,null,null,null,null,null,"",null,null,null,""]
[null,null,null,null,null,null,null,null,"",null,null,null,""]
[null,null,null,null,null,null,null,null,"",null,null,null,""]
[null,null,null,null,null,null,null,null,"",null,null,null,""]
[null,null,null,null,null,null,null,null,"",null,null,null,""]
[null,null,null,null,null,null,null,null,"",null,null,null,""]
[null,null,null,null,null,null,null,null,"",null,null,null,""]
[null,null,null,null,null,null,null,null,"",null,null,null,""]
[null,null,null,null,null,null,null,null,"",null,null,null,""]
[null,null,null,null,null,null,null,null,"",null,null,null,""]
[null,null,null,null,null,null,null,null,"",null,null,null,""]
[null,null,null,null,null,null,null,null,"",null,null,null,""]
[null,null,null,null,null,null,null,null,"",null,null,null,""]
[null,null,null,null,null,null,null,null,"",null,null,null,""]
[null,null,null,null,null,null,null,null,"",null,null,null,""]
[null,null,null,null,null,null,null,null,"",null,null,null,""]
[null,null,null,null,null,null,null,null,"",null,null,null,""]
[null,null,null,null,null,null,null,null,"",null,null,null,""]
[null,null,null,null,null,null,null,null,"",null,null,null,""]
[null,null,null,null,null,null,null,null,"",null,null,null,""]
[null,null,null,null,null,null,null,null,"",null,null,null,""]
[null,null,null,null,null,null,null,null,"",null,null,null,""]
[null,null,null,null,null,null,null,null,"",null,null,null,""]
[null,null,null,null,null,null,null,null,"",null,null,null,""]
[null,null,null,null,null,null,null,null,"",null,null,null,""]
[null,null,null,null,null,null,null,null,"",null,null,null,""]
[null,null,null,null,null,null,null,null,"",null,null,null,""]
[null,null,null,null,null,null,null,null,"",null,null,null,""]
[null,null,null,null,null,null,null,null,"",null,null,null,""]
[null,null,null,null,null,null,null,null,"",null,null,null,""]
[null,null,null,null,null,null,null,null,"",null,null,null,""]
[null,null,null,null,null,null,null,null,"",null,null,null,""]
[null,null,null,null,null,null,null,null,"",null,null,null,""]
[null,null,null,null,null,null,null,null,"",null,null,null,""]
[null,null,null,null,null,null,null,null,"",null,null,null,""]
[null,null,null,null,null,null,null,null,"",null,null,null,""]
[null,null,null,null,null,null,null,null,"",null,null,null,""]
[null,null,null,null,null,null,null,null,"",null,null,null,""]
[null,null,null,null,null,null,null,null,"",null,null,null,""]
[null,null,null,null,null,null,null,null,"",null,null,null,""]
[null,null,null,null,null,null,null,null,"",null,null,null,""]
[null,null,null,null,null,null,null,null,"",null,null,null,""]
[null,null,null,null,null,null,null,null,"",null,null,null,""]
[null,null,null,null,null,null,null,null,"",null,null,null,""]
[null,null,null,null,null,null,null,null,"",null,null,null,""]
[null,null,null,null,null,null,null,null,"",null,null,null,""]
[null,null,null,null,null,null,null,null,"",null,null,null,""]
[null,null,null,null,null,null,null,null,"",null,null,null,""]
[null,null,null,null,null,null,null,null,"",null,null,null,""]
[null,null,null,null,null,null,null,null,"",null,null,null,""]
[null,null,null,null,null,null,null,null,"",null,null,null,""]
[null,null,null,null,null,null,null,null,"",null,null,null,""]
[null,null,null,null,null,null,null,null,"",null,null,null,""]
[null,null,null,null,null,null,null,null,"",null,null,null,""]
[null,null,null,null,null,null,null,null,"",null,null,null,""]
[null,null,null,null,null,null,null,null,"",null,null,null,""]
[null,null,null,null,null,null,null,null,"",null,null,null,""]
[null,null,null,null,null,null,null,null,"",null,null,null,""]
[null,null,null,null,null,null,null,null,"",null,null,null,""]
[null,null,null,null,null,null,null,null,"",null,null,null,""]
[null,null,null,null,null,null,null,null,"",null,null,null,""]
[null,null,null,null,null,null,null,null,"",null,null,null,""]
[null,null,null,null,null,null,null,null,"",null,null,null,""]
[null,null,null,null,null,null,null,null,"",null,null,null,""]
[null,null,null,null,null,null,null,null,"",null,null,null,""]
[null,null,null,null,null,null,null,null,"",null,null,null,""]
[null,null,null,null,null,null,null,null,"",null,null,null,""]
[null,null,null,null,null,null,null,null,"",null,null,null,""]
[null,null,null,null,null,null,null,null,"",null,null,null,""]
[null,null,null,null,null,null,null,null,"",null,null,null,""]
[null,null,null,null,null,null,null,null,"",null,null,null,""]
[null,null,null,null,null,null,null,null,"",null,null,null,""]
[null,null,null,null,null,null,null,null,"",null,null,null,""]
[null,null,null,null,null,null,null,null,"",null,null,null,""]
[null,null,null,null,null,null,null,null,"",null,null,null,""]
[null,null,null,null,null,null,null,null,"",null,null,null,""]
[null,null,null,null,null,null,null,null,"",null,null,null,""]
[null,null,null,null,null,null,null,null,"",null,null,null,""]
[null,null,null,null,null,null,null,null,"",null,null,null,""]
[null,null,null,null,null,null,null,null,"",null,null,null,""]
[null,null,null,null,null,null,null,null,"",null,null,null,""]
[null,null,null,null,null,null,null,null,"",null,null,null,""]
[null,null,null,null,null,null,null,null,"",null,null,null,""]
[null,null,null,null,null,null,null,null,"",null,null,null,""]
[null,null,null,null,null,null,null,null,"",null,null,null,""]
[null,null,null,null,null,null,null,null,"",null,null,null,""]
[null,null,null,null,null,null,null,null,"",null,null,null,""]
[null,null,null,null,null,null,null,null,"",null,null,null,""]
[null,null,null,null,null,null,null,null,"",null,null,null,""]
[null,null,null,null,null,null,null,null,"",null,null,null,""]
[null,null,null,null,null,null,null,null,"",null,null,null,""]
[null,null,null,null,null,null,null,null,"",null,null,null,""]
[null,null,null,null,null,null,null,null,"",null,null,null,""]
[null,null,null,null,null,null,null,null,"",null,null,null,""]
[null,null,null,null,null,null,null,null,"",null,null,null,""]
[null,null,null,null,null,null,null,null,"",null,null,null,""]
[null,null,null,null,null,null,null,null,"",null,null,null,""]
[null,null,null,null,null,null,null,null,"",null,null,null,""]
[null,null,null,null,null,null,null,null,"",null,null,null,""]
[null,null,null,null,null,null,null,null,"",null,null,null,""]
[null,null,null,null,null,null,null,null,"",null,null,null,""]
[null,null,null,null,null,null,null,null,"",null,null,null,""]
[null,null,null,null,null,null,null,null,"",null,null,null,""]
[null,null,null,null,null,null,null,null,"",null,null,null,""]
[null,null,null,null,null,null,null,null,"",null,null,null,""]
[null,null,null,null,null,null,null,null,"",null,null,null,""]
[null,null,null,null,null,null,null,null,"",null,null,null,""]
[null,null,null,null,null,null,null,null,"",null,null,null,""]
[null,null,null,null,null,null,null,null,"",null,null,null,""]
[null,null,null,null,null,null,null,null,"",null,null,null,""]
[null,null,null,null,null,null,null,null,"",null,null,null,""]
[null,null,null,null,null,null,null,null,"",null,null,null,""]
[null,null,null,null,null,null,null,null,"",null,null,null,""]
[null,null,null,null,null,null,null,null,"",null,null,null,""]
[null,null,null,null,null,null,null,null,"",null,null,null,""]
[null,null,null,null,null,null,null,null,"",null,null,null,""]
[null,null,null,null,null,null,null,null,"",null,null,null,""]
[null,null,null,null,null,null,null,null,"",null,null,null,""]
[null,null,null,null,null,null,null,null,"",null,null,null,""]
[null,null,null,null,null,null,null,null,"",null,null,null,""]
[null,null,null,null,null,null,null,null,"",null,null,null,""]
[null,null,null,null,null,null,null,null,"",null,null,null,""]
[null,null,null,null,null,null,null,null,"",null,null,null,""]
[null,null,null,null,null,null,null,null,"",null,null,null,""]
[null,null,null,null,null,null,null,null,"",null,null,null,""]
[null,null,null,null,null,null,null,null,"",null,null,null,""]
[null,null,null,null,null,null,null,null,"",null,null,null,""]
[null,null,null,null,null,null,null,null,"",null,null,null,""]
[null,null,null,null,null,null,null,null,"",null,null,null,""]
[null,null,null,null,null,null,null,null,"",null,null,null,""]
[null,null,null,null,null,null,null,null,"",null,null,null,""]
[null,null,null,null,null,null,null,null,"",null,null,null,""]
[null,null,null,null,null,null,null,null,"",null,null,null,""]
[null,null,null,null,null,null,null,null,"",null,null,null,""]
[null,null,null,null,null,null,null,null,"",null,null,null,""]
[null,null,null,null,null,null,null,null,"",null,null,null,""]
[null,null,null,null,null,null,null,null,"",null,null,null,""]
[null,null,null,null,null,null,null,null,"",null,null,null,""]
[null,null,null,null,null,null,null,null,"",null,null,null,""]
[null,null,null,null,null,null,null,null,"",null,null,null,""]
[null,null,null,null,null,null,null,null,"",null,null,null,""]
[null,null,null,null,null,null,null,null,"",null,null,null,""]
[null,null,null,null,null,null,null,null,"",null,null,null,""]
[null,null,null,null,null,null,null,null,"",null,null,null,""]
[null,null,null,null,null,null,null,null,"",null,null,null,""]
[null,null,null,null,null,null,null,null,"",null,null,null,""]
[null,null,null,null,null,null,null,null,"",null,null,null,""]
[null,null,null,null,null,null,null,null,"",null,null,null,""]
[null,null,null,null,null,null,null,null,"",null,null,null,""]
[null,null,null,null,null,null,null,null,"",null,null,null,""]
[null,null,null,null,null,null,null,null,"",null,null,null,""]
[null,null,null,null,null,null,null,null,"",null,null,null,""]
[null,null,null,null,null,null,null,null,"",null,null,null,""]
[null,null,null,null,null,null,null,null,"",null,null,null,""]
[null,null,null,null,null,null,null,null,"",null,null,null,""]
[null,null,null,null,null,null,null,null,"",null,null,null,""]
[null,null,null,null,null,null,null,null,"",null,null,null,""]
[null,null,null,null,null,null,null,null,"",null,null,null,""]
[null,null,null,null,null,null,null,null,"",null,null,null,""]
[null,null,null,null,null,null,null,null,"",null,null,null,""]
[null,null,null,null,null,null,null,null,"",null,null,null,""]
[null,null,null,null,null,null,null,null,"",null,null,null,""]
[null,null,null,null,null,null,null,null,"",null,null,null,""]
[null,null,null,null,null,null,null,null,"",null,null,null,""]
[null,null,null,null,null,null,null,null,"",null,null,null,""]
[null,null,null,null,null,null,null,null,"",null,null,null,""]
[null,null,null,null,null,null,null,null,"",null,null,null,""]
[null,null,null,null,null,null,null,null,"",null,null,null,""]
[null,null,null,null,null,null,null,null,"",null,null,null,""]
[null,null,null,null,null,null,null,null,"",null,null,null,""]
[null,null,null,null,null,null,null,null,"",null,null,null,""]
[null,null,null,null,null,null,null,null,"",null,null,null,""]
[null,null,null,null,null,null,null,null,"",null,null,null,""]
[null,null,null,null,null,null,null,null,"",null,null,null,""]
[null,null,null,null,null,null,null,null,"",null,null,null,""]
[null,null,null,null,null,null,null,null,"",null,null,null,""]
[null,null,null,null,null,null,null,null,"",null,null,null,""]
[null,null,null,null,null,null,null,null,"",null,null,null,""]
[null,null,null,null,null,null,null,null,"",null,null,null,""]
[null,null,null,null,null,null,null,null,"",null,null,null,""]
[null,null,null,null,null,null,null,null,"",null,null,null,""]
[null,null,null,null,null,null,null,null,"",null,null,null,""]
[null,null,null,null,null,null,null,null,"",null,null,null,""]
[null,null,null,null,null,null,null,null,"",null,null,null,""]
[null,null,null,null,null,null,null,null,"",null,null,null,""]
[null,null,null,null,null,null,null,null,"",null,null,null,""]
[null,null,null,null,null,null,null,null,"",null,null,null,""]
[null,null,null,null,null,null,null,null,"",null,null,null,""]
[null,null,null,null,null,null,null,null,"",null,null,null,""]
[null,null,null,null,null,null,null,null,"",null,null,null,""]
[null,null,null,null,null,null,null,null,"",null,null,null,""]
[null,null,null,null,null,null,null,null,"",null,null,null,""]
[null,null,null,null,null,null,null,null,"",null,null,null,""]
[null,null,null,null,null,null,null,null,"",null,null,null,""]
[null,null,null,null,null,null,null,null,"",null,null,null,""]
[null,null,null,null,null,null,null,null,"",null,null,null,""]
[null,null,null,null,null,null,null,null,"",null,null,null,""]
[null,null,null,null,null,null,null,null,"",null,null,null,""]
[null,null,null,null,null,null,null,null,"",null,null,null,""]
[null,null,null,null,null,null,null,null,"",null,null,null,""]
[null,null,null,null,null,null,null,null,"",null,null,null,""]
[null,null,null,null,null,null,null,null,"",null,null,null,""]
[null,null,null,null,null,null,null,null,"",null,null,null,""]
[null,null,null,null,null,null,null,null,"",null,null,null,""]
[null,null,null,null,null,null,null,null,"",null,null,null,""]
[null,null,null,null,null,null,null,null,"",null,null,null,""]
[null,null,null,null,null,null,null,null,"",null,null,null,""]
[null,null,null,null,null,null,null,null,"",null,null,null,""]
[null,null,null,null,null,null,null,null,"",null,null,null,""]
[null,null,null,null,null,null,null,null,"",null,null,null,""]
[null,null,null,null,null,null,null,null,"",null,null,null,""]
[null,null,null,null,null,null,null,null,"",null,null,null,""]
[null,null,null,null,null,null,null,null,"",null,null,null,""]
[null,null,null,null,null,null,null,null,"",null,null,null,""]
[null,null,null,null,null,null,null,null,"",null,null,null,""]
[null,null,null,null,null,null,null,null,"",null,null,null,""]
[null,null,null,null,null,null,null,null,"",null,null,null,""]
[null,null,null,null,null,null,null,null,"",null,null,null,""]
[null,null,null,null,null,null,null,null,"",null,null,null,""]
[null,null,null,null,null,null,null,null,"",null,null,null,""]
[null,null,null,null,null,null,null,null,"",null,null,null,""]
[null,null,null,null,null,null,null,null,"",null,null,null,""]
[null,null,null,null,null,null,null,null,"",null,null,null,""]
[null,null,null,null,null,null,null,null,"",null,null,null,""]
[null,null,null,null,null,null,null,null,"",null,null,null,""]
[null,null,null,null,null,null,null,null,"",null,null,null,""]
[null,null,null,null,null,null,null,null,"",null,null,null,""]
[null,null,null,null,null,null,null,null,"",null,null,null,""]
[null,null,null,null,null,null,null,null,"",null,null,null,""]
[null,null,null,null,null,null,null,null,"",null,null,null,""]
[null,null,null,null,null,null,null,null,"",null,null,null,""]
[null,null,null,null,null,null,null,null,"",null,null,null,""]
[null,null,null,null,null,null,null,null,"",null,null,null,""]
[null,null,null,null,null,null,null,null,"",null,null,null,""]
[null,null,null,null,null,null,null,null,"",null,null,null,""]
[null,null,null,null,null,null,null,null,"",null,null,null,""]
[null,null,null,null,null,null,null,null,"",null,null,null,""]
[null,null,null,null,null,null,null,null,"",null,null,null,""]
[null,null,null,null,null,null,null,null,"",null,null,null,""]
[null,null,null,null,null,null,null,null,"",null,null,null,""]
[null,null,null,null,null,null,null,null,"",null,null,null,""]
[null,null,null,null,null,null,null,null,"",null,null,null,""]
[null,null,null,null,null,null,null,null,"",null,null,null,""]
[null,null,null,null,null,null,null,null,"",null,null,null,""]
[null,null,null,null,null,null,null,null,"",null,null,null,""]
[null,null,null,null,null,null,null,null,"",null,null,null,""]
[null,null,null,null,null,null,null,null,"",null,null,null,""]
[null,null,null,null,null,null,null,null,"",null,null,null,""]
[null,null,null,null,null,null,null,null,"",null,null,null,""]
[null,null,null,null,null,null,null,null,"",null,null,null,""]
[null,null,null,null,null,null,null,null,"",null,null,null,""]
[null,null,null,null,null,null,null,null,"",null,null,null,""]
[null,null,null,null,null,null,null,null,"",null,null,null,""]
[null,null,null,null,null,null,null,null,"",null,null,null,""]
[null,null,null,null,null,null,null,null,"",null,null,null,""]
[null,null,null,null,null,null,null,null,"",null,null,null,""]
[null,null,null,null,null,null,null,null,"",null,null,null,""]
[null,null,null,null,null,null,null,null,"",null,null,null,""]
[null,null,null,null,null,null,null,null,"",null,null,null,""]
[null,null,null,null,null,null,null,null,"",null,null,null,""]
[null,null,null,null,null,null,null,null,"",null,null,null,""]
[null,null,null,null,null,null,null,null,"",null,null,null,""]
[null,null,null,null,null,null,null,null,"",null,null,null,""]
[null,null,null,null,null,null,null,null,"",null,null,null,""]
[null,null,null,null,null,null,null,null,"",null,null,null,""]
[null,null,null,null,null,null,null,null,"",null,null,null,""]
[null,null,null,null,null,null,null,null,"",null,null,null,""]
[null,null,null,null,null,null,null,null,"",null,null,null,""]
[null,null,null,null,null,null,null,null,"",null,null,null,""]
[null,null,null,null,null,null,null,null,"",null,null,null,""]
[null,null,null,null,null,null,null,null,"",null,null,null,""]
[null,null,null,null,null,null,null,null,"",null,null,null,""]
[null,null,null,null,null,null,null,null,"",null,null,null,""]
[null,null,null,null,null,null,null,null,"",null,null,null,""]
[null,null,null,null,null,null,null,null,"",null,null,null,""]
[null,null,null,null,null,null,null,null,"",null,null,null,""]
[null,null,null,null,null,null,null,null,"",null,null,null,""]
[null,null,null,null,null,null,null,null,"",null,null,null,""]
[null,null,null,null,null,null,null,null,"",null,null,null,""]
[null,null,null,null,null,null,null,null,"",null,null,null,""]
[null,null,null,null,null,null,null,null,"",null,null,null,""]
[null,null,null,null,null,null,null,null,"",null,null,null,""]
[null,null,null,null,null,null,null,null,"",null,null,null,""]
[null,null,null,null,null,null,null,null,"",null,null,null,""]
[null,null,null,null,null,null,null,null,"",null,null,null,""]
[null,null,null,null,null,null,null,null,"",null,null,null,""]
[null,null,null,null,null,null,null,null,"",null,null,null,""]
[null,null,null,null,null,null,null,null,"",null,null,null,""]
[null,null,null,null,null,null,null,null,"",null,null,null,""]
[null,null,null,null,null,null,null,null,"",null,null,null,""]
[null,null,null,null,null,null,null,null,"",null,null,null,""]
[null,null,null,null,null,null,null,null,"",null,null,null,""]
[null,null,null,null,null,null,null,null,"",null,null,null,""]
[null,null,null,null,null,null,null,null,"",null,null,null,""]
[null,null,null,null,null,null,null,null,"",null,null,null,""]
[null,null,null,null,null,null,null,null,"",null,null,null,""]
[null,null,null,null,null,null,null,null,"",null,null,null,""]
[null,null,null,null,null,null,null,null,"",null,null,null,""]
[null,null,null,null,null,null,null,null,"",null,null,null,""]
[null,null,null,null,null,null,null,null,"",null,null,null,""]
[null,null,null,null,null,null,null,null,"",null,null,null,""]
[null,null,null,null,null,null,null,null,"",null,null,null,""]
[null,null,null,null,null,null,null,null,"",null,null,null,""]
[null,null,null,null,null,null,null,null,"",null,null,null,""]
[null,null,null,null,null,null,null,null,"",null,null,null,""]
[null,null,null,null,null,null,null,null,"",null,null,null,""]
[null,null,null,null,null,null,null,null,"",null,null,null,""]
[null,null,null,null,null,null,null,null,"",null,null,null,""]
[null,null,null,null,null,null,null,null,"",null,null,null,""]
[null,null,null,null,null,null,null,null,"",null,null,null,""]
[null,null,null,null,null,null,null,null,"",null,null,null,""]
[null,null,null,null,null,null,null,null,"",null,null,null,""]
[null,null,null,null,null,null,null,null,"",null,null,null,""]
[null,null,null,null,null,null,null,null,"",null,null,null,""]
[null,null,null,null,null,null,null,null,"",null,null,null,""]
[null,null,null,null,null,null,null,null,"",null,null,null,""]
[null,null,null,null,null,null,null,null,"",null,null,null,""]
[null,null,null,null,null,null,null,null,"",null,null,null,""]
[null,null,null,null,null,null,null,null,"",null,null,null,""]
[null,null,null,null,null,null,null,null,"",null,null,null,""]
[null,null,null,null,null,null,null,null,"",null,null,null,""]
[null,null,null,null,null,null,null,null,"",null,null,null,""]
[null,null,null,null,null,null,null,null,"",null,null,null,""]
[null,null,null,null,null,null,null,null,"",null,null,null,""]
[null,null,null,null,null,null,null,null,"",null,null,null,""]
[null,null,null,null,null,null,null,null,"",null,null,null,""]
[null,null,null,null,null,null,null,null,"",null,null,null,""]
[null,null,null,null,null,null,null,null,"",null,null,null,""]
[null,null,null,null,null,null,null,null,"",null,null,null,""]
[null,null,null,null,null,null,null,null,"",null,null,null,""]
[null,null,null,null,null,null,null,null,"",null,null,null,""]
[null,null,null,null,null,null,null,null,"",null,null,null,""]
[null,null,null,null,null,null,null,null,"",null,null,null,""]
[null,null,null,null,null,null,null,null,"",null,null,null,""]
[null,null,null,null,null,null,null,null,"",null,null,null,""]
[null,null,null,null,null,null,null,null,"",null,null,null,""]
[null,null,null,null,null,null,null,null,"",null,null,null,""]
[null,null,null,null,null,null,null,null,"",null,null,null,""]
[null,null,null,null,null,null,null,null,"",null,null,null,""]
[null,null,null,null,null,null,null,null,"",null,null,null,""]
[null,null,null,null,null,null,null,null,"",null,null,null,""]
[null,null,null,null,null,null,null,null,"",null,null,null,""]
[null,null,null,null,null,null,null,null,"",null,null,null,""]
[null,null,null,null,null,null,null,null,"",null,null,null,""]
[null,null,null,null,null,null,null,null,"",null,null,null,""]
[null,null,null,null,null,null,null,null,"",null,null,null,""]
[null,null,null,null,null,null,null,null,"",null,null,null,""]
[null,null,null,null,null,null,null,null,"",null,null,null,""]
[null,null,null,null,null,null,null,null,"",null,null,null,""]
[null,null,null,null,null,null,null,null,"",null,null,null,""]
[null,null,null,null,null,null,null,null,"",null,null,null,""]
[null,null,null,null,null,null,null,null,"",null,null,null,""]
[null,null,null,null,null,null,null,null,"",null,null,null,""]
[null,null,null,null,null,null,null,null,"",null,null,null,""]
[null,null,null,null,null,null,null,null,"",null,null,null,""]
[null,null,null,null,null,null,null,null,"",null,null,null,""]
[null,null,null,null,null,null,null,null,"",null,null,null,""]
[null,null,null,null,null,null,null,null,"",null,null,null,""]
[null,null,null,null,null,null,null,null,"",null,null,null,""]
[null,null,null,null,null,null,null,null,"",null,null,null,""]
[null,null,null,null,null,null,null,null,"",null,null,null,""]
[null,null,null,null,null,null,null,null,"",null,null,null,""]
[null,null,null,null,null,null,null,null,"",null,null,null,""]
[null,null,null,null,null,null,null,null,"",null,null,null,""]
[null,null,null,null,null,null,null,null,"",null,null,null,""]
[null,null,null,null,null,null,null,null,"",null,null,null,""]
[null,null,null,null,null,null,null,null,"",null,null,null,""]
[null,null,null,null,null,null,null,null,"",null,null,null,""]
[null,null,null,null,null,null,null,null,"",null,null,null,""]
[null,null,null,null,null,null,null,null,"",null,null,null,""]
[null,null,null,null,null,null,null,null,"",null,null,null,""]
[null,null,null,null,null,null,null,null,"",null,null,null,""]
[null,null,null,null,null,null,null,null,"",null,null,null,""]
[null,null,null,null,null,null,null,null,"",null,null,null,""]
[null,null,null,null,null,null,null,null,"",null,null,null,""]
[null,null,null,null,null,null,null,null,"",null,null,null,""]
[null,null,null,null,null,null,null,null,"",null,null,null,""]
[null,null,null,null,null,null,null,null,"",null,null,null,""]
[null,null,null,null,null,null,null,null,"",null,null,null,""]
[null,null,null,null,null,null,null,null,"",null,null,null,""]
[null,null,null,null,null,null,null,null,"",null,null,null,""]
[null,null,null,null,null,null,null,null,"",null,null,null,""]
[null,null,null,null,null,null,null,null,"",null,null,null,""]
[null,null,null,null,null,null,null,null,"",null,null,null,""]
[null,null,null,null,null,null,null,null,"",null,null,null,""]
[null,null,null,null,null,null,null,null,"",null,null,null,""]
[null,null,null,null,null,null,null,null,"",null,null,null,""]
[null,null,null,null,null,null,null,null,"",null,null,null,""]
[null,null,null,null,null,null,null,null,"",null,null,null,""]
[null,null,null,null,null,null,null,null,"",null,null,null,""]
[null,null,null,null,null,null,null,null,"",null,null,null,""]
[null,null,null,null,null,null,null,null,"",null,null,null,""]
[null,null,null,null,null,null,null,null,"",null,null,null,""]
[null,null,null,null,null,null,null,null,"",null,null,null,""]
[null,null,null,null,null,null,null,null,"",null,null,null,""]
[null,null,null,null,null,null,null,null,"",null,null,null,""]
[null,null,null,null,null,null,null,null,"",null,null,null,""]
[null,null,null,null,null,null,null,null,"",null,null,null,""]
[null,null,null,null,null,null,null,null,"",null,null,null,""]
[null,null,null,null,null,null,null,null,"",null,null,null,""]
[null,null,null,null,null,null,null,null,"",null,null,null,""]
[null,null,null,null,null,null,null,null,"",null,null,null,""]
[null,null,null,null,null,null,null,null,"",null,null,null,""]
[null,null,null,null,null,null,null,null,"",null,null,null,""]
[null,null,null,null,null,null,null,null,"",null,null,null,""]
[null,null,null,null,null,null,null,null,"",null,null,null,""]
[null,null,null,null,null,null,null,null,"",null,null,null,""]
[null,null,null,null,null,null,null,null,"",null,null,null,""]
[null,null,null,null,null,null,null,null,"",null,null,null,""]
[null,null,null,null,null,null,null,null,"",null,null,null,""]
[null,null,null,null,null,null,null,null,"",null,null,null,""]
[null,null,null,null,null,null,null,null,"",null,null,null,""]
[null,null,null,null,null,null,null,null,"",null,null,null,""]
[null,null,null,null,null,null,null,null,"",null,null,null,""]
[null,null,null,null,null,null,null,null,"",null,null,null,""]
[null,null,null,null,null,null,null,null,"",null,null,null,""]
[null,null,null,null,null,null,null,null,"",null,null,null,""]
[null,null,null,null,null,null,null,null,"",null,null,null,""]
[null,null,null,null,null,null,null,null,"",null,null,null,""]
[null,null,null,null,null,null,null,null,"",null,null,null,""]
[null,null,null,null,null,null,null,null,"",null,null,null,""]
[null,null,null,null,null,null,null,null,"",null,null,null,""]
[null,null,null,null,null,null,null,null,"",null,null,null,""]
[null,null,null,null,null,null,null,null,"",null,null,null,""]
[null,null,null,null,null,null,null,null,"",null,null,null,""]
[null,null,null,null,null,null,null,null,"",null,null,null,""]
[null,null,null,null,null,null,null,null,"",null,null,null,""]
[null,null,null,null,null,null,null,null,"",null,null,null,""]
[null,null,null,null,null,null,null,null,"",null,null,null,""]
[null,null,null,null,null,null,null,null,"",null,null,null,""]
[null,null,null,null,null,null,null,null,"",null,null,null,""]
[null,null,null,null,null,null,null,null,"",null,null,null,""]
[null,null,null,null,null,null,null,null,"",null,null,null,""]
[null,null,null,null,null,null,null,null,"",null,null,null,""]
[null,null,null,null,null,null,null,null,"",null,null,null,""]
[null,null,null,null,null,null,null,null,"",null,null,null,""]
[null,null,null,null,null,null,null,null,"",null,null,null,""]
[null,null,null,null,null,null,null,null,"",null,null,null,""]
[null,null,null,null,null,null,null,null,"",null,null,null,""]
[null,null,null,null,null,null,null,null,"",null,null,null,""]
[null,null,null,null,null,null,null,null,"",null,null,null,""]
[null,null,null,null,null,null,null,null,"",null,null,null,""]
[null,null,null,null,null,null,null,null,"",null,null,null,""]
[null,null,null,null,null,null,null,null,"",null,null,null,""]
[null,null,null,null,null,null,null,null,"",null,null,null,""]
[null,null,null,null,null,null,null,null,"",null,null,null,""]
[null,null,null,null,null,null,null,null,"",null,null,null,""]
[null,null,null,null,null,null,null,null,"",null,null,null,""]
[null,null,null,null,null,null,null,null,"",null,null,null,""]
[null,null,null,null,null,null,null,null,"",null,null,null,""]
[null,null,null,null,null,null,null,null,"",null,null,null,""]
[null,null,null,null,null,null,null,null,"",null,null,null,""]
[null,null,null,null,null,null,null,null,"",null,null,null,""]
[null,null,null,null,null,null,null,null,"",null,null,null,""]
[null,null,null,null,null,null,null,null,"",null,null,null,""]
[null,null,null,null,null,null,null,null,"",null,null,null,""]
[null,null,null,null,null,null,null,null,"",null,null,null,""]
[null,null,null,null,null,null,null,null,"",null,null,null,""]
[null,null,null,null,null,null,null,null,"",null,null,null,""]
[null,null,null,null,null,null,null,null,"",null,null,null,""]
[null,null,null,null,null,null,null,null,"",null,null,null,""]
[null,null,null,null,null,null,null,null,"",null,null,null,""]
[null,null,null,null,null,null,null,null,"",null,null,null,""]
[null,null,null,null,null,null,null,null,"",null,null,null,""]
[null,null,null,null,null,null,null,null,"",null,null,null,""]
[null,null,null,null,null,null,null,null,"",null,null,null,""]
[null,null,null,null,null,null,null,null,"",null,null,null,""]
[null,null,null,null,null,null,null,null,"",null,null,null,""]
[null,null,null,null,null,null,null,null,"",null,null,null,""]
[null,null,null,null,null,null,null,null,"",null,null,null,""]
[null,null,null,null,null,null,null,null,"",null,null,null,""]
[null,null,null,null,null,null,null,null,"",null,null,null,""]
[null,null,null,null,null,null,null,null,"",null,null,null,""]
[null,null,null,null,null,null,null,null,"",null,null,null,""]
[null,null,null,null,null,null,null,null,"",null,null,null,""]
[null,null,null,null,null,null,null,null,"",null,null,null,""]
[null,null,null,null,null,null,null,null,"",null,null,null,""]
[null,null,null,null,null,null,null,null,"",null,null,null,""]
[null,null,null,null,null,null,null,null,"",null,null,null,""]
[null,null,null,null,null,null,null,null,"",null,null,null,""]
[null,null,null,null,null,null,null,null,"",null,null,null,""]
[null,null,null,null,null,null,null,null,"",null,null,null,""]
[null,null,null,null,null,null,null,null,"",null,null,null,""]
[null,null,null,null,null,null,null,null,"",null,null,null,""]
[null,null,null,null,null,null,null,null,"",null,null,null,""]
[null,null,null,null,null,null,null,null,"",null,null,null,""]
[null,null,null,null,null,null,null,null,"",null,null,null,""]
[null,null,null,null,null,null,null,null,"",null,null,null,""]
[null,null,null,null,null,null,null,null,"",null,null,null,""]
[null,null,null,null,null,null,null,null,"",null,null,null,""]
[null,null,null,null,null,null,null,null,"",null,null,null,""]
[null,null,null,null,null,null,null,null,"",null,null,null,""]
[null,null,null,null,null,null,null,null,"",null,null,null,""]
[null,null,null,null,null,null,null,null,"",null,null,null,""]
[null,null,null,null,null,null,null,null,"",null,null,null,""]
[null,null,null,null,null,null,null,null,"",null,null,null,""]
[null,null,null,null,null,null,null,null,"",null,null,null,""]
[null,null,null,null,null,null,null,null,"",null,null,null,""]
[null,null,null,null,null,null,null,null,"",null,null,null,""]
[null,null,null,null,null,null,null,null,"",null,null,null,""]
[null,null,null,null,null,null,null,null,"",null,null,null,""]
[null,null,null,null,null,null,null,null,"",null,null,null,""]
[null,null,null,null,null,null,null,null,"",null,null,null,""]
[null,null,null,null,null,null,null,null,"",null,null,null,""]
[null,null,null,null,null,null,null,null,"",null,null,null,""]
[null,null,null,null,null,null,null,null,"",null,null,null,""]
[null,null,null,null,null,null,null,null,"",null,null,null,""]
[null,null,null,null,null,null,null,null,"",null,null,null,""]
[null,null,null,null,null,null,null,null,"",null,null,null,""]
[null,null,null,null,null,null,null,null,"",null,null,null,""]
[null,null,null,null,null,null,null,null,"",null,null,null,""]
[null,null,null,null,null,null,null,null,"",null,null,null,""]
[null,null,null,null,null,null,null,null,"",null,null,null,""]
[null,null,null,null,null,null,null,null,"",null,null,null,""]
[null,null,null,null,null,null,null,null,"",null,null,null,""]
[null,null,null,null,null,null,null,null,"",null,null,null,""]
[null,null,null,null,null,null,null,null,"",null,null,null,""]
[null,null,null,null,null,null,null,null,"",null,null,null,""]
[null,null,null,null,null,null,null,null,"",null,null,null,""]
[null,null,null,null,null,null,null,null,"",null,null,null,""]
[null,null,null,null,null,null,null,null,"",null,null,null,""]
[null,null,null,null,null,null,null,null,"",null,null,null,""]
[null,null,null,null,null,null,null,null,"",null,null,null,""]
[null,null,null,null,null,null,null,null,"",null,null,null,""]
[null,null,null,null,null,null,null,null,"",null,null,null,""]
[null,null,null,null,null,null,null,null,"",null,null,null,""]
[null,null,null,null,null,null,null,null,"",null,null,null,""]
[null,null,null,null,null,null,null,null,"",null,null,null,""]
[null,null,null,null,null,null,null,null,"",null,null,null,""]
[null,null,null,null,null,null,null,null,"",null,null,null,""]
[null,null,null,null,null,null,null,null,"",null,null,null,""]
[null,null,null,null,null,null,null,null,"",null,null,null,""]
[null,null,null,null,null,null,null,null,"",null,null,null,""]
[null,null,null,null,null,null,null,null,"",null,null,null,""]
[null,null,null,null,null,null,null,null,"",null,null,null,""]
[null,null,null,null,null,null,null,null,"",null,null,null,""]
[null,null,null,null,null,null,null,null,"",null,null,null,""]
[null,null,null,null,null,null,null,null,"",null,null,null,""]
[null,null,null,null,null,null,null,null,"",null,null,null,""]
[null,null,null,null,null,null,null,null,"",null,null,null,""]
[null,null,null,null,null,null,null,null,"",null,null,null,""]
[null,null,null,null,null,null,null,null,"",null,null,null,""]
[null,null,null,null,null,null,null,null,"",null,null,null,""]
[null,null,null,null,null,null,null,null,"",null,null,null,""]
[null,null,null,null,null,null,null,null,"",null,null,null,""]
[null,null,null,null,null,null,null,null,"",null,null,null,""]
[null,null,null,null,null,null,null,null,"",null,null,null,""]
[null,null,null,null,null,null,null,null,"",null,null,null,""]
[null,null,null,null,null,null,null,null,"",null,null,null,""]
[null,null,null,null,null,null,null,null,"",null,null,null,""]
[null,null,null,null,null,null,null,null,"",null,null,null,""]
[null,null,null,null,null,null,null,null,"",null,null,null,""]
[null,null,null,null,null,null,null,null,"",null,null,null,""]
[null,null,null,null,null,null,null,null,"",null,null,null,""]
[null,null,null,null,null,null,null,null,"",null,null,null,""]
[null,null,null,null,null,null,null,null,"",null,null,null,""]
[null,null,null,null,null,null,null,null,"",null,null,null,""]
[null,null,null,null,null,null,null,null,"",null,null,null,""]
[null,null,null,null,null,null,null,null,"",null,null,null,""]
[null,null,null,null,null,null,null,null,"",null,null,null,""]
[null,null,null,null,null,null,null,null,"",null,null,null,""]
[null,null,null,null,null,null,null,null,"",null,null,null,""]
[null,null,null,null,null,null,null,null,"",null,null,null,""]
[null,null,null,null,null,null,null,null,"",null,null,null,""]
[null,null,null,null,null,null,null,null,"",null,null,null,""]
[null,null,null,null,null,null,null,null,"",null,null,null,""]
[null,null,null,null,null,null,null,null,"",null,null,null,""]
[null,null,null,null,null,null,null,null,"",null,null,null,""]
[null,null,null,null,null,null,null,null,"",null,null,null,""]
[null,null,null,null,null,null,null,null,"",null,null,null,""]
[null,null,null,null,null,null,null,null,"",null,null,null,""]
[null,null,null,null,null,null,null,null,"",null,null,null,""]
[null,null,null,null,null,null,null,null,"",null,null,null,""]
[null,null,null,null,null,null,null,null,"",null,null,null,""]
[null,null,null,null,null,null,null,null,"",null,null,null,""]
[null,null,null,null,null,null,null,null,"",null,null,null,""]
[null,null,null,null,null,null,null,null,"",null,null,null,""]
[null,null,null,null,null,null,null,null,"",null,null,null,""]
[null,null,null,null,null,null,null,null,"",null,null,null,""]
[null,null,null,null,null,null,null,null,"",null,null,null,""]
[null,null,null,null,null,null,null,null,"",null,null,null,""]
[null,null,null,null,null,null,null,null,"",null,null,null,""]
[null,null,null,null,null,null,null,null,"",null,null,null,""]
[null,null,null,null,null,null,null,null,"",null,null,null,""]
[null,null,null,null,null,null,null,null,"",null,null,null,""]
[null,null,null,null,null,null,null,null,"",null,null,null,""]
[null,null,null,null,null,null,null,null,"",null,null,null,""]
[null,null,null,null,null,null,null,null,"",null,null,null,""]
[null,null,null,null,null,null,null,null,"",null,null,null,""]
[null,null,null,null,null,null,null,null,"",null,null,null,""]
[null,null,null,null,null,null,null,null,"",null,null,null,""]
[null,null,null,null,null,null,null,null,"",null,null,null,""]
[null,null,null,null,null,null,null,null,"",null,null,null,""]
[null,null,null,null,null,null,null,null,"",null,null,null,""]
[null,null,null,null,null,null,null,null,"",null,null,null,""]
[null,null,null,null,null,null,null,null,"",null,null,null,""]
[null,null,null,null,null,null,null,null,"",null,null,null,""]
[null,null,null,null,null,null,null,null,"",null,null,null,""]
[null,null,null,null,null,null,null,null,"",null,null,null,""]
[null,null,null,null,null,null,null,null,"",null,null,null,""]
[null,null,null,null,null,null,null,null,"",null,null,null,""]
[null,null,null,null,null,null,null,null,"",null,null,null,""]
[null,null,null,null,null,null,null,null,"",null,null,null,""]
[null,null,null,null,null,null,null,null,"",null,null,null,""]
[null,null,null,null,null,null,null,null,"",null,null,null,""]
[null,null,null,null,null,null,null,null,"",null,null,null,""]
[null,null,null,null,null,null,null,null,"",null,null,null,""]
[null,null,null,null,null,null,null,null,"",null,null,null,""]
[null,null,null,null,null,null,null,null,"",null,null,null,""]
[null,null,null,null,null,null,null,null,"",null,null,null,""]
[null,null,null,null,null,null,null,null,"",null,null,null,""]
[null,null,null,null,null,null,null,null,"",null,null,null,""]
[null,null,null,null,null,null,null,null,"",null,null,null,""]
[null,null,null,null,null,null,null,null,"",null,null,null,""]
[null,null,null,null,null,null,null,null,"",null,null,null,""]
[null,null,null,null,null,null,null,null,"",null,null,null,""]
[null,null,null,null,null,null,null,null,"",null,null,null,""]
[null,null,null,null,null,null,null,null,"",null,null,null,""]
[null,null,null,null,null,null,null,null,"",null,null,null,""]
[null,null,null,null,null,null,null,null,"",null,null,null,""]
[null,null,null,null,null,null,null,null,"",null,null,null,""]
[null,null,null,null,null,null,null,null,"",null,null,null,""]
[null,null,null,null,null,null,null,null,"",null,null,null,""]
[null,null,null,null,null,null,null,null,"",null,null,null,""]
[null,null,null,null,null,null,null,null,"",null,null,null,""]
[null,null,null,null,null,null,null,null,"",null,null,null,""]
[null,null,null,null,null,null,null,null,"",null,null,null,""]
[null,null,null,null,null,null,null,null,"",null,null,null,""]
[null,null,null,null,null,null,null,null,"",null,null,null,""]
[null,null,null,null,null,null,null,null,"",null,null,null,""]
[null,null,null,null,null,null,null,null,"",null,null,null,""]
[null,null,null,null,null,null,null,null,"",null,null,null,""]
[null,null,null,null,null,null,null,null,"",null,null,null,""]
[null,null,null,null,null,null,null,null,"",null,null,null,""]
[null,null,null,null,null,null,null,null,"",null,null,null,""]
[null,null,null,null,null,null,null,null,"",null,null,null,""]
[null,null,null,null,null,null,null,null,"",null,null,null,""]
[null,null,null,null,null,null,null,null,"",null,null,null,""]
[null,null,null,null,null,null,null,null,"",null,null,null,""]
[null,null,null,null,null,null,null,null,"",null,null,null,""]
[null,null,null,null,null,null,null,null,"",null,null,null,""]
[null,null,null,null,null,null,null,null,"",null,null,null,""]
[null,null,null,null,null,null,null,null,"",null,null,null,""]
[null,null,null,null,null,null,null,null,"",null,null,null,""]
[null,null,null,null,null,null,null,null,"",null,null,null,""]
[null,null,null,null,null,null,null,null,"",null,null,null,""]
[null,null,null,null,null,null,null,null,"",null,null,null,""]
[null,null,null,null,null,null,null,null,"",null,null,null,""]
[null,null,null,null,null,null,null,null,"",null,null,null,""]
[null,null,null,null,null,null,null,null,"",null,null,null,""]
[null,null,null,null,null,null,null,null,"",null,null,null,""]
[null,null,null,null,null,null,null,null,"",null,null,null,""]
[null,null,null,null,null,null,null,null,"",null,null,null,""]
[null,null,null,null,null,null,null,null,"",null,null,null,""]
[null,null,null,null,null,null,null,null,"",null,null,null,""]
[null,null,null,null,null,null,null,null,"",null,null,null,""]
[null,null,null,null,null,null,null,null,"",null,null,null,""]
[null,null,null,null,null,null,null,null,"",null,null,null,""]
[null,null,null,null,null,null,null,null,"",null,null,null,""]
[null,null,null,null,null,null,null,null,"",null,null,null,""]
[null,null,null,null,null,null,null,null,"",null,null,null,""]
[null,null,null,null,null,null,null,null,"",null,null,null,""]
[null,null,null,null,null,null,null,null,"",null,null,null,""]
[null,null,null,null,null,null,null,null,"",null,null,null,""]
[null,null,null,null,null,null,null,null,"",null,null,null,""]
[null,null,null,null,null,null,null,null,"",null,null,null,""]
[null,null,null,null,null,null,null,null,"",null,null,null,""]
[null,null,null,null,null,null,null,null,"",null,null,null,""]
[null,null,null,null,null,null,null,null,"",null,null,null,""]
[null,null,null,null,null,null,null,null,"",null,null,null,""]
[null,null,null,null,null,null,null,null,"",null,null,null,""]
[null,null,null,null,null,null,null,null,"",null,null,null,""]
[null,null,null,null,null,null,null,null,"",null,null,null,""]
[null,null,null,null,null,null,null,null,"",null,null,null,""]
[null,null,null,null,null,null,null,null,"",null,null,null,""]
[null,null,null,null,null,null,null,null,"",null,null,null,""]
[null,null,null,null,null,null,null,null,"",null,null,null,""]
[null,null,null,null,null,null,null,null,"",null,null,null,""]
[null,null,null,null,null,null,null,null,"",null,null,null,""]
[null,null,null,null,null,null,null,null,"",null,null,null,""]
[null,null,null,null,null,null,null,null,"",null,null,null,""]
[null,null,null,null,null,null,null,null,"",null,null,null,""]
[null,null,null,null,null,null,null,null,"",null,null,null,""]
[null,null,null,null,null,null,null,null,"",null,null,null,""]
[null,null,null,null,null,null,null,null,"",null,null,null,""]
[null,null,null,null,null,null,null,null,"",null,null,null,""]
[null,null,null,null,null,null,null,null,"",null,null,null,""]
[null,null,null,null,null,null,null,null,"",null,null,null,""]
[null,null,null,null,null,null,null,null,"",null,null,null,""]
[null,null,null,null,null,null,null,null,"",null,null,null,""]
[null,null,null,null,null,null,null,null,"",null,null,null,""]
[null,null,null,null,null,null,null,null,"",null,null,null,""]
[null,null,null,null,null,null,null,null,"",null,null,null,""]
[null,null,null,null,null,null,null,null,"",null,null,null,""]
[null,null,null,null,null,null,null,null,"",null,null,null,""]
[null,null,null,null,null,null,null,null,"",null,null,null,""]
[null,null,null,null,null,null,null,null,"",null,null,null,""]
[null,null,null,null,null,null,null,null,"",null,null,null,""]
[null,null,null,null,null,null,null,null,"",null,null,null,""]
[null,null,null,null,null,null,null,null,"",null,null,null,""]
[null,null,null,null,null,null,null,null,"",null,null,null,""]
[null,null,null,null,null,null,null,null,"",null,null,null,""]
[null,null,null,null,null,null,null,null,"",null,null,null,""]
[null,null,null,null,null,null,null,null,"",null,null,null,""]
[null,null,null,null,null,null,null,null,"",null,null,null,""]
[null,null,null,null,null,null,null,null,"",null,null,null,""]
[null,null,null,null,null,null,null,null,"",null,null,null,""]
[null,null,null,null,null,null,null,null,"",null,null,null,""]
[null,null,null,null,null,null,null,null,"",null,null,null,""]
[null,null,null,null,null,null,null,null,"",null,null,null,""]
[null,null,null,null,null,null,null,null,"",null,null,null,""]
[null,null,null,null,null,null,null,null,"",null,null,null,""]
[null,null,null,null,null,null,null,null,"",null,null,null,""]
[null,null,null,null,null,null,null,null,"",null,null,null,""]
[null,null,null,null,null,null,null,null,"",null,null,null,""]
[null,null,null,null,null,null,null,null,"",null,null,null,""]
[null,null,null,null,null,null,null,null,"",null,null,null,""]
[null,null,null,null,null,null,null,null,"",null,null,null,""]
[null,null,null,null,null,null,null,null,"",null,null,null,""]
[null,null,null,null,null,null,null,null,"",null,null,null,""]
[null,null,null,null,null,null,null,null,"",null,null,null,""]
[null,null,null,null,null,null,null,null,"",null,null,null,""]
[null,null,null,null,null,null,null,null,"",null,null,null,""]
[null,null,null,null,null,null,null,null,"",null,null,null,""]
[null,null,null,null,null,null,null,null,"",null,null,null,""]
[null,null,null,null,null,null,null,null,"",null,null,null,""]
[null,null,null,null,null,null,null,null,"",null,null,null,""]
[null,null,null,null,null,null,null,null,"",null,null,null,""]
[null,null,null,null,null,null,null,null,"",null,null,null,""]
[null,null,null,null,null,null,null,null,"",null,null,null,""]
[null,null,null,null,null,null,null,null,"",null,null,null,""]
[null,null,null,null,null,null,null,null,"",null,null,null,""]
[null,null,null,null,null,null,null,null,"",null,null,null,""]
[null,null,null,null,null,null,null,null,"",null,null,null,""]
[null,null,null,null,null,null,null,null,"",null,null,null,""]
[null,null,null,null,null,null,null,null,"",null,null,null,""]
[null,null,null,null,null,null,null,null,"",null,null,null,""]
[null,null,null,null,null,null,null,null,"",null,null,null,""]
[null,null,null,null,null,null,null,null,"",null,null,null,""]
[null,null,null,null,null,null,null,null,"",null,null,null,""]
[null,null,null,null,null,null,null,null,"",null,null,null,""]
[null,null,null,null,null,null,null,null,"",null,null,null,""]
[null,null,null,null,null,null,null,null,"",null,null,null,""]
[null,null,null,null,null,null,null,null,"",null,null,null,""]
[null,null,null,null,null,null,null,null,"",null,null,null,""]
[null,null,null,null,null,null,null,null,"",null,null,null,""]
[null,null,null,null,null,null,null,null,"",null,null,null,""]
[null,null,null,null,null,null,null,null,"",null,null,null,""]
[null,null,null,null,null,null,null,null,"",null,null,null,""]
[null,null,null,null,null,null,null,null,"",null,null,null,""]
[null,null,null,null,null,null,null,null,"",null,null,null,""]
[null,null,null,null,null,null,null,null,"",null,null,null,""]
[null,null,null,null,null,null,null,null,"",null,null,null,""]
[null,null,null,null,null,null,null,null,"",null,null,null,""]
[null,null,null,null,null,null,null,null,"",null,null,null,""]
[null,null,null,null,null,null,null,null,"",null,null,null,""]
[null,null,null,null,null,null,null,null,"",null,null,null,""]
[null,null,null,null,null,null,null,null,"",null,null,null,""]
[null,null,null,null,null,null,null,null,"",null,null,null,""]
[null,null,null,null,null,null,null,null,"",null,null,null,""]
[null,null,null,null,null,null,null,null,"",null,null,null,""]
[null,null,null,null,null,null,null,null,"",null,null,null,""]
[null,null,null,null,null,null,null,null,"",null,null,null,""]
[null,null,null,null,null,null,null,null,"",null,null,null,""]
[null,null,null,null,null,null,null,null,"",null,null,null,""]
[null,null,null,null,null,null,null,null,"",null,null,null,""]
[null,null,null,null,null,null,null,null,"",null,null,null,""]
[null,null,null,null,null,null,null,null,"",null,null,null,""]
[null,null,null,null,null,null,null,null,"",null,null,null,""]
[null,null,null,null,null,null,null,null,"",null,null,null,""]
[null,null,null,null,null,null,null,null,"",null,null,null,""]
[null,null,null,null,null,null,null,null,"",null,null,null,""]
[null,null,null,null,null,null,null,null,"",null,null,null,""]
[null,null,null,null,null,null,null,null,"",null,null,null,""]
[null,null,null,null,null,null,null,null,"",null,null,null,""]
[null,null,null,null,null,null,null,null,"",null,null,null,""]
[null,null,null,null,null,null,null,null,"",null,null,null,""]
[null,null,null,null,null,null,null,null,"",null,null,null,""]
[null,null,null,null,null,null,null,null,"",null,null,null,""]
[null,null,null,null,null,null,null,null,"",null,null,null,""]
[null,null,null,null,null,null,null,null,"",null,null,null,""]
[null,null,null,null,null,null,null,null,"",null,null,null,""]
[null,null,null,null,null,null,null,null,"",null,null,null,""]
[null,null,null,null,null,null,null,null,"",null,null,null,""]
[null,null,null,null,null,null,null,null,"",null,null,null,""]
[null,null,null,null,null,null,null,null,"",null,null,null,""]
[null,null,null,null,null,null,null,null,"",null,null,null,""]
[null,null,null,null,null,null,null,null,"",null,null,null,""]
[null,null,null,null,null,null,null,null,"",null,null,null,""]
[null,null,null,null,null,null,null,null,"",null,null,null,""]
[null,null,null,null,null,null,null,null,"",null,null,null,""]
[null,null,null,null,null,null,null,null,"",null,null,null,""]
[null,null,null,null,null,null,null,null,"",null,null,null,""]
[null,null,null,null,null,null,null,null,"",null,null,null,""]
[null,null,null,null,null,null,null,null,"",null,null,null,""]
[null,null,null,null,null,null,null,null,"",null,null,null,""]
[null,null,null,null,null,null,null,null,"",null,null,null,""]
[null,null,null,null,null,null,null,null,"",null,null,null,""]
[null,null,null,null,null,null,null,null,"",null,null,null,""]
[null,null,null,null,null,null,null,null,"",null,null,null,""]
[null,null,null,null,null,null,null,null,"",null,null,null,""]
[null,null,null,null,null,null,null,null,"",null,null,null,""]
[null,null,null,null,null,null,null,null,"",null,null,null,""]
[null,null,null,null,null,null,null,null,"",null,null,null,""]
[null,null,null,null,null,null,null,null,"",null,null,null,""]
[null,null,null,null,null,null,null,null,"",null,null,null,""]
[null,null,null,null,null,null,null,null,"",null,null,null,""]
[null,null,null,null,null,null,null,null,"",null,null,null,""]
[null,null,null,null,null,null,null,null,"",null,null,null,""]
[null,null,null,null,null,null,null,null,"",null,null,null,""]
[null,null,null,null,null,null,null,null,"",null,null,null,""]
[null,null,null,null,null,null,null,null,"",null,null,null,""]
[null,null,null,null,null,null,null,null,"",null,null,null,""]
[null,null,null,null,null,null,null,null,"",null,null,null,""]
[null,null,null,null,null,null,null,null,"",null,null,null,""]
[null,null,null,null,null,null,null,null,"",null,null,null,""]
[null,null,null,null,null,null,null,null,"",null,null,null,""]
[null,null,null,null,null,null,null,null,"",null,null,null,""]
[null,null,null,null,null,null,null,null,"",null,null,null,""]
[null,null,null,null,null,null,null,null,"",null,null,null,""]
[null,null,null,null,null,null,null,null,"",null,null,null,""]
[null,null,null,null,null,null,null,null,"",null,null,null,""]
[null,null,null,null,null,null,null,null,"",null,null,null,""]
[null,null,null,null,null,null,null,null,"",null,null,null,""]
[null,null,null,null,null,null,null,null,"",null,null,null,""]
[null,null,null,null,null,null,null,null,"",null,null,null,""]
[null,null,null,null,null,null,null,null,"",null,null,null,""]
[null,null,null,null,null,null,null,null,"",null,null,null,""]
[null,null,null,null,null,null,null,null,"",null,null,null,""]
[null,null,null,null,null,null,null,null,"",null,null,null,""]
[null,null,null,null,null,null,null,null,"",null,null,null,""]
[null,null,null,null,null,null,null,null,"",null,null,null,""]
[null,null,null,null,null,null,null,null,"",null,null,null,""]
[null,null,null,null,null,null,null,null,"",null,null,null,""]
[null,null,null,null,null,null,null,null,"",null,null,null,""]
[null,null,null,null,null,null,null,null,"",null,null,null,""]
[null,null,null,null,null,null,null,null,"",null,null,null,""]
[null,null,null,null,null,null,null,null,"",null,null,null,""]
[null,null,null,null,null,null,null,null,"",null,null,null,""]
[null,null,null,null,null,null,null,null,"",null,null,null,""]
[null,null,null,null,null,null,null,null,"",null,null,null,""]
[null,null,null,null,null,null,null,null,"",null,null,null,""]
[null,null,null,null,null,null,null,null,"",null,null,null,""]
[null,null,null,null,null,null,null,null,"",null,null,null,""]
[null,null,null,null,null,null,null,null,"",null,null,null,""]
[null,null,null,null,null,null,null,null,"",null,null,null,""]
[null,null,null,null,null,null,null,null,"",null,null,null,""]
[null,null,null,null,null,null,null,null,"",null,null,null,""]
[null,null,null,null,null,null,null,null,"",null,null,null,""]
[null,null,null,null,null,null,null,null,"",null,null,null,""]
[null,null,null,null,null,null,null,null,"",null,null,null,""]
[null,null,null,null,null,null,null,null,"",null,null,null,""]
[null,null,null,null,null,null,null,null,"",null,null,null,""]
[null,null,null,null,null,null,null,null,"",null,null,null,""]
[null,null,null,null,null,null,null,null,"",null,null,null,""]
[null,null,null,null,null,null,null,null,"",null,null,null,""]
[null,null,null,null,null,null,null,null,"",null,null,null,""]
[null,null,null,null,null,null,null,null,"",null,null,null,""]
[null,null,null,null,null,null,null,null,"",null,null,null,""]
[null,null,null,null,null,null,null,null,"",null,null,null,""]
[null,null,null,null,null,null,null,null,"",null,null,null,""]
[null,null,null,null,null,null,null,null,"",null,null,null,""]
[null,null,null,null,null,null,null,null,"",null,null,null,""]
[null,null,null,null,null,null,null,null,"",null,null,null,""]
[null,null,null,null,null,null,null,null,"",null,null,null,""]
[null,null,null,null,null,null,null,null,"",null,null,null,""]
[null,null,null,null,null,null,null,null,"",null,null,null,""]
[null,null,null,null,null,null,null,null,"",null,null,null,""]
[null,null,null,null,null,null,null,null,"",null,null,null,""]
[null,null,null,null,null,null,null,null,"",null,null,null,""]
[null,null,null,null,null,null,null,null,"",null,null,null,""]
[null,null,null,null,null,null,null,null,"",null,null,null,""]
[null,null,null,null,null,null,null,null,"",null,null,null,""]
[null,null,null,null,null,null,null,null,"",null,null,null,""]
[null,null,null,null,null,null,null,null,"",null,null,null,""]
[null,null,null,null,null,null,null,null,"",null,null,null,""]
[null,null,null,null,null,null,null,null,"",null,null,null,""]
[null,null,null,null,null,null,null,null,"",null,null,null,""]
[null,null,null,null,null,null,null,null,"",null,null,null,""]
[null,null,null,null,null,null,null,null,"",null,null,null,""]
[null,null,null,null,null,null,null,null,"",null,null,null,""]
[null,null,null,null,null,null,null,null,"",null,null,null,""]
[null,null,null,null,null,null,null,null,"",null,null,null,""]
[null,null,null,null,null,null,null,null,"",null,null,null,""]
[null,null,null,null,null,null,null,null,"",null,null,null,""]
[null,null,null,null,null,null,null,null,"",null,null,null,""]
[null,null,null,null,null,null,null,null,"",null,null,null,""]
[null,null,null,null,null,null,null,null,"",null,null,null,""]
[null,null,null,null,null,null,null,null,"",null,null,null,""]
[null,null,null,null,null,null,null,null,"",null,null,null,""]
[null,null,null,null,null,null,null,null,"",null,null,null,""]
[null,null,null,null,null,null,null,null,"",null,null,null,""]
[null,null,null,null,null,null,null,null,"",null,null,null,""]
[null,null,null,null,null,null,null,null,"",null,null,null,""]
[null,null,null,null,null,null,null,null,"",null,null,null,""]
[null,null,null,null,null,null,null,null,""]
[null,null,null,null,null,null,null,null,""]
[null,null,null,null,null,null,null,null,""]
[null,null,null,null,null,null,null,null,""]
[null,null,null,null,null,null,null,null,""]
[null,null,null,null,null,null,null,null,""]
[null,null,null,null,null,null,null,null,""]
[null,null,null,null,null,null,null,null,""]
[null,null,null,null,null,null,null,null,""]
[null,null,null,null,null,null,null,null,""]
[null,null,null,null,null,null,null,null,""]
[null,null,null,null,null,null,null,null,""]
[null,null,null,null,null,null,null,null,""]
[null,null,null,null,null,null,null,null,""]
[null,null,null,null,null,null,null,null,""]
[null,null,null,null,null,null,null,null,""]
[null,null,null,null,null,null,null,null,""]
[null,null,null,null,null,null,null,null,""]
[null,null,null,null,null,null,null,null,""]
[null,null,null,null,null,null,null,null,""]
[null,null,null,null,null,null,null,null,""]
[null,null,null,null,null,null,null,null,""]
[null,null,null,null,null,null,null,null,""]
[null,null,null,null,null,null,null,null,""]
[null,null,null,null,null,null,null,null,""]
[null,null,null,null,null,null,null,null,""]
[null,null,null,null,null,null,null,null,""]
[null,null,null,null,null,null,null,null,""]
[null,null,null,null,null,null,null,null,""]
[null,null,null,null,null,null,null,null,""]
[null,null,null,null,null,null,null,null,""]
[null,null,null,null,null,null,null,null,""]
[null,null,null,null,null,null,null,null,""]
[null,null,null,null,null,null,null,null,""]
[null,null,null,null,null,null,null,null,""]
[null,null,null,null,null,null,null,null,""]
[null,null,null,null,null,null,null,null,""]
[null,null,null,null,null,null,null,null,""]

{"sheet":"Input_SDMX_Period","index":8,"n_rows":1,"n_cols":1,"rows_kept":1,"cut":false,"hidden":true,"merged":[]}
["TIME"]

{"sheet":"Entries","index":9,"n_rows":1,"n_cols":11,"rows_kept":1,"cut":false,"hidden":true,"merged":[]}
["COUNTRY","QUEST","PRODUCT","DATATYPE","ITEM1","ITEM2","TIME","VALUE","OBSERVATION","CONFIDENTIALITY","KEYREC"]

{"sheet":"Output_ISO_csv","index":10,"n_rows":1,"n_cols":1,"rows_kept":1,"cut":false,"hidden":true,"merged":[]}
["Output"]

{"sheet":"Output_SDMX_csv","index":11,"n_rows":1,"n_cols":1,"rows_kept":1,"cut":false,"hidden":true,"merged":[]}
["Output"]

{"sheet":"Output_SDMX_long_complete","index":12,"n_rows":1,"n_cols":22,"rows_kept":1,"cut":false,"hidden":true,"merged":[]}
["DATAFLOW","QUEST_SOURCE","REF_AREA","FREQ","ENERGY_PRODUCT","MAIN_FLOW","FLOW_BREAKDOWN","PLANT_TECH","PLANT_TYPE","STOCKS","INFRASTRUCTURE_IND","VIS_A_VIS_AREA","MEASURE_VALUE_TYPE","FACILITY_ID","TIME_PERIOD","OBS_VALUE","UNIT_MEASURE","OBS_STATUS","CONF_STATUS","COMMENT_OBS","FACILITY_TYPE","FACILITY_NAME"]

{"sheet":"Mapping_Products_Flows","index":13,"n_rows":49,"n_cols":16,"rows_kept":49,"cut":false,"hidden":true,"merged":[]}
["DATATYPE","PRODUCT","ITEM1","ITEM2","ENERGY_PRODUCT","MAIN_FLOW","FLOW_BREAKDOWN","PLANT_TECH","PLANT_TYPE","STOCKS","INFRASTRUCTURE_IND","VIS_A_VIS_AREA","MEASURE_VALUE_TYPE","FACILITY_ID","UNIT_MEASURE","ISO_EXCLUSION"]
["FLOW","HARDCOAL","INDPROD",null,"C0100","PRODUCT","_T","_Z","_Z","_Z","_Z","_Z","VOLUME","_Z","KT","y"]
["FLOW","HARDCOAL","OSOURCES",null,"C0100","PRODUCT","OSOURCES","_Z","_Z","_Z","_Z","_Z","VOLUME","_Z","KT","y"]
["FLOW","HARDCOAL","TOTIMPSB",null,"C0100","IMPORTS","TOTIMPSB","_Z","_Z","_Z","_Z","_Z","VOLUME","_Z","KT","y"]
["FLOW","HARDCOAL","TOTIMPSBEU",null,"C0100","IMPORTS","_Z","_Z","_Z","_Z","_Z","D5","VOLUME","_Z","KT","y"]
["FLOW","HARDCOAL","TOTEXPSB",null,"C0100","EXPORTS","TOTEXPSB","_Z","_Z","_Z","_Z","_Z","VOLUME","_Z","KT","y"]
["FLOW","HARDCOAL","STOCKSTART",null,"C0100","STOCKS","OPESTLV","_Z","_Z","NATTER","_Z","_Z","VOLUME","_Z","KT","y"]
["FLOW","HARDCOAL","STOCKEND",null,"C0100","STOCKS","CLOSTLV","_Z","_Z","NATTER","_Z","_Z","VOLUME","_Z","KT","y"]
["FLOW","HARDCOAL","STCHANAT",null,"C0100","STOCKS","STOCKCH","_Z","_Z","NATTER","_Z","_Z","VOLUME","_Z","KT","y"]
["FLOW","HARDCOAL","INDCONC",null,"C0100","SUPPLY","INLDEMC","_Z","_Z","_Z","_Z","_Z","VOLUME","_Z","KT","y"]
["FLOW","HARDCOAL","STATDIFF",null,"C0100","STATDIFF","_Z","_Z","_Z","_Z","_Z","_Z","VOLUME","_Z","KT","y"]
["FLOW","HARDCOAL","INTERNAD",null,"C0100","DEMAND","INLDEMO","_Z","_Z","_Z","_Z","_Z","VOLUME","_Z","KT","y"]
["FLOW","HARDCOAL","MAINPROD",null,"C0100","TRANSFOR","_Z","_Z","MAINTOT","_Z","_Z","_Z","VOLUME","_Z","KT","y"]
["FLOW","HARDCOAL","ECOKEOVS",null,"C0100","TRANSFOR","COKEOVS","_Z","_Z","_Z","_Z","_Z","VOLUME","_Z","KT","y"]
["FLOW","HARDCOAL","TOTIND",null,"C0100","CONSUMPT","INDUSTRY","_Z","_Z","_Z","_Z","_Z","VOLUME","_Z","KT","y"]
["FLOW","HARDCOAL","IRONSTL",null,"C0100","CONSUMPT","IRONSTL","_Z","_Z","_Z","_Z","_Z","VOLUME","_Z","KT","y"]
["FLOW","HARDCOAL","OTHER",null,"C0100","CONSUMPT","OTHSECT","_Z","_Z","_Z","_Z","_Z","VOLUME","_Z","KT","y"]
["FLOW","BROWN","INDPROD",null,"C0200","PRODUCT","_T","_Z","_Z","_Z","_Z","_Z","VOLUME","_Z","KT","y"]
["FLOW","BROWN","TOTIMPSB",null,"C0200","IMPORTS","TOTIMPSB","_Z","_Z","_Z","_Z","_Z","VOLUME","_Z","KT","y"]
["FLOW","BROWN","TOTEXPSB",null,"C0200","EXPORTS","TOTEXPSB","_Z","_Z","_Z","_Z","_Z","VOLUME","_Z","KT","y"]
["FLOW","BROWN","STOCKSTART",null,"C0200","STOCKS","OPESTLV","_Z","_Z","NATTER","_Z","_Z","VOLUME","_Z","KT","y"]
["FLOW","BROWN","STOCKEND",null,"C0200","STOCKS","CLOSTLV","_Z","_Z","NATTER","_Z","_Z","VOLUME","_Z","KT","y"]
["FLOW","BROWN","STCHANAT",null,"C0200","STOCKS","STOCKCH","_Z","_Z","NATTER","_Z","_Z","VOLUME","_Z","KT","y"]
["FLOW","BROWN","INDCONC",null,"C0200","SUPPLY","INLDEMC","_Z","_Z","_Z","_Z","_Z","VOLUME","_Z","KT","y"]
["FLOW","BROWN","MAINPROD",null,"C0200","TRANSFOR","_Z","_Z","MAINTOT","_Z","_Z","_Z","VOLUME","_Z","KT","y"]
["FLOW","PEAT","INDPROD",null,"P1100","PRODUCT","_T","_Z","_Z","_Z","_Z","_Z","VOLUME","_Z","KT","y"]
["FLOW","PEAT","TOTIMPSB",null,"P1100","IMPORTS","TOTIMPSB","_Z","_Z","_Z","_Z","_Z","VOLUME","_Z","KT","y"]
["FLOW","PEAT","TOTEXPSB",null,"P1100","EXPORTS","TOTEXPSB","_Z","_Z","_Z","_Z","_Z","VOLUME","_Z","KT","y"]
["FLOW","PEAT","STCHANAT",null,"P1100","STOCKS","STOCKCH","_Z","_Z","NATTER","_Z","_Z","VOLUME","_Z","KT","y"]
["FLOW","PEAT","INDCONC",null,"P1100","SUPPLY","INLDEMC","_Z","_Z","_Z","_Z","_Z","VOLUME","_Z","KT","y"]
["FLOW","PEAT","MAINPROD",null,"P1100","TRANSFOR","_Z","_Z","MAINTOT","_Z","_Z","_Z","VOLUME","_Z","KT","y"]
["FLOW","OILSHALE","INDPROD",null,"S2000","PRODUCT","_T","_Z","_Z","_Z","_Z","_Z","VOLUME","_Z","KT","y"]
["FLOW","OILSHALE","TOTIMPSB",null,"S2000","IMPORTS","TOTIMPSB","_Z","_Z","_Z","_Z","_Z","VOLUME","_Z","KT","y"]
["FLOW","OILSHALE","TOTEXPSB",null,"S2000","EXPORTS","TOTEXPSB","_Z","_Z","_Z","_Z","_Z","VOLUME","_Z","KT","y"]
["FLOW","OILSHALE","STOCKSTART",null,"S2000","STOCKS","OPESTLV","_Z","_Z","NATTER","_Z","_Z","VOLUME","_Z","KT","y"]
["FLOW","OILSHALE","STOCKEND",null,"S2000","STOCKS","CLOSTLV","_Z","_Z","NATTER","_Z","_Z","VOLUME","_Z","KT","y"]
["FLOW","OILSHALE","STCHANAT",null,"S2000","STOCKS","STOCKCH","_Z","_Z","NATTER","_Z","_Z","VOLUME","_Z","KT","y"]
["FLOW","OILSHALE","INDCONC",null,"S2000","SUPPLY","INLDEMC","_Z","_Z","_Z","_Z","_Z","VOLUME","_Z","KT","y"]
["FLOW","OILSHALE","MAINPROD",null,"S2000","TRANSFOR","_Z","_Z","MAINTOT","_Z","_Z","_Z","VOLUME","_Z","KT","y"]
["FLOW","COKEOVEN","INDPROD",null,"C0311","PRODUCT","_T","_Z","_Z","_Z","_Z","_Z","VOLUME","_Z","KT","y"]
["FLOW","COKEOVEN","TOTIMPSB",null,"C0311","IMPORTS","TOTIMPSB","_Z","_Z","_Z","_Z","_Z","VOLUME","_Z","KT","y"]
["FLOW","COKEOVEN","TOTIMPSBEU",null,"C0311","IMPORTS","_Z","_Z","_Z","_Z","_Z","D5","VOLUME","_Z","KT","y"]
["FLOW","COKEOVEN","TOTEXPSB",null,"C0311","EXPORTS","TOTEXPSB","_Z","_Z","_Z","_Z","_Z","VOLUME","_Z","KT","y"]
["FLOW","COKEOVEN","STOCKSTART",null,"C0311","STOCKS","OPESTLV","_Z","_Z","NATTER","_Z","_Z","VOLUME","_Z","KT","y"]
["FLOW","COKEOVEN","STOCKEND",null,"C0311","STOCKS","CLOSTLV","_Z","_Z","NATTER","_Z","_Z","VOLUME","_Z","KT","y"]
["FLOW","COKEOVEN","STCHANAT",null,"C0311","STOCKS","STOCKCH","_Z","_Z","NATTER","_Z","_Z","VOLUME","_Z","KT","y"]
["FLOW","COKEOVEN","INDCONC",null,"C0311","SUPPLY","INLDEMC","_Z","_Z","_Z","_Z","_Z","VOLUME","_Z","KT","y"]
["FLOW","COKEOVEN","IRONSTL",null,"C0311","CONSUMPT","IRONSTL","_Z","_Z","_Z","_Z","_Z","VOLUME","_Z","KT","y"]
[null,null,null,null,"_Z","_Z","_Z","_Z","_Z","_Z","_Z","_Z","_Z","_Z","_Z","y"]

{"sheet":"Parameters","index":14,"n_rows":21,"n_cols":7,"rows_kept":21,"cut":false,"hidden":true,"merged":[]}
["Element","Type","PosType","Position",null,"DataStart","P2"]
["QUEST_SOURCE","DIM","COLUMN","B",null,"DataEnd","P100000"]
["FREQ","DIM","COLUMN","D",null,"SkipIncompleteKeys","true"]
["REF_AREA","DIM","COLUMN","C",null,"formatValues","actualValue"]
["ENERGY_PRODUCT","DIM","COLUMN","E"]
["MAIN_FLOW","DIM","COLUMN","F"]
["FLOW_BREAKDOWN","DIM","COLUMN","G"]
["PLANT_TECH","DIM","COLUMN","H"]
["PLANT_TYPE","DIM","COLUMN","I"]
["STOCKS","DIM","COLUMN","J"]
["INFRASTRUCTURE_IND","DIM","COLUMN","K"]
["VIS_A_VIS_AREA","DIM","COLUMN","L"]
["MEASURE_VALUE_TYPE","DIM","COLUMN","M"]
["TIME_PERIOD","DIM","COLUMN","O"]
["FACILITY_ID","DIM","COLUMN","N"]
["UNIT_MEASURE","DIM","COLUMN","Q"]
["OBS_STATUS","ATT","COLUMN","R"]
["CONF_STATUS","ATT","COLUMN","S"]
["COMMENT_OBS","ATT","SKIP"]
["FACILITY_TYPE","ATT","SKIP"]
["FACILITY_NAME","ATT","SKIP"]

{"sheet":"Parameter_mapping","index":15,"n_rows":2,"n_cols":2,"rows_kept":2,"cut":false,"hidden":true,"merged":[]}
["Data sheet","Parameter sheet"]
["Output_SDMX_long_complete","Parameters"]

{"sheet":"Test","index":16,"n_rows":1,"n_cols":4,"rows_kept":1,"cut":false,"hidden":true,"merged":[]}
["Fonction","Time","Txt1","Txt2"]

{"sheet":"Logs","index":17,"n_rows":1,"n_cols":7,"rows_kept":1,"cut":false,"hidden":true,"merged":[]}
["Date","Module","Function","Param","Return","ErrorCode","Description"]

{"sheet":"Mapping_countries","index":18,"n_rows":73,"n_cols":4,"rows_kept":73,"cut":false,"hidden":true,"merged":[]}
["Official","IEA","EUROSTAT","IEA-ISO"]
["Albania","ALBANIA","AL","AL"]
["Argentina","ARGENTINA","AR","AR"]
["Armenia","ARMENIA","AM","AM"]
["Australia","AUSTRALI","AU","AU"]
["Austria","AUSTRIA","AT","AT"]
["Azerbaijan","AZERBAIJAN","AZ","AZ"]
["Belarus","BELARUS","BY","BY"]
["Belgium","BELGIUM","BE","BE"]
["Bosnia and Herzegovina","BOSNIAHERZ","BA","BA"]
["Brazil","BRAZIL","BR","BR"]
["Bulgaria","BULGARIA","BG","BG"]
["Canada","CANADA","CA","CA"]
["Chile","CHILE","CL","CL"]
["China, People's Republic of","CHINA","CN","CN"]
["Colombia","COLOMBIA","CO","CO"]
["Costa Rica","COSTARICA","CR","CR"]
["Croatia","CROATIA","HR","HR"]
["Cyprus","CYPRUS","CY","CY"]
["Czech Republic","CZECH","CZ","CZ"]
["Denmark","DENMARK","DK","DK"]
["Egypt","EGYPT","EG","EG"]
["Estonia","ESTONIA","EE","EE"]
["Finland","FINLAND","FI","FI"]
["France","FRANCE","FR","FR"]
["Georgia","GEORGIA","GE","GE"]
["Germany","GERMANY","DE","DE"]
["Greece","GREECE","GR","GR"]
["Hungary","HUNGARY","HU","HU"]
["Iceland","ICELAND","IS","IS"]
["Ireland","IRELAND","IE","IE"]
["India","INDIA","IN","IN"]
["Indonesia","INDONESIA","ID","ID"]
["Israel","ISRAEL","IL","IL"]
["Italy","ITALY","IT","IT"]
["Japan","JAPAN","JP","JP"]
["Kazakhstan","KAZAKHSTAN","KZ","KZ"]
["Korea","KOREA","KR","KR"]
["Kosovo* (under UNSCR 1244/99)","KOSOVO","XK","XK"]
["Kyrgyzstan","KYRGYZSTAN","KG","KG"]
["Latvia","LATVIA","LV","LV"]
["Liechtenstein","LIECHTEN","LI","LI"]
["Lithuania","LITHUANIA","LT","LT"]
["Luxembourg","LUXEMBOU","LU","LU"]
["Malta","MALTA","MT","MT"]
["Mexico","MEXICO","MX","MX"]
["Moldova","MOLDOVA","MD","MD"]
["Montenegro","MONTENEGRO","ME","ME"]
["Morocco","MOROCCO","MA","MA"]
["Netherlands","NETHLAND","NL","NL"]
["New Zealand","NZ","NZ","NZ"]
["North Macedonia","NORTHMACED","MK","MK"]
["Norway","NORWAY","NO","NO"]
["Peru","PERU","PE","PE"]
["Poland","POLAND","PL","PL"]
["Portugal","PORTUGAL","PT","PT"]
["Romania","ROMANIA","RO","RO"]
["Russia","RUSSIA","RU","RU"]
["Serbia","SERBIA","RS","RS"]
["Singapore","SINGAPORE","SG","SG"]
["Slovak Republic","SLOVAKIA","SK","SK"]
["Slovenia","SLOVENIA","SI","SI"]
["South Africa","SOUTHAFRIC","ZA","ZA"]
["Spain","SPAIN","ES","ES"]
["Sweden","SWEDEN","SE","SE"]
["Switzerland","SWITLAND","CH","CH"]
["Tajikistan","TAJIKISTAN","TJ","TJ"]
["Thailand","THAILAND","TH","TH"]
["Tunisia","TUNISIA","TN","TN"]
["Turkey","TURKEY","TR","TR"]
["Ukraine","UKRAINE","UA","UA"]
["United Kingdom","UK","GB","GB"]
["United States","USA","US","US"]

{"sheet":"Menu","index":19,"n_rows":994,"n_cols":34,"rows_kept":994,"cut":false,"hidden":false,"merged":[[23,2,23,8],[1,2,1,8],[2,2,2,8],[10,2,10,8],[19,2,19,8],[14,2,14,8],[3,2,3,8]]}
[]
[null,null,"Monthly Coal Statistics"]
[null,null,"REPORTING TEMPLATE "]
[null,null,"Eurostat"]
[]
[]
[null,null,"Language:",null,"English"]
[]
[null,null,"Country:",null,"Slovenia"]
[]
[null,null,"TABLES"]
[]
[null,null,"2023M06"]
[]
[null,null,"TIME SERIES"]
[]
[]
[]
[]
[null,null,"DATA TRANSFER"]
[]
[]
[]
[null,null,"VALIDATION AND VISUALIZATION"]
[]
[null,null,null,null,null,null,"2023M06"]
[]
[]
[]
[null,null,"Version:",null,20230727]
[]
[]
[]
[]
[]
[]
[]
[]
[]
[]
[]
[]
[]
[]
[]
[]
[]
[]
[]
[]
[]
[]
[]
[]
[]
[]
[]
[]
[]
[]
[]
[]
[]
[]
[]
[]
[]
[]
[]
[]
[]
[]
[]
[]
[]
[]
[]
[]
[]
[]
[]
[]
[]
[]
[]
[]
[]
[]
[]
[]
[]
[]
[]
[]
[]
[]
[]
[]
[]
[]
[]
[]
[]
[]
[]
[]
[]
[]
[]
[]
[]
[]
[]
[]
[]
[]
[]
[]
[]
[]
[]
[]
[]
[]
[]
[]
[]
[]
[]
[]
[]
[]
[]
[]
[]
[]
[]
[]
[]
[]
[]
[]
[]
[]
[]
[]
[]
[]
[]
[]
[]
[]
[]
[]
[]
[]
[]
[]
[]
[]
[]
[]
[]
[]
[]
[]
[]
[]
[]
[]
[]
[]
[]
[]
[]
[]
[]
[]
[]
[]
[]
[]
[]
[]
[]
[]
[]
[]
[]
[]
[]
[]
[]
[]
[]
[]
[]
[]
[]
[]
[]
[]
[]
[]
[]
[]
[]
[]
[]
[]
[]
[]
[]
[]
[]
[]
[]
[]
[]
[]
[]
[]
[]
[]
[]
[]
[]
[]
[]
[]
[]
[]
[]
[]
[]
[]
[]
[]
[]
[]
[]
[]
[]
[]
[]
[]
[]
[]
[]
[]
[]
[]
[]
[]
[]
[]
[]
[]
[]
[]
[]
[]
[]
[]
[]
[]
[]
[]
[]
[]
[]
[]
[]
[]
[]
[]
[]
[]
[]
[]
[]
[]
[]
[]
[]
[]
[]
[]
[]
[]
[]
[]
[]
[]
[]
[]
[]
[]
[]
[]
[]
[]
[]
[]
[]
[]
[]
[]
[]
[]
[]
[]
[]
[]
[]
[]
[]
[]
[]
[]
[]
[]
[]
[]
[]
[]
[]
[]
[]
[]
[]
[]
[]
[]
[]
[]
[]
[]
[]
[]
[]
[]
[]
[]
[]
[]
[]
[]
[]
[]
[]
[]
[]
[]
[]
[]
[]
[]
[]
[]
[]
[]
[]
[]
[]
[]
[]
[]
[]
[]
[]
[]
[]
[]
[]
[]
[]
[]
[]
[]
[]
[]
[]
[]
[]
[]
[]
[]
[]
[]
[]
[]
[]
[]
[]
[]
[]
[]
[]
[]
[]
[]
[]
[]
[]
[]
[]
[]
[]
[]
[]
[]
[]
[]
[]
[]
[]
[]
[]
[]
[]
[]
[]
[]
[]
[]
[]
[]
[]
[]
[]
[]
[]
[]
[]
[]
[]
[]
[]
[]
[]
[]
[]
[]
[]
[]
[]
[]
[]
[]
[]
[]
[]
[]
[]
[]
[]
[]
[]
[]
[]
[]
[]
[]
[]
[]
[]
[]
[]
[]
[]
[]
[]
[]
[]
[]
[]
[]
[]
[]
[]
[]
[]
[]
[]
[]
[]
[]
[]
[]
[]
[]
[]
[]
[]
[]
[]
[]
[]
[]
[]
[]
[]
[]
[]
[]
[]
[]
[]
[]
[]
[]
[]
[]
[]
[]
[]
[]
[]
[]
[]
[]
[]
[]
[]
[]
[]
[]
[]
[]
[]
[]
[]
[]
[]
[]
[]
[]
[]
[]
[]
[]
[]
[]
[]
[]
[]
[]
[]
[]
[]
[]
[]
[]
[]
[]
[]
[]
[]
[]
[]
[]
[]
[]
[]
[]
[]
[]
[]
[]
[]
[]
[]
[]
[]
[]
[]
[]
[]
[]
[]
[]
[]
[]
[]
[]
[]
[]
[]
[]
[]
[]
[]
[]
[]
[]
[]
[]
[]
[]
[]
[]
[]
[]
[]
[]
[]
[]
[]
[]
[]
[]
[]
[]
[]
[]
[]
[]
[]
[]
[]
[]
[]
[]
[]
[]
[]
[]
[]
[]
[]
[]
[]
[]
[]
[]
[]
[]
[]
[]
[]
[]
[]
[]
[]
[]
[]
[]
[]
[]
[]
[]
[]
[]
[]
[]
[]
[]
[]
[]
[]
[]
[]
[]
[]
[]
[]
[]
[]
[]
[]
[]
[]
[]
[]
[]
[]
[]
[]
[]
[]
[]
[]
[]
[]
[]
[]
[]
[]
[]
[]
[]
[]
[]
[]
[]
[]
[]
[]
[]
[]
[]
[]
[]
[]
[]
[]
[]
[]
[]
[]
[]
[]
[]
[]
[]
[]
[]
[]
[]
[]
[]
[]
[]
[]
[]
[]
[]
[]
[]
[]
[]
[]
[]
[]
[]
[]
[]
[]
[]
[]
[]
[]
[]
[]
[]
[]
[]
[]
[]
[]
[]
[]
[]
[]
[]
[]
[]
[]
[]
[]
[]
[]
[]
[]
[]
[]
[]
[]
[]
[]
[]
[]
[]
[]
[]
[]
[]
[]
[]
[]
[]
[]
[]
[]
[]
[]
[]
[]
[]
[]
[]
[]
[]
[]
[]
[]
[]
[]
[]
[]
[]
[]
[]
[]
[]
[]
[]
[]
[]
[]
[]
[]
[]
[]
[]
[]
[]
[]
[]
[]
[]
[]
[]
[]
[]
[]
[]
[]
[]
[]
[]
[]
[]
[]
[]
[]
[]
[]
[]
[]
[]
[]
[]
[]
[]
[]
[]
[]
[]
[]
[]
[]
[]
[]
[]
[]
[]
[]
[]
[]
[]
[]
[]
[]
[]
[]
[]
[]
[]
[]
[]
[]
[]
[]
[]
[]
[]
[]
[]
[]
[]
[]
[]
[]
[]
[]
[]
[]
[]
[]
[]
[]
[]
[]
[]
[]
[]
[]
[]
[]
[]
[]
[]
[]
[]
[]
[]
[]
[]
[]
[]
[]
[]
[]
[]
[]
[]
[]
[]
[]
[]
[]
[]
[]
[]
[]
[]
[]
[]
[]
[]
[]
[]
[]
[]
[]
[]
[]
[]
[]
[]
[]
[]
[]
[]
[]
[]
[]
[]
[]
[]
[]
[]
[]
[]
[]
[]
[]
[]
[]
[]
[]
[]
[]
[]
[]
[]
[]
[]
[]
[]
[]
[]
[]
[]
[]
[]
[]
[]
[]
[]
[]
[]
[]
[]
[]
[]
[]
[]
[]
[]
[]
[null,null,null,null,null,null,null,null,null,null,null,null,null,null,null,null,null,null,null,null,null,null,null,null,null,null,null,null,null,null,null,null,null,2020]

{"sheet":"Instructions","index":20,"n_rows":154,"n_cols":25,"rows_kept":154,"cut":false,"hidden":false,"merged":[[149,1,149,5],[151,1,151,5],[153,4,155,5],[124,1,127,5],[131,2,131,5],[132,1,133,1],[132,2,133,5],[138,2,138,5],[147,1,147,5],[148,1,148,5],[142,1,142,5],[143,1,144,5],[145,1,145,5],[136,2,136,5],[137,2,137,5],[140,1,140,5],[101,4,109,5],[110,4,113,5],[115,4,117,5],[119,4,121,5],[123,1,123,5],[82,1,82,5],[84,4,89,5],[92,1,92,5],[93,1,94,5],[95,4,100,5],[91,1,91,5],[141,1,141,5],[129,2,129,5],[130,2,130,5],[134,2,134,5],[135,2,135,5],[81,1,81,5],[46,4,48,5],[50,1,52,5],[54,1,54,5],[55,1,56,5],[58,4,60,5],[62,4,64,5],[80,1,80,5],[66,4,70,5],[72,4,74,5],[76,4,78,5],[44,1,44,5],[30,4,32,5],[34,4,37,5],[39,1,41,5],[43,1,43,5],[26,1,26,5],[27,1,28,5],[9,1,9,5],[1,1,1,5],[2,1,2,5],[5,1,5,5],[15,1,15,5],[10,1,10,5],[11,1,11,5],[12,1,12,5],[20,4,24,5],[16,1,16,5],[18,1,18,5]]}
[]
[null,"Monthly Coal Statistics"]
[null,"REPORTING TEMPLATE "]
[]
[" ",null,null,null,null,null,null,null,null,null,null,null,null,null,null,null,null,null,null,null,null,"English version"]
[null,"SUPPORT CONTACT",null,null,null,null,null,null,null,null,null,null,null,null,null,null,null,null,null,null,null,"Should you have any questions regarding the functions of this file or other logistics please do not hesitate to contact:","Pour d'autres informations, n'hésitez pas à contacter :","За дополнительной информацией, пожалуйста, обращайтесь:","Pour d'autres informations, n'hésitez pas à contacter :"]
[null,"EUROSTAT: ",null,"ESTAT-ENERGY-MONTHLY@EC.EUROPA.EU",null,null,null,null,null,null,null,null,null,null,null,null,null,null,null,null,null,"Email address:","Email :","Эмайл :","Email :"]
[null,null,null,null,null,null,null,null,null,null,null,null,null,null,null,null,null,null,null,null,null,"Telephone:","Téléphone :","Телефон :","Téléphone :"]
[]
[null,"SUBMISSION"]
[null,"Countries reporting to Eurostat should transmit the completed reporting template via the Single Entry Point (SEP) in EDAMIS."]
[null,"https://webgate.ec.europa.eu/edamis ",null,null,null,null,null,null,null,null,null,null,null,null,null,null,null,null,null,null,null,"https://webgate.ec.europa.eu/edamis","https://webgate.ec.europa.eu/edamis",null,"https://webgate.ec.europa.eu/edamis"]
[null,"In EDAMIS, please use dataset ENERGY_SOLID_M.",null,null,null,null,null,null,null,null,null,null,null,null,null,null,null,null,null,null,null,"In EDAMIS, please use dataset ENERGY_PETRO_A.","Dans EDAMIS, veuillez utiliser le jeu de données ENERGY_PETRO_A.","В EDAMIS, пожалуйста, используйте набор данных ENERGY_PETRO_A."]
[]
[]
[null,"BASIC FUNCTIONS"]
[null,"The instructions below describe the functions of the buttons on the 'Menu' worksheet."]
[]
[null,"The user should select his/her language and reporting country from the drop-down boxes at the top."]
[]
[null,null,null,null,"To be used for reporting data to Eurostat/IEA. The user should select the periods (months and/or years) to be uploaded to the database. If a user modifies data in a timeseries spreadsheet that is outside the 'periods to load', a warning message will appear when the reporting template is saved. The data will be saved in the reporting template, but will not be included in the exported data and will not, therefore, be uploaded to the database.\nThe selection of the periods to load is also used for running the checks included in the reporting template."]
[]
[]
[]
[]
[]
[null,"TABLES section"]
[null,"The reporting period should be selected from the drop-down box. Only one period at a time can be filled in using this option. Please remember to save each table with the save button (top left) before closing the worksheet."]
[]
[]
[null,null,null,null,"Opens the table that contains the table-specific products and flows for the selected reporting period (see above)."]
[]
[]
[]
[null,null,null,null,"Use this worksheet to comment on reported data, for example point out changes in methodology, etc. This information will be part of the uploaded data and will be stored under the period to load."]
[]
[]
[]
[]
[null,"This reporting template uses virtual forms, so all new data in any of the tables needs to be saved, otherwise it will not be stored. Any changes made in a table will not be visible immediately in other linked tables. Each table will need to be either reopened or refreshed (by using the 'Show new data' button in each worksheet)."]
[]
[]
[]
[null,"TIME SERIES section"]
[null,"The user can also enter data in the Time Series worksheets. Using this option allows the user to enter data for several months in a given year. "]
[]
[null,null,null,null,"Each button opens a table containing the table-specific products and flows for 12 months of one year. That is, for the year that was selected in the drop-down box in the TABLES section above."]
[]
[]
[]
[null,"This reporting template uses virtual forms, so all new data (or flags) in any of the tables needs to be saved, otherwise it will not be saved. Any changes made in a table will not be visible immediately in other linked tables. Each table will need to be either reopened or refreshed (by using the 'Show new data' button in each worksheet)."]
[]
[]
[]
[null,"DATA TRANSFER section"]
[null,"Data can be imported to (or exported from) the reporting template via a CSV file. Before clicking the button, the user must select (left of the button) the method of import/export, using either the CSV E-VO (IEA codes) or the SDMX-CSV (Eurostat codes) option."]
[]
[]
[null,null,null,null,"Opens a Windows browser to select the file to be imported."]
[]
[]
[]
[null,null,null,null,"Opens a Windows browser to select where the file should be exported to. Before exporting the data, the user must check that the data which needs to be exported is properly selected via the 'Periods to load' button."]
[]
[]
[]
[null,null,null,null,"Once the reporting template is completed and saved, the user must decide whether to transmit an exported CSV file or the Excel file. If the user opts for the Excel file, it must be prepared for transmission to Eurostat. This button carries out the necessary preparation. Before preparing the data, the user must check that the data which needs to be prepared is properly selected via the 'Periods to load' button. If no period is selected, the transmission will be rejected.\nThen, the user must click the 'Prepare file for transmission' button and can transmit the Excel file to Eurostat."]
[]
[]
[]
[]
[]
[null,null,null,null,"This will load the prefilled data from a CSV file to the reporting template. This data will be stored as 'base data'.\nFunction reserved for Eurostat/IEA."]
[]
[]
[]
[null,null,null,null,"Copies new data to prefilled data in order to have the proper highlighting for revisions. This action should be carried out by countries before starting filling a new period in the reporting template."]
[]
[]
[]
[null,"VALIDATION AND VISUALISATION section"]
[null,"Various graphs are available to visualise the reported data."]
[null,"Integrated checks are also available; these should be run by the user. The reported errors should be corrected before submitting the reporting template."]
[]
[null,null,null,null,"The period for which the checks needs to be launched can be selected via the 'Periods to load' button.\nBefore clicking to 'Run all checks', all worksheets must be closed. If there are worksheets open, a pop-up message will ask the user if open worksheets can be closed without saving. The user has the possibility to select cancel and then save any open worksheets.\nThe checks can then be relaunched. When launched, a separate worksheet will be generated, listing all errors from the selected periods. A filtering option is available in order to filter the results."]
[]
[]
[]
[]
[]
[]
[null,"Time Series / Form editing"]
[null,"The user is able to fill in data via the time series or main table worksheets."]
[null,"Changes are not visible in any other table until data is saved (it may be necessary to close and reopen a worksheet to view newly entered and SAVED data)."]
[]
[null,null,null,null,"This is the working view which must be used to fill-in data for the current cycle (new data and revisions for previous periods). It can also be used as a refresh button in order to reload the data if changes have been made and saved in other tables.\nWhen the user is in the 'Show new data' mode, the words on the button are green.\nIf the user inputs information (data or flags) and then clicks on 'Show new data' or 'Prefilled data', the data which was not saved will be lost."]
[]
[]
[]
[]
[]
[null,null,null,null,"The reporting template will be 'prefilled' with historical, or base data. This button will switch the data in the current table back to the base data. To switch back to any data filled in and saved by the user, the user should click on 'Show new data'.\nWARNING: This view should not be used to fill-in data! Any data should be filled-in in the 'Show new data' view! If the user fills in data while in 'Prefilled data' mode and then saves the form, this will become the working data which will then be visible in the ‘Show new data’ mode.\nWhen the user is in 'Prefilled data' mode, the words on the button are green.\nIf the user inputs information (data or flags) and then clicks on 'Show new data' or 'Prefilled data', the data which was not saved will be lost."]
[]
[]
[]
[]
[]
[]
[]
[]
[null,null,null,null,"Removes all data from the worksheet. If the worksheet is saved at this point, it will be saved blank.\nClicking 'Show new data' before saving will bring back users SAVED data, or clicking 'Prefilled data' will bring back base data."]
[]
[]
[]
[]
[null,null,null,null,"Saves the data filled in the worksheet. Nevertheless, when closing the reporting template itself, the file should also be saved."]
[]
[]
[]
[null,null,null,null,"Closes the worksheet. Any data modified since the last save, will not be saved."]
[]
[]
[]
[null,"Flags"]
[null,"The user may insert or remove flags, for just one cell or a selection of cells. To do this, simply select the cell (or range of cells) and select the appropriate flag.\nIf you wish to see only numeric data, the flags can be hidden in the worksheet by unticking the ‘See flags’ box. If the user inputs flags and then ticks/unticks the 'See flags', 'See checks' or 'See revisions' boxes, the flags which were not saved will be lost."]
[]
[]
[]
[]
[null,"M","Data cannot exist. To be used only when no values are provided."]
[null,"O","Missing value (not available/omitted/not known/not surveyed). To be used only when no values are provided."]
[null,"N","Not significant/negligible. To be used only when a '0' value is provided."]
[null,"C","Confidential value. If the data collection is in the secure environment, the C flag is used when values are provided. If the data collection is in the normal environment, the C flag is used without values."]
[]
[null,"D","Definition differs. To be used only when values are provided. An explanation should be given in the Remarks worksheet."]
[null,"B","Break in time series. To be used only when values are provided. An explanation should be given in the Remarks worksheet."]
[null,"P","Provisional value. To be used only when values are provided and only for the most recent time period."]
[null,"E","Estimated value. To be used only when values are provided."]
[null,"U","Low reliability/uncertain. To be used only when values are provided."]
[]
[null,"Checks and revisions"]
[null,"In the Time Series and Main tables, various conditions are checked. Errors are displayed in bold red, while warnings are displayed in red."]
[null,"Cells highlighted in yellow indicate a revision when compared to the prefilled data."]
[null,"The above-mentioned checks and revisions can be hidden by unticking the 'See checks' and 'See revisions' boxes. If the user inputs flags and then ticks/unticks the 'See flags', 'See checks' or 'See revisions' boxes, the flags which were not saved will be lost."]
[]
[null,"Voluntary data appear in italics."]
[]
[null,"Saving the reporting template"]
[null,"When work is complete and all individual worksheets are saved, the reporting template itself has to be saved before closing it."]
[null,"Do not forget the option \"Prepare file for transmission\", mentioned above, before submitting."]
[]
[null,"Reseting the data"]
[]
[null,null,null,null,"This will replace all working data (inculding any editing of data since the CSV was uploaded) with the original prefilled data ('base data')."]

{"sheet":"Param_Menu","index":21,"n_rows":43,"n_cols":6,"rows_kept":43,"cut":false,"hidden":true,"merged":[]}
[null,"Selection",null,"Sep"]
["Format",2,1,";"]
["File Import","D:\\ARTEMIS INFO. MGMT\\Energy - Lot 2\\Development\\Questionnaires\\Monthly Coal\\Developed quest\\sample file\\coal_sl_minus1.csv"]
["File Export","D:\\ARTEMIS INFO. MGMT\\Energy - Lot 2\\Development\\Questionnaires\\Monthly Coal\\Developed quest\\Slovenia_SDMX_2023-07-27_14-51.csv"]
["File Import historical","D:\\ARTEMIS INFO. MGMT\\Energy - Lot 2\\Development\\Questionnaires\\Monthly Coal\\Developed quest\\sample file\\coal_sl.csv"]
[]
["Year","Month","Period","Selected"]
[2021,"M01",{"$f":"PeriodsToLoad[[#This Row],[Year]]&PeriodsToLoad[[#This Row],[Month]]","v":"2021M01"},0,null,"Reference cell for the first period used for checks on stocks"]
[2021,"M02",{"$f":"PeriodsToLoad[[#This Row],[Year]]&PeriodsToLoad[[#This Row],[Month]]","v":"2021M02"},0]
[2021,"M03",{"$f":"PeriodsToLoad[[#This Row],[Year]]&PeriodsToLoad[[#This Row],[Month]]","v":"2021M03"},0]
[2021,"M04",{"$f":"PeriodsToLoad[[#This Row],[Year]]&PeriodsToLoad[[#This Row],[Month]]","v":"2021M04"},0]
[2021,"M05",{"$f":"PeriodsToLoad[[#This Row],[Year]]&PeriodsToLoad[[#This Row],[Month]]","v":"2021M05"},0]
[2021,"M06",{"$f":"PeriodsToLoad[[#This Row],[Year]]&PeriodsToLoad[[#This Row],[Month]]","v":"2021M06"},0]
[2021,"M07",{"$f":"PeriodsToLoad[[#This Row],[Year]]&PeriodsToLoad[[#This Row],[Month]]","v":"2021M07"},0]
[2021,"M08",{"$f":"PeriodsToLoad[[#This Row],[Year]]&PeriodsToLoad[[#This Row],[Month]]","v":"2021M08"},0]
[2021,"M09",{"$f":"PeriodsToLoad[[#This Row],[Year]]&PeriodsToLoad[[#This Row],[Month]]","v":"2021M09"},0]
[2021,"M10",{"$f":"PeriodsToLoad[[#This Row],[Year]]&PeriodsToLoad[[#This Row],[Month]]","v":"2021M10"},0]
[2021,"M11",{"$f":"PeriodsToLoad[[#This Row],[Year]]&PeriodsToLoad[[#This Row],[Month]]","v":"2021M11"},0]
[2021,"M12",{"$f":"PeriodsToLoad[[#This Row],[Year]]&PeriodsToLoad[[#This Row],[Month]]","v":"2021M12"},0]
[2022,"M01",{"$f":"PeriodsToLoad[[#This Row],[Year]]&PeriodsToLoad[[#This Row],[Month]]","v":"2022M01"},0]
[2022,"M02",{"$f":"PeriodsToLoad[[#This Row],[Year]]&PeriodsToLoad[[#This Row],[Month]]","v":"2022M02"},0]
[2022,"M03",{"$f":"PeriodsToLoad[[#This Row],[Year]]&PeriodsToLoad[[#This Row],[Month]]","v":"2022M03"},0]
[2022,"M04",{"$f":"PeriodsToLoad[[#This Row],[Year]]&PeriodsToLoad[[#This Row],[Month]]","v":"2022M04"},0]
[2022,"M05",{"$f":"PeriodsToLoad[[#This Row],[Year]]&PeriodsToLoad[[#This Row],[Month]]","v":"2022M05"},0]
[2022,"M06",{"$f":"PeriodsToLoad[[#This Row],[Year]]&PeriodsToLoad[[#This Row],[Month]]","v":"2022M06"},0]
[2022,"M07",{"$f":"PeriodsToLoad[[#This Row],[Year]]&PeriodsToLoad[[#This Row],[Month]]","v":"2022M07"},0]
[2022,"M08",{"$f":"PeriodsToLoad[[#This Row],[Year]]&PeriodsToLoad[[#This Row],[Month]]","v":"2022M08"},0]
[2022,"M09",{"$f":"PeriodsToLoad[[#This Row],[Year]]&PeriodsToLoad[[#This Row],[Month]]","v":"2022M09"},0]
[2022,"M10",{"$f":"PeriodsToLoad[[#This Row],[Year]]&PeriodsToLoad[[#This Row],[Month]]","v":"2022M10"},0]
[2022,"M11",{"$f":"PeriodsToLoad[[#This Row],[Year]]&PeriodsToLoad[[#This Row],[Month]]","v":"2022M11"},0]
[2022,"M12",{"$f":"PeriodsToLoad[[#This Row],[Year]]&PeriodsToLoad[[#This Row],[Month]]","v":"2022M12"},0]
[2023,"M01",{"$f":"PeriodsToLoad[[#This Row],[Year]]&PeriodsToLoad[[#This Row],[Month]]","v":"2023M01"},0]
[2023,"M02",{"$f":"PeriodsToLoad[[#This Row],[Year]]&PeriodsToLoad[[#This Row],[Month]]","v":"2023M02"},0]
[2023,"M03",{"$f":"PeriodsToLoad[[#This Row],[Year]]&PeriodsToLoad[[#This Row],[Month]]","v":"2023M03"},0]
[2023,"M04",{"$f":"PeriodsToLoad[[#This Row],[Year]]&PeriodsToLoad[[#This Row],[Month]]","v":"2023M04"},0]
[2023,"M05",{"$f":"PeriodsToLoad[[#This Row],[Year]]&PeriodsToLoad[[#This Row],[Month]]","v":"2023M05"},0]
[2023,"M06",{"$f":"PeriodsToLoad[[#This Row],[Year]]&PeriodsToLoad[[#This Row],[Month]]","v":"2023M06"},1]
[2023,"M07",{"$f":"PeriodsToLoad[[#This Row],[Year]]&PeriodsToLoad[[#This Row],[Month]]","v":"2023M07"},0]
[2023,"M08",{"$f":"PeriodsToLoad[[#This Row],[Year]]&PeriodsToLoad[[#This Row],[Month]]","v":"2023M08"},0]
[2023,"M09",{"$f":"PeriodsToLoad[[#This Row],[Year]]&PeriodsToLoad[[#This Row],[Month]]","v":"2023M09"},0]
[2023,"M10",{"$f":"PeriodsToLoad[[#This Row],[Year]]&PeriodsToLoad[[#This Row],[Month]]","v":"2023M10"},0]
[2023,"M11",{"$f":"PeriodsToLoad[[#This Row],[Year]]&PeriodsToLoad[[#This Row],[Month]]","v":"2023M11"},0]
[2023,"M12",{"$f":"PeriodsToLoad[[#This Row],[Year]]&PeriodsToLoad[[#This Row],[Month]]","v":"2023M12"},0]

{"sheet":"Param_Questionnaire","index":22,"n_rows":73,"n_cols":18,"rows_kept":73,"cut":false,"hidden":true,"merged":[]}
["Version","Eurostat",null,"Eurostat","IEA","Language",null,"FormatNormal","FormatConfidential","FormatConfidential2","FormatEstimated","FormatNotAvailable","FormatDataCannotExist","FormatNotSignificant","FormatLowReliability","FormatDefinitionDiff","FormatTSBreak","FormatProvisional"]
["Questionnaire","MCOAL",null,"Albania","Albania","English",0,1234567.8899999999,0,1234.56789,1234567.8899999999,1234567.8899999999,1234567.8899999999,1234567.8899999999,1234567.8899999999,1234567.8899999999,1234567.8899999999,1234567.8899999999]
["DATAFLOW","ESTAT:ENERGY_SOLID_M(1.0)",null,"Austria","Argentina","French",1,1234567.8899999999,0,1234.56789,1234567.8899999999,1234567.8899999999,1234567.8899999999,1234567.8899999999,1234567.8899999999,1234567.8899999999,1234567.8899999999,1234567.8899999999]
["QUEST_SOURCE","M_COAL",null,"Belgium","Armenia",null,2,1234567.8899999999,0,1234.56789,1234567.8899999999,1234567.8899999999,1234567.8899999999,1234567.8899999999,1234567.8899999999,1234567.8899999999,1234567.8899999999,1234567.8899999999]
["FREQ","M",null,"Bosnia and Herzegovina","Australia",null,3,1234567.8899999999,0,1234.56789,1234567.8899999999,1234567.8899999999,1234567.8899999999,1234567.8899999999,1234567.8899999999,1234567.8899999999,1234567.8899999999,1234567.8899999999]
["CountryName",{"$f":"Menu!E9","v":"Slovenia"},null,"Bulgaria","Austria",null,4,1234567.8899999999,0,1234.56789,1234567.8899999999,1234567.8899999999,1234567.8899999999,1234567.8899999999,1234567.8899999999,1234567.8899999999,1234567.8899999999,1234567.8899999999]
["CountryIEA",{"$f":"VLOOKUP(CountryName,Mapping_countries[],2,0)","v":"SLOVENIA"},null,"Croatia","Azerbaijan",null,5,1234567.8899999999,0,1234.56789,1234567.8899999999,1234567.8899999999,1234567.8899999999,1234567.8899999999,1234567.8899999999,1234567.8899999999,1234567.8899999999,1234567.8899999999]
["CountrySDMX",{"$f":"VLOOKUP(CountryName, Mapping_countries[], 3, 0)","v":"SI"},null,"Cyprus","Belarus",null,6,1234567.8899999999,0,1234.56789,1234567.8899999999,1234567.8899999999,1234567.8899999999,1234567.8899999999,1234567.8899999999,1234567.8899999999,1234567.8899999999,1234567.8899999999]
["Language",{"$f":"Menu!E7","v":"English"},null,"Czech Republic","Belgium",null,null,null,null,null,"e","o","m","n","u","d","b","p"]
["PeriodSelected",{"$f":"Menu!C13","v":"2023M06"},null,"Denmark","Bosnia and Herzegovina"]
["Data Format",{"$f":"IF(Param_Menu!B2=1, \"ISO\", \"SDMX\")","v":"SDMX"},null,"Estonia","Brazil"]
["FormatError","aaa",null,"Finland","Bulgaria"]
["FormatWarning","aaa",null,"France","Canada"]
["FormatRevision","aaa",null,"Georgia","Chile"]
["FormatLockFormula","aaa",null,"Germany","China, People's Republic of"]
["FormatLockNoFormula",null,null,"Greece","Colombia"]
["FormatEmpty",null,null,"Hungary","Costa Rica"]
["nbDecimal",3,"0 to 6","Iceland","Croatia"]
["FormatVoluntary","aaa",null,"Ireland","Cyprus"]
["FormatFormula","aaa",null,"Italy","Czech Republic"]
[null,null,null,"Kosovo* (under UNSCR 1244/99)","Denmark"]
[null,null,null,"Latvia","Egypt"]
[null,null,null,"Liechtenstein","Estonia"]
[null,null,null,"Lithuania","Finland"]
[null,null,null,"Luxembourg","France"]
[null,null,null,"Malta","Georgia"]
[null,null,null,"Moldova","Germany"]
["Test Value",9.9,null,"Montenegro","Greece"]
["CheckTolerance",0.1,null,"Netherlands","Hungary"]
["AllowConfidential",0,null,"North Macedonia","Iceland"]
["AllowDataCannotExist",1,null,"Norway","Ireland"]
["Display0",0,null,"Poland","India"]
["ShowFlags",true,null,"Portugal","Indonesia"]
["ShowChecks",true,null,"Romania","Israel"]
["ShowRevisions",true,null,"Serbia","Italy"]
[null,null,null,"Slovak Republic","Japan"]
[null,null,null,"Slovenia","Kazakhstan"]
[null,null,null,"Spain","Korea"]
[null,null,null,"Sweden","Kosovo* (under UNSCR 1244/99)"]
[null,null,null,"Switzerland","Kyrgyzstan"]
[null,null,null,"Turkey","Latvia"]
[null,null,null,"Ukraine","Liechtenstein"]
[null,null,null,"United Kingdom","Lithuania"]
[null,null,null,null,"Luxembourg"]
[null,null,null,null,"Malta"]
[null,null,null,null,"Mexico"]
[null,null,null,null,"Moldova"]
[null,null,null,null,"Montenegro"]
[null,null,null,null,"Morocco"]
[null,null,null,null,"Netherlands"]
[null,null,null,null,"New Zealand"]
[null,null,null,null,"North Macedonia"]
[null,null,null,null,"Norway"]
[null,null,null,null,"Peru"]
[null,null,null,null,"Poland"]
[null,null,null,null,"Portugal"]
[null,null,null,null,"Romania"]
[null,null,null,null,"Russia"]
[null,null,null,null,"Serbia"]
[null,null,null,null,"Singapore"]
[null,null,null,null,"Slovak Republic"]
[null,null,null,null,"Slovenia"]
[null,null,null,null,"South Africa"]
[null,null,null,null,"Spain"]
[null,null,null,null,"Sweden"]
[null,null,null,null,"Switzerland"]
[null,null,null,null,"Tajikistan"]
[null,null,null,null,"Thailand"]
[null,null,null,null,"Tunisia"]
[null,null,null,null,"Turkey"]
[null,null,null,null,"Ukraine"]
[null,null,null,null,"United Kingdom"]
[null,null,null,null,"United States"]

{"sheet":"Param_Multilanguage","index":23,"n_rows":28,"n_cols":3,"rows_kept":28,"cut":false,"hidden":true,"merged":[]}
["Shortnames","English","French"]
[null,"Hard coal","Hard Coal"]
[null,"Brown coal","Brown Coal"]
[null,"Peat","Peat"]
[null,"Oil shale and oil sands","Oil shale and oil sands"]
[null,"Coke oven coke","Coke oven coke"]
[null,"Primary products","Primary products"]
[null,"Secondary products","Secondary products"]
[null,"Monthly Coal Statistics (kt)","Monthly Coal Statistics (kt)"]
[null,"Production ","Production "]
[null,"Recovered products","Recovered products"]
[null,"Total imports","Total imports"]
[null,"of which from outside EU","of which from outside EU"]
[null,"Total exports","Total exports"]
[null,"Stocks - beginning of period","Stocks - beginning of period"]
[null,"Stocks - end of period","Stocks - end of period"]
[null,"Stock changes","Stock changes"]
[null,"Calculated inland deliveries","Calculated inland deliveries"]
[null,"Statistical differences","Statistical differences"]
[null,"Internal market deliveries (observed)","Internal market deliveries (observed)"]
[null,"Deliveries to main activity producers","Deliveries to main activity producers"]
[null,"Deliveries to coking plants","Deliveries to coking plants"]
[null,"Deliveries to total industry","Deliveries to total industry"]
[null,"of which to iron and steel industry","of which to iron and steel industry"]
[null,"Other deliveries (services, households, …)","Other deliveries (services, households, …)"]
[null,"Remarks","Remarques"]
[null,"Imports: of which from outside EU","Imports: of which from outside EU"]
[null,"Deliveries to total industry of which to iron and steel industry","Deliveries to total industry of which to iron and steel industry"]

{"sheet":"Template_Table1","index":24,"n_rows":28,"n_cols":14,"rows_kept":28,"cut":false,"hidden":true,"merged":[[10,9,10,12]]}
["TIME","XXXXMX",null,null,null,null,null,"Monthly Coal Statistics (kt)"]
["DATATYPE","FLOW",null,null,null,null,null,null,null,{"$f":"VLOOKUP(H1, LanguageData, MATCH(LanguageChosen, Language[Language],0), FALSE) & \" - \" & B1","v":"Monthly Coal Statistics (kt) - XXXXMX"}]
["ITEM2",null,null,null,null,null,null,"ProductRow",null,"HARDCOAL","BROWN","PEAT","OILSHALE","COKEOVEN"]
[null,null,null,null,null,null,null,"FormulaRow"]
[null,null,null,null,null,null,null,"CheckRow"]
[null,null,null,null,null,null,null,"LockedRow"]
[null,null,null,null,null,null,null,"EmptyRow"]
[null,null,null,null,null,null,null,"VoluntaryRow"]
[null,null,null,null,null,null,null,"LabelRow1",null,"Primary products",null,null,null,"Secondary products"]
["Item1Col","FormulaCol","CheckCol","LabelCheckCol1","LockedCol","EmptyCol","VoluntaryCol","LabelCol",null,"Hard coal","Brown coal","Peat","Oil shale and oil sands","Coke oven coke"]
[null,null,null,null,null,null,null,null,null,{"$f":"VLOOKUP(J9, LanguageData, MATCH(LanguageChosen, Language[Language],0), FALSE)","v":"Primary products"},null,null,null,{"$f":"VLOOKUP(N9, LanguageData, MATCH(LanguageChosen, Language[Language],0), FALSE)","v":"Secondary products"}]
[null,null,null,null,null,null,null,null,{"$f":"CountryName","v":"Slovenia"},{"$f":"VLOOKUP(J10, LanguageData, MATCH(LanguageChosen, Language[Language],0), FALSE)","v":"Hard coal"},{"$f":"VLOOKUP(K10, LanguageData, MATCH(LanguageChosen, Language[Language],0), FALSE)","v":"Brown coal"},{"$f":"VLOOKUP(L10, LanguageData, MATCH(LanguageChosen, Language[Language],0), FALSE)","v":"Peat"},{"$f":"VLOOKUP(M10, LanguageData, MATCH(LanguageChosen, Language[Language],0), FALSE)","v":"Oil shale and oil sands"},{"$f":"VLOOKUP(N10, LanguageData, MATCH(LanguageChosen, Language[Language],0), FALSE)","v":"Coke oven coke"}]
["INDPROD",null,null,null,null,null,null,"Production ",{"$f":"VLOOKUP(H13, LanguageData, MATCH(LanguageChosen, Language[Language],0), FALSE)","v":"Production "}]
["OSOURCES",null,null,null,"§[Product=BROWN]:[Product=COKEOVEN]§",null,null,"Recovered products",{"$f":"VLOOKUP(H14, LanguageData, MATCH(LanguageChosen, Language[Language],0), FALSE)","v":"Recovered products"}]
["TOTIMPSB",null,null,null,null,null,null,"Total imports",{"$f":"VLOOKUP(H15, LanguageData, MATCH(LanguageChosen, Language[Language],0), FALSE)","v":"Total imports"}]
["TOTIMPSBEU",null,"> [Item1=TOTIMPSB]","Should be less than or equal to 'Total imports'","§[Product=BROWN]:[Product=OILSHALE]§",null,null,"of which from outside EU",{"$f":"VLOOKUP(H16, LanguageData, MATCH(LanguageChosen, Language[Language],0), FALSE)","v":"of which from outside EU"}]
["TOTEXPSB",null,null,null,null,null,null,"Total exports",{"$f":"VLOOKUP(H17, LanguageData, MATCH(LanguageChosen, Language[Language],0), FALSE)","v":"Total exports"}]
["STOCKSTART",null,{"$f":"IF(B1>Param_Menu!C8,\"§[Product=HARDCOAL],[Product=BROWN],[Product=OILSHALE],[Product=COKEOVEN]§<>[ext:Item1=STOCKEND#Time=M-1]\",\"\")","v":"§[Product=HARDCOAL],[Product=BROWN],[Product=OILSHALE],[Product=COKEOVEN]§<>[ext:Item1=STOCKEND#Time=M-1]"},"Opening stocks should equal the\nclosing stocks of the previous month","§[Product=PEAT]:[Product=PEAT]§",null,null,"Stocks - beginning of period",{"$f":"VLOOKUP(H18, LanguageData, MATCH(LanguageChosen, Language[Language],0), FALSE)","v":"Stocks - beginning of period"}]
["STOCKEND",null,null,null,"§[Product=PEAT]:[Product=PEAT]§",null,null,"Stocks - end of period",{"$f":"VLOOKUP(H19, LanguageData, MATCH(LanguageChosen, Language[Language],0), FALSE)","v":"Stocks - end of period"}]
["STCHANAT","§[Product=HARDCOAL],[Product=BROWN],[Product=OILSHALE],[Product=COKEOVEN]§IF(OR(sum([Item1=STOCKSTART])>0, sum([Item1=STOCKEND])>0),sum([Item1=STOCKSTART]) - Sum([Item1=STOCKEND]),\"\")","%ISNUMBER","Numbers only",null,null,null,"Stock changes",{"$f":"VLOOKUP(H20, LanguageData, MATCH(LanguageChosen, Language[Language],0), FALSE)","v":"Stock changes"}]
["INDCONC","IF(Sum([Item1=INDPROD], [Item1=OSOURCES], [Item1=TOTIMPSB], [Item1=STCHANAT]) - sum([Item1=TOTEXPSB])<>0,Sum([Item1=INDPROD], [Item1=OSOURCES], [Item1=TOTIMPSB], [Item1=STCHANAT]) - sum([Item1=TOTEXPSB]),\"\")","%< 0","Calculated inland deliveries cannot be negative",1,null,null,"Calculated inland deliveries",{"$f":"VLOOKUP(H21, LanguageData, MATCH(LanguageChosen, Language[Language],0), FALSE)","v":"Calculated inland deliveries"}]
["STATDIFF","§[Product=HARDCOAL]§IF(sum([Item1=INDCONC]) - sum([Item1=INTERNAD])<>0,sum([Item1=INDCONC]) - sum([Item1=INTERNAD]),\"\")","%ISNUMBER","Numbers only",1,null,null,"Statistical differences",{"$f":"VLOOKUP(H22, LanguageData, MATCH(LanguageChosen, Language[Language],0), FALSE)","v":"Statistical differences"}]
["INTERNAD","§[Product=HARDCOAL]§IF(sum([Item1=MAINPROD], [Item1=ECOKEOVS], [Item1=TOTIND], [Item1=OTHER])<>0,sum([Item1=MAINPROD], [Item1=ECOKEOVS], [Item1=TOTIND], [Item1=OTHER]),\"\")",null,null,1,"§[Product=BROWN]:[Product=COKEOVEN]§",null,"Internal market deliveries (observed)",{"$f":"VLOOKUP(H23, LanguageData, MATCH(LanguageChosen, Language[Language],0), FALSE)","v":"Internal market deliveries (observed)"}]
["MAINPROD",null,null,null,"§[Product=COKEOVEN]:[Product=COKEOVEN]§",null,null,"Deliveries to main activity producers",{"$f":"VLOOKUP(H24, LanguageData, MATCH(LanguageChosen, Language[Language],0), FALSE)","v":"Deliveries to main activity producers"}]
["ECOKEOVS",null,null,null,"§[Product=BROWN]:[Product=COKEOVEN]§",null,null,"Deliveries to coking plants",{"$f":"VLOOKUP(H25, LanguageData, MATCH(LanguageChosen, Language[Language],0), FALSE)","v":"Deliveries to coking plants"}]
["TOTIND",null,null,null,"§[Product=BROWN]:[Product=COKEOVEN]§",null,null,"Deliveries to total industry",{"$f":"VLOOKUP(H26, LanguageData, MATCH(LanguageChosen, Language[Language],0), FALSE)","v":"Deliveries to total industry"}]
["IRONSTL",null,"§[Product=HARDCOAL]§> [Item1=TOTIND]","Should be less than or equal to 'Deliveries to total industry'","§[Product=BROWN]:[Product=OILSHALE]§",null,null,"of which to iron and steel industry",{"$f":"VLOOKUP(H27, LanguageData, MATCH(LanguageChosen, Language[Language],0), FALSE)","v":"of which to iron and steel industry"}]
["OTHER",null,null,null,"§[Product=BROWN]:[Product=COKEOVEN]§",null,null,"Other deliveries (services, households, …)",{"$f":"VLOOKUP(H28, LanguageData, MATCH(LanguageChosen, Language[Language],0), FALSE)","v":"Other deliveries (services, households, …)"}]

{"sheet":"TemplateRemarks","index":25,"n_rows":35,"n_cols":5,"rows_kept":35,"cut":false,"hidden":true,"merged":[[0,4,2,4]]}
["Mode","Remarks",null,null,{"$f":"VLOOKUP(B1, LanguageData, MATCH(LanguageChosen, Language[Language],0), FALSE)","v":"Remarks"}]
["DataType"]
["Product",null,null,{"$f":"CountryName","v":"Slovenia"}]
["Time"]
["Item2",null,"TypeRow",null,"txt"]
[]
["Item1",null,"Label"]
["REMROW01",null,"Remarks 1"]
["REMROW02",null,"Remarks 2"]
["REMROW03",null,"Remarks 3"]
["REMROW04",null,"Remarks 4"]
["REMROW05",null,"Remarks 5"]
["REMROW06",null,"Remarks 6"]
["REMROW07",null,"Remarks 7"]
["REMROW08",null,"Remarks 8"]
["REMROW09",null,"Remarks 9"]
["REMROW10",null,"Remarks 10"]
["REMROW11",null,"Remarks 11"]
["REMROW12",null,"Remarks 12"]
["REMROW13",null,"Remarks 13"]
["REMROW14",null,"Remarks 14"]
["REMROW15",null,"Remarks 15"]
["REMROW16",null,"Remarks 16"]
["REMROW17",null,"Remarks 17"]
["REMROW18",null,"Remarks 18"]
["REMROW19",null,"Remarks 19"]
["REMROW20",null,"Remarks 20"]
["REMROW21",null,"Remarks 21"]
["REMROW22",null,"Remarks 22"]
["REMROW23",null,"Remarks 23"]
["REMROW24",null,"Remarks 24"]
["REMROW25",null,"Remarks 25"]
["REMROW26",null,"Remarks 26"]
["REMROW27",null,"Remarks 27"]
["REMROW28",null,"Remarks 28"]

{"sheet":"Template_TS1","index":26,"n_rows":28,"n_cols":21,"rows_kept":28,"cut":false,"hidden":true,"merged":[[0,9,0,20],[9,9,9,20]]}
["Mode",null,null,null,null,null,null,"Monthly Coal Statistics (kt)",null,{"$f":" VLOOKUP(H1,LanguageData, MATCH(LanguageChosen, Language[Language],0), FALSE) & \" - \" & I12","v":{"$error":"#N/A"}}]
["Datatype","xxxx",null,null,null,null,null,null,null,"M01","M02","M03","M04","M05","M06","M07","M08","M09","M10","M11","M12"]
["Product",null,null,"HARDCOAL","Hard coal",{"$f":"VLOOKUP(E3, LanguageData, MATCH(LanguageChosen, Language[Language],0), FALSE)","v":"Hard coal"},null,"TimeRow",null,{"$f":"$B$5 & J2","v":"2022M01"},{"$f":"$B$5 & K2","v":"2022M02"},"2022M03","2022M04","2022M05","2022M06","2022M07","2022M08","2022M09","2022M10","2022M11","2022M12"]
["Item2",null,null,"BROWN","Brown coal",{"$f":"VLOOKUP(E4, LanguageData, MATCH(LanguageChosen, Language[Language],0), FALSE)","v":"Brown coal"},null,"FormulaRow"]
["Version",2022,null,"PEAT","Peat",{"$f":"VLOOKUP(E5, LanguageData, MATCH(LanguageChosen, Language[Language],0), FALSE)","v":"Peat"},null,"CheckRow",null,{"$f":"IF(J3>Param_Menu!C8,\"§[Item1=STOCKSTART]§<>[ext:Item1=STOCKEND#Time=\" & B5-1 & \"M12]\",\"\")","v":"§[Item1=STOCKSTART]§<>[ext:Item1=STOCKEND#Time=2021M12]"},{"$f":"\"§[Item1=STOCKSTART]§<>[Item1=STOCKEND#Time=\" & J11 & \"]\"","v":"§[Item1=STOCKSTART]§<>[Item1=STOCKEND#Time=2022M01]"},{"$f":"\"§[Item1=STOCKSTART]§<>[Item1=STOCKEND#Time=\" & K11 & \"]\"","v":"§[Item1=STOCKSTART]§<>[Item1=STOCKEND#Time=2022M02]"},"§[Item1=STOCKSTART]§<>[Item1=STOCKEND#Time=2022M03]","§[Item1=STOCKSTART]§<>[Item1=STOCKEND#Time=2022M04]","§[Item1=STOCKSTART]§<>[Item1=STOCKEND#Time=2022M05]","§[Item1=STOCKSTART]§<>[Item1=STOCKEND#Time=2022M06]","§[Item1=STOCKSTART]§<>[Item1=STOCKEND#Time=2022M07]","§[Item1=STOCKSTART]§<>[Item1=STOCKEND#Time=2022M08]","§[Item1=STOCKSTART]§<>[Item1=STOCKEND#Time=2022M09]","§[Item1=STOCKSTART]§<>[Item1=STOCKEND#Time=2022M10]","§[Item1=STOCKSTART]§<>[Item1=STOCKEND#Time=2022M11]"]
[null,null,null,"OILSHALE","Oil shale and oil sands",{"$f":"VLOOKUP(E6, LanguageData, MATCH(LanguageChosen, Language[Language],0), FALSE)","v":"Oil shale and oil sands"},null,"LabelCheckRow",null,"Opening stocks should equal the\nclosing stocks of the previous month","Opening stocks should equal the\nclosing stocks of the previous month","Opening stocks should equal the\nclosing stocks of the previous month","Opening stocks should equal the\nclosing stocks of the previous month","Opening stocks should equal the\nclosing stocks of the previous month","Opening stocks should equal the\nclosing stocks of the previous month","Opening stocks should equal the\nclosing stocks of the previous month","Opening stocks should equal the\nclosing stocks of the previous month","Opening stocks should equal the\nclosing stocks of the previous month","Opening stocks should equal the\nclosing stocks of the previous month","Opening stocks should equal the\nclosing stocks of the previous month","Opening stocks should equal the\nclosing stocks of the previous month"]
[null,null,null,"COKEOVEN","Coke oven coke",{"$f":"VLOOKUP(E7, LanguageData, MATCH(LanguageChosen, Language[Language],0), FALSE)","v":"Coke oven coke"},null,"LockedRow"]
[null,null,null,null,null,null,null,"EmptyRow"]
[null,null,null,null,null,null,null,"VoluntaryRow"]
[null,null,null,null,null,null,null,null,null,{"$f":"B5","v":2022}]
[null,null,null,null,null,null,null,"LabelRow",{"$f":"CountryName","v":"Slovenia"},{"$f":"J3","v":"2022M01"},{"$f":"K3","v":"2022M02"},"2022M03","2022M04","2022M05","2022M06","2022M07","2022M08","2022M09","2022M10","2022M11","2022M12"]
["Item1Col","FormulaCol","CheckCol1","LabelCheckCol1","LockedCol","EmptyCol","VoluntaryCol","LabelCol",{"$f":"VLOOKUP(B3,D3:F7,3,0)","v":{"$error":"#N/A"}}]
["INDPROD",null,null,null,null,null,null,"Production ",{"$f":"VLOOKUP(H13, LanguageData, MATCH(LanguageChosen, Language[Language],0), FALSE)","v":"Production "}]
["OSOURCES",null,null,null,{"$f":"IF(OR(B3=\"BROWN\",B3=\"PEAT\",B3=\"OILSHALE\",B3=\"COKEOVEN\"),1,\"\")","v":""},null,null,"Recovered products",{"$f":"VLOOKUP(H14, LanguageData, MATCH(LanguageChosen, Language[Language],0), FALSE)","v":"Recovered products"}]
["TOTIMPSB",null,null,null,null,null,null,"Total imports",{"$f":"VLOOKUP(H15, LanguageData, MATCH(LanguageChosen, Language[Language],0), FALSE)","v":"Total imports"}]
["TOTIMPSBEU",null,"> [Item1=TOTIMPSB]","Should be less than or equal to 'Total imports'",{"$f":"IF(OR(B3=\"BROWN\",B3=\"PEAT\",B3=\"OILSHALE\"),1,\"\")","v":""},null,null,"of which from outside EU",{"$f":"VLOOKUP(H16, LanguageData, MATCH(LanguageChosen, Language[Language],0), FALSE)","v":"of which from outside EU"}]
["TOTEXPSB",null,null,null,null,null,null,"Total exports",{"$f":"VLOOKUP(H17, LanguageData, MATCH(LanguageChosen, Language[Language],0), FALSE)","v":"Total exports"}]
["STOCKSTART",null,null,null,{"$f":"IF(B3=\"PEAT\",1,\"\")","v":""},null,null,"Stocks - beginning of period",{"$f":"VLOOKUP(H18, LanguageData, MATCH(LanguageChosen, Language[Language],0), FALSE)","v":"Stocks - beginning of period"}]
["STOCKEND",null,null,null,{"$f":"IF(B3=\"PEAT\",1,\"\")","v":""},null,null,"Stocks - end of period",{"$f":"VLOOKUP(H19, LanguageData, MATCH(LanguageChosen, Language[Language],0), FALSE)","v":"Stocks - end of period"}]
["STCHANAT",{"$f":"IF(B3<>\"PEAT\",\"IF(OR(sum([Item1=STOCKSTART])>0, sum([Item1=STOCKEND])>0),sum([Item1=STOCKSTART]) - Sum([Item1=STOCKEND]),\"\"\"\")\",\"\")","v":"IF(OR(sum([Item1=STOCKSTART])>0, sum([Item1=STOCKEND])>0),sum([Item1=STOCKSTART]) - Sum([Item1=STOCKEND]),\"\")"},"%ISNUMBER","Numbers only",null,null,null,"Stock changes",{"$f":"VLOOKUP(H20, LanguageData, MATCH(LanguageChosen, Language[Language],0), FALSE)","v":"Stock changes"}]
["INDCONC","IF(Sum([Item1=INDPROD], [Item1=OSOURCES], [Item1=TOTIMPSB], [Item1=STCHANAT]) - sum([Item1=TOTEXPSB])<>0,Sum([Item1=INDPROD], [Item1=OSOURCES], [Item1=TOTIMPSB], [Item1=STCHANAT]) - sum([Item1=TOTEXPSB]),\"\")","%< 0","Calculated inland deliveries cannot be negative",1,null,null,"Calculated inland deliveries",{"$f":"VLOOKUP(H21, LanguageData, MATCH(LanguageChosen, Language[Language],0), FALSE)","v":"Calculated inland deliveries"}]
["STATDIFF",{"$f":"IF(B3=\"HARDCOAL\",\"IF(sum([Item1=INDCONC]) - sum([Item1=INTERNAD])<>0,sum([Item1=INDCONC]) - sum([Item1=INTERNAD]),\"\"\"\")\",\"\")","v":""},"%ISNUMBER","Numbers only",1,null,null,"Statistical differences",{"$f":"VLOOKUP(H22, LanguageData, MATCH(LanguageChosen, Language[Language],0), FALSE)","v":"Statistical differences"}]
["INTERNAD",{"$f":"IF(B3=\"HARDCOAL\",\"IF(sum([Item1=MAINPROD], [Item1=ECOKEOVS], [Item1=TOTIND], [Item1=OTHER])<>0,sum([Item1=MAINPROD], [Item1=ECOKEOVS], [Item1=TOTIND], [Item1=OTHER]),\"\"\"\")\",\"\")","v":""},null,null,1,null,null,"Internal market deliveries (observed)",{"$f":"VLOOKUP(H23, LanguageData, MATCH(LanguageChosen, Language[Language],0), FALSE)","v":"Internal market deliveries (observed)"}]
["MAINPROD",null,null,null,{"$f":"IF(B3=\"COKEOVEN\",1,\"\")","v":""},null,null,"Deliveries to main activity producers",{"$f":"VLOOKUP(H24, LanguageData, MATCH(LanguageChosen, Language[Language],0), FALSE)","v":"Deliveries to main activity producers"}]
["ECOKEOVS",null,null,null,{"$f":"IF($B$3<>\"HARDCOAL\",1,\"\")","v":1},null,null,"Deliveries to coking plants",{"$f":"VLOOKUP(H25, LanguageData, MATCH(LanguageChosen, Language[Language],0), FALSE)","v":"Deliveries to coking plants"}]
["TOTIND",null,null,null,{"$f":"IF($B$3<>\"HARDCOAL\",1,\"\")","v":1},null,null,"Deliveries to total industry",{"$f":"VLOOKUP(H26, LanguageData, MATCH(LanguageChosen, Language[Language],0), FALSE)","v":"Deliveries to total industry"}]
["IRONSTL",null,{"$f":"IF(B3=\"HARDCOAL\",\"> [Item1=TOTIND]\",\"\")","v":""},{"$f":"IF(B3=\"HARDCOAL\",\"Should be less than or equal to 'Deliveries to total industry'\",\"\")","v":""},{"$f":"IF(OR($B$3=\"HARDCOAL\",$B$3=\"COKEOVEN\"),\"\",1)","v":1},null,null,"of which to iron and steel industry",{"$f":"VLOOKUP(H27, LanguageData, MATCH(LanguageChosen, Language[Language],0), FALSE)","v":"of which to iron and steel industry"}]
["OTHER",null,null,null,{"$f":"IF($B$3<>\"HARDCOAL\",1,\"\")","v":1},null,null,"Other deliveries (services, households, …)",{"$f":"VLOOKUP(H28, LanguageData, MATCH(LanguageChosen, Language[Language],0), FALSE)","v":"Other deliveries (services, households, …)"}]

{"sheet":"TemplateRemarksTS","index":27,"n_rows":35,"n_cols":16,"rows_kept":35,"cut":false,"hidden":true,"merged":[]}
["Mode","Remarks"]
["DataType",null,null,null,{"$f":"VLOOKUP(B1, LanguageData, MATCH(LanguageChosen, Language[Language],0), FALSE)","v":"Remarks"}]
["Product"]
["Version",2023,null,null,"M01","M02","M03","M04","M05","M06","M07","M08","M09","M10","M11","M12"]
["Item2",null,"TypeRow",null,"txt","txt","txt","txt","txt","txt","txt","txt","txt","txt","txt","txt"]
[null,null,"Time",{"$f":"CountryName","v":"Slovenia"},{"$f":"$B$4&E4","v":"2023M01"},{"$f":"$B$4&F4","v":"2023M02"},"2023M03","2023M04","2023M05","2023M06","2023M07","2023M08","2023M09","2023M10","2023M11","2023M12"]
["Item1",null,"Label"]
["REMROW01",null,"Remarks 1"]
["REMROW02",null,"Remarks 2"]
["REMROW03",null,"Remarks 3"]
["REMROW04",null,"Remarks 4"]
["REMROW05",null,"Remarks 5"]
["REMROW06",null,"Remarks 6"]
["REMROW07",null,"Remarks 7"]
["REMROW08",null,"Remarks 8"]
["REMROW09",null,"Remarks 9"]
["REMROW10",null,"Remarks 10"]
["REMROW11",null,"Remarks 11"]
["REMROW12",null,"Remarks 12"]
["REMROW13",null,"Remarks 13"]
["REMROW14",null,"Remarks 14"]
["REMROW15",null,"Remarks 15"]
["REMROW16",null,"Remarks 16"]
["REMROW17",null,"Remarks 17"]
["REMROW18",null,"Remarks 18"]
["REMROW19",null,"Remarks 19"]
["REMROW20",null,"Remarks 20"]
["REMROW21",null,"Remarks 21"]
["REMROW22",null,"Remarks 22"]
["REMROW23",null,"Remarks 23"]
["REMROW24",null,"Remarks 24"]
["REMROW25",null,"Remarks 25"]
["REMROW26",null,"Remarks 26"]
["REMROW27",null,"Remarks 27"]
["REMROW28",null,"Remarks 28"]

{"sheet":"Template_Graphs","index":28,"n_rows":1099,"n_cols":16,"rows_kept":1099,"cut":false,"hidden":true,"merged":[]}
["VERSION","2022M05",null,null,null,null,null,"Monthly Coal Statistics (kt)",null,null,null,{"$f":"CountryName","v":"Slovenia"},null,null,null,{"$f":"CountryName & \": \"&VLOOKUP(H1, LanguageData, MATCH(LanguageChosen, Language[Language],0), FALSE)","v":"Slovenia: Monthly Coal Statistics (kt)"}]
["DATATYPE","FLOW"]
["ITEM2"]
[]
[null,{"$f":"DATE(LEFT($B$1,4),RIGHT($B$1,2)-4,1)","v":"2022-01-01"},null,null,null,null,null,"FormulaRow"]
[null,null,null,null,null,null,null,"CheckRow"]
[null,null,null,null,null,null,null,"LockedRow"]
[null,null,null,null,null,null,null,"EmptyRow"]
[null,null,null,null,null,null,null,"VoluntaryRow"]
[null,null,null,null,null,null,null,"LabelRow1"]
["Item1Col","FormulaCol","CheckCol","ProductCol","LockedCol","EmptyCol","VoluntaryCol","LabelCol"]
[]
[null,null,null,null,null,null,null,null,null,"Time","Product","Flow","Value"]
["INDPROD",null,null,"HARDCOAL",1,null,null,"Production ","Hard coal",{"$f":"YEAR(DATE(LEFT($B$1,4),RIGHT($B$1,2)-N14,1)) & \"M\" & TEXT(MONTH(DATE(LEFT($B$1,4),RIGHT($B$1,2)-N14,1)),\"00\")","v":"2021M06"},{"$f":"VLOOKUP(I14, LanguageData, MATCH(LanguageChosen, Language[Language],0), FALSE)","v":"Hard coal"},{"$f":"VLOOKUP(H14, LanguageData, MATCH(LanguageChosen, Language[Language],0), FALSE)","v":"Production "},null,11]
["OSOURCES",null,null,"HARDCOAL",1,null,null,"Recovered products","Hard coal",{"$f":"YEAR(DATE(LEFT($B$1,4),RIGHT($B$1,2)-N15,1)) & \"M\" & TEXT(MONTH(DATE(LEFT($B$1,4),RIGHT($B$1,2)-N15,1)),\"00\")","v":"2021M06"},{"$f":"VLOOKUP(I15, LanguageData, MATCH(LanguageChosen, Language[Language],0), FALSE)","v":"Hard coal"},{"$f":"VLOOKUP(H15, LanguageData, MATCH(LanguageChosen, Language[Language],0), FALSE)","v":"Recovered products"},null,11]
["TOTIMPSB",null,null,"HARDCOAL",1,null,null,"Total imports","Hard coal","2021M06",{"$f":"VLOOKUP(I16, LanguageData, MATCH(LanguageChosen, Language[Language],0), FALSE)","v":"Hard coal"},{"$f":"VLOOKUP(H16, LanguageData, MATCH(LanguageChosen, Language[Language],0), FALSE)","v":"Total imports"},null,11]
["TOTIMPSBEU",null,null,"HARDCOAL",1,null,null,"Imports: of which from outside EU","Hard coal","2021M06",{"$f":"VLOOKUP(I17, LanguageData, MATCH(LanguageChosen, Language[Language],0), FALSE)","v":"Hard coal"},{"$f":"VLOOKUP(H17, LanguageData, MATCH(LanguageChosen, Language[Language],0), FALSE)","v":"Imports: of which from outside EU"},null,11]
["TOTEXPSB",null,null,"HARDCOAL",1,null,null,"Total exports","Hard coal","2021M06",{"$f":"VLOOKUP(I18, LanguageData, MATCH(LanguageChosen, Language[Language],0), FALSE)","v":"Hard coal"},{"$f":"VLOOKUP(H18, LanguageData, MATCH(LanguageChosen, Language[Language],0), FALSE)","v":"Total exports"},null,11]
["STOCKSTART",null,null,"HARDCOAL",1,null,null,"Stocks - beginning of period","Hard coal","2021M06",{"$f":"VLOOKUP(I19, LanguageData, MATCH(LanguageChosen, Language[Language],0), FALSE)","v":"Hard coal"},{"$f":"VLOOKUP(H19, LanguageData, MATCH(LanguageChosen, Language[Language],0), FALSE)","v":"Stocks - beginning of period"},null,11]
["STOCKEND",null,null,"HARDCOAL",1,null,null,"Stocks - end of period","Hard coal","2021M06",{"$f":"VLOOKUP(I20, LanguageData, MATCH(LanguageChosen, Language[Language],0), FALSE)","v":"Hard coal"},{"$f":"VLOOKUP(H20, LanguageData, MATCH(LanguageChosen, Language[Language],0), FALSE)","v":"Stocks - end of period"},null,11]
["STCHANAT",null,null,"HARDCOAL",1,null,null,"Stock changes","Hard coal","2021M06",{"$f":"VLOOKUP(I21, LanguageData, MATCH(LanguageChosen, Language[Language],0), FALSE)","v":"Hard coal"},{"$f":"VLOOKUP(H21, LanguageData, MATCH(LanguageChosen, Language[Language],0), FALSE)","v":"Stock changes"},null,11]
["INDCONC",null,null,"HARDCOAL",1,null,null,"Calculated inland deliveries","Hard coal","2021M06",{"$f":"VLOOKUP(I22, LanguageData, MATCH(LanguageChosen, Language[Language],0), FALSE)","v":"Hard coal"},{"$f":"VLOOKUP(H22, LanguageData, MATCH(LanguageChosen, Language[Language],0), FALSE)","v":"Calculated inland deliveries"},null,11]
["STATDIFF",null,null,"HARDCOAL",1,null,null,"Statistical differences","Hard coal","2021M06",{"$f":"VLOOKUP(I23, LanguageData, MATCH(LanguageChosen, Language[Language],0), FALSE)","v":"Hard coal"},{"$f":"VLOOKUP(H23, LanguageData, MATCH(LanguageChosen, Language[Language],0), FALSE)","v":"Statistical differences"},null,11]
["INTERNAD",null,null,"HARDCOAL",1,null,null,"Internal market deliveries (observed)","Hard coal","2021M06",{"$f":"VLOOKUP(I24, LanguageData, MATCH(LanguageChosen, Language[Language],0), FALSE)","v":"Hard coal"},{"$f":"VLOOKUP(H24, LanguageData, MATCH(LanguageChosen, Language[Language],0), FALSE)","v":"Internal market deliveries (observed)"},null,11]
["MAINPROD",null,null,"HARDCOAL",1,null,null,"Deliveries to main activity producers","Hard coal","2021M06",{"$f":"VLOOKUP(I25, LanguageData, MATCH(LanguageChosen, Language[Language],0), FALSE)","v":"Hard coal"},{"$f":"VLOOKUP(H25, LanguageData, MATCH(LanguageChosen, Language[Language],0), FALSE)","v":"Deliveries to main activity producers"},null,11]
["ECOKEOVS",null,null,"HARDCOAL",1,null,null,"Deliveries to coking plants","Hard coal","2021M06",{"$f":"VLOOKUP(I26, LanguageData, MATCH(LanguageChosen, Language[Language],0), FALSE)","v":"Hard coal"},{"$f":"VLOOKUP(H26, LanguageData, MATCH(LanguageChosen, Language[Language],0), FALSE)","v":"Deliveries to coking plants"},null,11]
["TOTIND",null,null,"HARDCOAL",1,null,null,"Deliveries to total industry","Hard coal","2021M06",{"$f":"VLOOKUP(I27, LanguageData, MATCH(LanguageChosen, Language[Language],0), FALSE)","v":"Hard coal"},{"$f":"VLOOKUP(H27, LanguageData, MATCH(LanguageChosen, Language[Language],0), FALSE)","v":"Deliveries to total industry"},null,11]
["IRONSTL",null,null,"HARDCOAL",1,null,null,"Deliveries to total industry of which to iron and steel industry","Hard coal","2021M06",{"$f":"VLOOKUP(I28, LanguageData, MATCH(LanguageChosen, Language[Language],0), FALSE)","v":"Hard coal"},{"$f":"VLOOKUP(H28, LanguageData, MATCH(LanguageChosen, Language[Language],0), FALSE)","v":"Deliveries to total industry of which to iron and steel industry"},null,11]
["OTHER",null,null,"HARDCOAL",1,null,null,"Other deliveries (services, households, …)","Hard coal","2021M06",{"$f":"VLOOKUP(I29, LanguageData, MATCH(LanguageChosen, Language[Language],0), FALSE)","v":"Hard coal"},{"$f":"VLOOKUP(H29, LanguageData, MATCH(LanguageChosen, Language[Language],0), FALSE)","v":"Other deliveries (services, households, …)"},null,11]
["INDPROD",null,null,"BROWN",1,null,null,"Production ","Brown coal","2021M06",{"$f":"VLOOKUP(I30, LanguageData, MATCH(LanguageChosen, Language[Language],0), FALSE)","v":"Brown coal"},{"$f":"VLOOKUP(H30, LanguageData, MATCH(LanguageChosen, Language[Language],0), FALSE)","v":"Production "},null,11]
["OSOURCES",null,null,"BROWN",1,null,null,"Recovered products","Brown coal","2021M06",{"$f":"VLOOKUP(I31, LanguageData, MATCH(LanguageChosen, Language[Language],0), FALSE)","v":"Brown coal"},{"$f":"VLOOKUP(H31, LanguageData, MATCH(LanguageChosen, Language[Language],0), FALSE)","v":"Recovered products"},null,11]
["TOTIMPSB",null,null,"BROWN",1,null,null,"Total imports","Brown coal","2021M06",{"$f":"VLOOKUP(I32, LanguageData, MATCH(LanguageChosen, Language[Language],0), FALSE)","v":"Brown coal"},{"$f":"VLOOKUP(H32, LanguageData, MATCH(LanguageChosen, Language[Language],0), FALSE)","v":"Total imports"},null,11]
["TOTIMPSBEU",null,null,"BROWN",1,null,null,"Imports: of which from outside EU","Brown coal","2021M06",{"$f":"VLOOKUP(I33, LanguageData, MATCH(LanguageChosen, Language[Language],0), FALSE)","v":"Brown coal"},{"$f":"VLOOKUP(H33, LanguageData, MATCH(LanguageChosen, Language[Language],0), FALSE)","v":"Imports: of which from outside EU"},null,11]
["TOTEXPSB",null,null,"BROWN",1,null,null,"Total exports","Brown coal","2021M06",{"$f":"VLOOKUP(I34, LanguageData, MATCH(LanguageChosen, Language[Language],0), FALSE)","v":"Brown coal"},{"$f":"VLOOKUP(H34, LanguageData, MATCH(LanguageChosen, Language[Language],0), FALSE)","v":"Total exports"},null,11]
["STOCKSTART",null,null,"BROWN",1,null,null,"Stocks - beginning of period","Brown coal","2021M06",{"$f":"VLOOKUP(I35, LanguageData, MATCH(LanguageChosen, Language[Language],0), FALSE)","v":"Brown coal"},{"$f":"VLOOKUP(H35, LanguageData, MATCH(LanguageChosen, Language[Language],0), FALSE)","v":"Stocks - beginning of period"},null,11]
["STOCKEND",null,null,"BROWN",1,null,null,"Stocks - end of period","Brown coal","2021M06",{"$f":"VLOOKUP(I36, LanguageData, MATCH(LanguageChosen, Language[Language],0), FALSE)","v":"Brown coal"},{"$f":"VLOOKUP(H36, LanguageData, MATCH(LanguageChosen, Language[Language],0), FALSE)","v":"Stocks - end of period"},null,11]
["STCHANAT",null,null,"BROWN",1,null,null,"Stock changes","Brown coal","2021M06",{"$f":"VLOOKUP(I37, LanguageData, MATCH(LanguageChosen, Language[Language],0), FALSE)","v":"Brown coal"},{"$f":"VLOOKUP(H37, LanguageData, MATCH(LanguageChosen, Language[Language],0), FALSE)","v":"Stock changes"},null,11]
["INDCONC",null,null,"BROWN",1,null,null,"Calculated inland deliveries","Brown coal","2021M06",{"$f":"VLOOKUP(I38, LanguageData, MATCH(LanguageChosen, Language[Language],0), FALSE)","v":"Brown coal"},{"$f":"VLOOKUP(H38, LanguageData, MATCH(LanguageChosen, Language[Language],0), FALSE)","v":"Calculated inland deliveries"},null,11]
["STATDIFF",null,null,"BROWN",1,null,null,"Statistical differences","Brown coal","2021M06",{"$f":"VLOOKUP(I39, LanguageData, MATCH(LanguageChosen, Language[Language],0), FALSE)","v":"Brown coal"},{"$f":"VLOOKUP(H39, LanguageData, MATCH(LanguageChosen, Language[Language],0), FALSE)","v":"Statistical differences"},null,11]
["INTERNAD",null,null,"BROWN",1,null,null,"Internal market deliveries (observed)","Brown coal","2021M06",{"$f":"VLOOKUP(I40, LanguageData, MATCH(LanguageChosen, Language[Language],0), FALSE)","v":"Brown coal"},{"$f":"VLOOKUP(H40, LanguageData, MATCH(LanguageChosen, Language[Language],0), FALSE)","v":"Internal market deliveries (observed)"},null,11]
["MAINPROD",null,null,"BROWN",1,null,null,"Deliveries to main activity producers","Brown coal","2021M06",{"$f":"VLOOKUP(I41, LanguageData, MATCH(LanguageChosen, Language[Language],0), FALSE)","v":"Brown coal"},{"$f":"VLOOKUP(H41, LanguageData, MATCH(LanguageChosen, Language[Language],0), FALSE)","v":"Deliveries to main activity producers"},null,11]
["ECOKEOVS",null,null,"BROWN",1,null,null,"Deliveries to coking plants","Brown coal","2021M06",{"$f":"VLOOKUP(I42, LanguageData, MATCH(LanguageChosen, Language[Language],0), FALSE)","v":"Brown coal"},{"$f":"VLOOKUP(H42, LanguageData, MATCH(LanguageChosen, Language[Language],0), FALSE)","v":"Deliveries to coking plants"},null,11]
["TOTIND",null,null,"BROWN",1,null,null,"Deliveries to total industry","Brown coal","2021M06",{"$f":"VLOOKUP(I43, LanguageData, MATCH(LanguageChosen, Language[Language],0), FALSE)","v":"Brown coal"},{"$f":"VLOOKUP(H43, LanguageData, MATCH(LanguageChosen, Language[Language],0), FALSE)","v":"Deliveries to total industry"},null,11]
["IRONSTL",null,null,"BROWN",1,null,null,"Deliveries to total industry of which to iron and steel industry","Brown coal","2021M06",{"$f":"VLOOKUP(I44, LanguageData, MATCH(LanguageChosen, Language[Language],0), FALSE)","v":"Brown coal"},{"$f":"VLOOKUP(H44, LanguageData, MATCH(LanguageChosen, Language[Language],0), FALSE)","v":"Deliveries to total industry of which to iron and steel industry"},null,11]
["OTHER",null,null,"BROWN",1,null,null,"Other deliveries (services, households, …)","Brown coal","2021M06",{"$f":"VLOOKUP(I45, LanguageData, MATCH(LanguageChosen, Language[Language],0), FALSE)","v":"Brown coal"},{"$f":"VLOOKUP(H45, LanguageData, MATCH(LanguageChosen, Language[Language],0), FALSE)","v":"Other deliveries (services, households, …)"},null,11]
["INDPROD",null,null,"PEAT",1,null,null,"Production ","Peat","2021M06",{"$f":"VLOOKUP(I46, LanguageData, MATCH(LanguageChosen, Language[Language],0), FALSE)","v":"Peat"},{"$f":"VLOOKUP(H46, LanguageData, MATCH(LanguageChosen, Language[Language],0), FALSE)","v":"Production "},null,11]
["OSOURCES",null,null,"PEAT",1,null,null,"Recovered products","Peat","2021M06",{"$f":"VLOOKUP(I47, LanguageData, MATCH(LanguageChosen, Language[Language],0), FALSE)","v":"Peat"},{"$f":"VLOOKUP(H47, LanguageData, MATCH(LanguageChosen, Language[Language],0), FALSE)","v":"Recovered products"},null,11]
["TOTIMPSB",null,null,"PEAT",1,null,null,"Total imports","Peat","2021M06",{"$f":"VLOOKUP(I48, LanguageData, MATCH(LanguageChosen, Language[Language],0), FALSE)","v":"Peat"},{"$f":"VLOOKUP(H48, LanguageData, MATCH(LanguageChosen, Language[Language],0), FALSE)","v":"Total imports"},null,11]
["TOTIMPSBEU",null,null,"PEAT",1,null,null,"Imports: of which from outside EU","Peat","2021M06",{"$f":"VLOOKUP(I49, LanguageData, MATCH(LanguageChosen, Language[Language],0), FALSE)","v":"Peat"},{"$f":"VLOOKUP(H49, LanguageData, MATCH(LanguageChosen, Language[Language],0), FALSE)","v":"Imports: of which from outside EU"},null,11]
["TOTEXPSB",null,null,"PEAT",1,null,null,"Total exports","Peat","2021M06",{"$f":"VLOOKUP(I50, LanguageData, MATCH(LanguageChosen, Language[Language],0), FALSE)","v":"Peat"},{"$f":"VLOOKUP(H50, LanguageData, MATCH(LanguageChosen, Language[Language],0), FALSE)","v":"Total exports"},null,11]
["STOCKSTART",null,null,"PEAT",1,null,null,"Stocks - beginning of period","Peat","2021M06",{"$f":"VLOOKUP(I51, LanguageData, MATCH(LanguageChosen, Language[Language],0), FALSE)","v":"Peat"},{"$f":"VLOOKUP(H51, LanguageData, MATCH(LanguageChosen, Language[Language],0), FALSE)","v":"Stocks - beginning of period"},null,11]
["STOCKEND",null,null,"PEAT",1,null,null,"Stocks - end of period","Peat","2021M06",{"$f":"VLOOKUP(I52, LanguageData, MATCH(LanguageChosen, Language[Language],0), FALSE)","v":"Peat"},{"$f":"VLOOKUP(H52, LanguageData, MATCH(LanguageChosen, Language[Language],0), FALSE)","v":"Stocks - end of period"},null,11]
["STCHANAT",null,null,"PEAT",1,null,null,"Stock changes","Peat","2021M06",{"$f":"VLOOKUP(I53, LanguageData, MATCH(LanguageChosen, Language[Language],0), FALSE)","v":"Peat"},{"$f":"VLOOKUP(H53, LanguageData, MATCH(LanguageChosen, Language[Language],0), FALSE)","v":"Stock changes"},null,11]
["INDCONC",null,null,"PEAT",1,null,null,"Calculated inland deliveries","Peat","2021M06",{"$f":"VLOOKUP(I54, LanguageData, MATCH(LanguageChosen, Language[Language],0), FALSE)","v":"Peat"},{"$f":"VLOOKUP(H54, LanguageData, MATCH(LanguageChosen, Language[Language],0), FALSE)","v":"Calculated inland deliveries"},null,11]
["STATDIFF",null,null,"PEAT",1,null,null,"Statistical differences","Peat","2021M06",{"$f":"VLOOKUP(I55, LanguageData, MATCH(LanguageChosen, Language[Language],0), FALSE)","v":"Peat"},{"$f":"VLOOKUP(H55, LanguageData, MATCH(LanguageChosen, Language[Language],0), FALSE)","v":"Statistical differences"},null,11]
["INTERNAD",null,null,"PEAT",1,null,null,"Internal market deliveries (observed)","Peat","2021M06",{"$f":"VLOOKUP(I56, LanguageData, MATCH(LanguageChosen, Language[Language],0), FALSE)","v":"Peat"},{"$f":"VLOOKUP(H56, LanguageData, MATCH(LanguageChosen, Language[Language],0), FALSE)","v":"Internal market deliveries (observed)"},null,11]
["MAINPROD",null,null,"PEAT",1,null,null,"Deliveries to main activity producers","Peat","2021M06",{"$f":"VLOOKUP(I57, LanguageData, MATCH(LanguageChosen, Language[Language],0), FALSE)","v":"Peat"},{"$f":"VLOOKUP(H57, LanguageData, MATCH(LanguageChosen, Language[Language],0), FALSE)","v":"Deliveries to main activity producers"},null,11]
["ECOKEOVS",null,null,"PEAT",1,null,null,"Deliveries to coking plants","Peat","2021M06",{"$f":"VLOOKUP(I58, LanguageData, MATCH(LanguageChosen, Language[Language],0), FALSE)","v":"Peat"},{"$f":"VLOOKUP(H58, LanguageData, MATCH(LanguageChosen, Language[Language],0), FALSE)","v":"Deliveries to coking plants"},null,11]
["TOTIND",null,null,"PEAT",1,null,null,"Deliveries to total industry","Peat","2021M06",{"$f":"VLOOKUP(I59, LanguageData, MATCH(LanguageChosen, Language[Language],0), FALSE)","v":"Peat"},{"$f":"VLOOKUP(H59, LanguageData, MATCH(LanguageChosen, Language[Language],0), FALSE)","v":"Deliveries to total industry"},null,11]
["IRONSTL",null,null,"PEAT",1,null,null,"Deliveries to total industry of which to iron and steel industry","Peat","2021M06",{"$f":"VLOOKUP(I60, LanguageData, MATCH(LanguageChosen, Language[Language],0), FALSE)","v":"Peat"},{"$f":"VLOOKUP(H60, LanguageData, MATCH(LanguageChosen, Language[Language],0), FALSE)","v":"Deliveries to total industry of which to iron and steel industry"},null,11]
["OTHER",null,null,"PEAT",1,null,null,"Other deliveries (services, households, …)","Peat","2021M06",{"$f":"VLOOKUP(I61, LanguageData, MATCH(LanguageChosen, Language[Language],0), FALSE)","v":"Peat"},{"$f":"VLOOKUP(H61, LanguageData, MATCH(LanguageChosen, Language[Language],0), FALSE)","v":"Other deliveries (services, households, …)"},null,11]
["INDPROD",null,null,"OILSHALE",1,null,null,"Production ","Oil shale and oil sands","2021M06",{"$f":"VLOOKUP(I62, LanguageData, MATCH(LanguageChosen, Language[Language],0), FALSE)","v":"Oil shale and oil sands"},{"$f":"VLOOKUP(H62, LanguageData, MATCH(LanguageChosen, Language[Language],0), FALSE)","v":"Production "},null,11]
["OSOURCES",null,null,"OILSHALE",1,null,null,"Recovered products","Oil shale and oil sands","2021M06",{"$f":"VLOOKUP(I63, LanguageData, MATCH(LanguageChosen, Language[Language],0), FALSE)","v":"Oil shale and oil sands"},{"$f":"VLOOKUP(H63, LanguageData, MATCH(LanguageChosen, Language[Language],0), FALSE)","v":"Recovered products"},null,11]
["TOTIMPSB",null,null,"OILSHALE",1,null,null,"Total imports","Oil shale and oil sands","2021M06",{"$f":"VLOOKUP(I64, LanguageData, MATCH(LanguageChosen, Language[Language],0), FALSE)","v":"Oil shale and oil sands"},{"$f":"VLOOKUP(H64, LanguageData, MATCH(LanguageChosen, Language[Language],0), FALSE)","v":"Total imports"},null,11]
["TOTIMPSBEU",null,null,"OILSHALE",1,null,null,"Imports: of which from outside EU","Oil shale and oil sands","2021M06",{"$f":"VLOOKUP(I65, LanguageData, MATCH(LanguageChosen, Language[Language],0), FALSE)","v":"Oil shale and oil sands"},{"$f":"VLOOKUP(H65, LanguageData, MATCH(LanguageChosen, Language[Language],0), FALSE)","v":"Imports: of which from outside EU"},null,11]
["TOTEXPSB",null,null,"OILSHALE",1,null,null,"Total exports","Oil shale and oil sands","2021M06",{"$f":"VLOOKUP(I66, LanguageData, MATCH(LanguageChosen, Language[Language],0), FALSE)","v":"Oil shale and oil sands"},{"$f":"VLOOKUP(H66, LanguageData, MATCH(LanguageChosen, Language[Language],0), FALSE)","v":"Total exports"},null,11]
["STOCKSTART",null,null,"OILSHALE",1,null,null,"Stocks - beginning of period","Oil shale and oil sands","2021M06",{"$f":"VLOOKUP(I67, LanguageData, MATCH(LanguageChosen, Language[Language],0), FALSE)","v":"Oil shale and oil sands"},{"$f":"VLOOKUP(H67, LanguageData, MATCH(LanguageChosen, Language[Language],0), FALSE)","v":"Stocks - beginning of period"},null,11]
["STOCKEND",null,null,"OILSHALE",1,null,null,"Stocks - end of period","Oil shale and oil sands","2021M06",{"$f":"VLOOKUP(I68, LanguageData, MATCH(LanguageChosen, Language[Language],0), FALSE)","v":"Oil shale and oil sands"},{"$f":"VLOOKUP(H68, LanguageData, MATCH(LanguageChosen, Language[Language],0), FALSE)","v":"Stocks - end of period"},null,11]
["STCHANAT",null,null,"OILSHALE",1,null,null,"Stock changes","Oil shale and oil sands","2021M06",{"$f":"VLOOKUP(I69, LanguageData, MATCH(LanguageChosen, Language[Language],0), FALSE)","v":"Oil shale and oil sands"},{"$f":"VLOOKUP(H69, LanguageData, MATCH(LanguageChosen, Language[Language],0), FALSE)","v":"Stock changes"},null,11]
["INDCONC",null,null,"OILSHALE",1,null,null,"Calculated inland deliveries","Oil shale and oil sands","2021M06",{"$f":"VLOOKUP(I70, LanguageData, MATCH(LanguageChosen, Language[Language],0), FALSE)","v":"Oil shale and oil sands"},{"$f":"VLOOKUP(H70, LanguageData, MATCH(LanguageChosen, Language[Language],0), FALSE)","v":"Calculated inland deliveries"},null,11]
["STATDIFF",null,null,"OILSHALE",1,null,null,"Statistical differences","Oil shale and oil sands","2021M06",{"$f":"VLOOKUP(I71, LanguageData, MATCH(LanguageChosen, Language[Language],0), FALSE)","v":"Oil shale and oil sands"},{"$f":"VLOOKUP(H71, LanguageData, MATCH(LanguageChosen, Language[Language],0), FALSE)","v":"Statistical differences"},null,11]
["INTERNAD",null,null,"OILSHALE",1,null,null,"Internal market deliveries (observed)","Oil shale and oil sands","2021M06",{"$f":"VLOOKUP(I72, LanguageData, MATCH(LanguageChosen, Language[Language],0), FALSE)","v":"Oil shale and oil sands"},{"$f":"VLOOKUP(H72, LanguageData, MATCH(LanguageChosen, Language[Language],0), FALSE)","v":"Internal market deliveries (observed)"},null,11]
["MAINPROD",null,null,"OILSHALE",1,null,null,"Deliveries to main activity producers","Oil shale and oil sands","2021M06",{"$f":"VLOOKUP(I73, LanguageData, MATCH(LanguageChosen, Language[Language],0), FALSE)","v":"Oil shale and oil sands"},{"$f":"VLOOKUP(H73, LanguageData, MATCH(LanguageChosen, Language[Language],0), FALSE)","v":"Deliveries to main activity producers"},null,11]
["ECOKEOVS",null,null,"OILSHALE",1,null,null,"Deliveries to coking plants","Oil shale and oil sands","2021M06",{"$f":"VLOOKUP(I74, LanguageData, MATCH(LanguageChosen, Language[Language],0), FALSE)","v":"Oil shale and oil sands"},{"$f":"VLOOKUP(H74, LanguageData, MATCH(LanguageChosen, Language[Language],0), FALSE)","v":"Deliveries to coking plants"},null,11]
["TOTIND",null,null,"OILSHALE",1,null,null,"Deliveries to total industry","Oil shale and oil sands","2021M06",{"$f":"VLOOKUP(I75, LanguageData, MATCH(LanguageChosen, Language[Language],0), FALSE)","v":"Oil shale and oil sands"},{"$f":"VLOOKUP(H75, LanguageData, MATCH(LanguageChosen, Language[Language],0), FALSE)","v":"Deliveries to total industry"},null,11]
["IRONSTL",null,null,"OILSHALE",1,null,null,"Deliveries to total industry of which to iron and steel industry","Oil shale and oil sands","2021M06",{"$f":"VLOOKUP(I76, LanguageData, MATCH(LanguageChosen, Language[Language],0), FALSE)","v":"Oil shale and oil sands"},{"$f":"VLOOKUP(H76, LanguageData, MATCH(LanguageChosen, Language[Language],0), FALSE)","v":"Deliveries to total industry of which to iron and steel industry"},null,11]
["OTHER",null,null,"OILSHALE",1,null,null,"Other deliveries (services, households, …)","Oil shale and oil sands","2021M06",{"$f":"VLOOKUP(I77, LanguageData, MATCH(LanguageChosen, Language[Language],0), FALSE)","v":"Oil shale and oil sands"},{"$f":"VLOOKUP(H77, LanguageData, MATCH(LanguageChosen, Language[Language],0), FALSE)","v":"Other deliveries (services, households, …)"},null,11]
["INDPROD",null,null,"COKEOVEN",1,null,null,"Production ","Coke oven coke","2021M06",{"$f":"VLOOKUP(I78, LanguageData, MATCH(LanguageChosen, Language[Language],0), FALSE)","v":"Coke oven coke"},{"$f":"VLOOKUP(H78, LanguageData, MATCH(LanguageChosen, Language[Language],0), FALSE)","v":"Production "},null,11]
["OSOURCES",null,null,"COKEOVEN",1,null,null,"Recovered products","Coke oven coke",{"$f":"YEAR(DATE(LEFT($B$1,4),RIGHT($B$1,2)-N79,1)) & \"M\" & TEXT(MONTH(DATE(LEFT($B$1,4),RIGHT($B$1,2)-N79,1)),\"00\")","v":"2021M06"},{"$f":"VLOOKUP(I79, LanguageData, MATCH(LanguageChosen, Language[Language],0), FALSE)","v":"Coke oven coke"},{"$f":"VLOOKUP(H79, LanguageData, MATCH(LanguageChosen, Language[Language],0), FALSE)","v":"Recovered products"},null,11]
["TOTIMPSB",null,null,"COKEOVEN",1,null,null,"Total imports","Coke oven coke","2021M06",{"$f":"VLOOKUP(I80, LanguageData, MATCH(LanguageChosen, Language[Language],0), FALSE)","v":"Coke oven coke"},{"$f":"VLOOKUP(H80, LanguageData, MATCH(LanguageChosen, Language[Language],0), FALSE)","v":"Total imports"},null,11]
["TOTIMPSBEU",null,null,"COKEOVEN",1,null,null,"Imports: of which from outside EU","Coke oven coke","2021M06",{"$f":"VLOOKUP(I81, LanguageData, MATCH(LanguageChosen, Language[Language],0), FALSE)","v":"Coke oven coke"},{"$f":"VLOOKUP(H81, LanguageData, MATCH(LanguageChosen, Language[Language],0), FALSE)","v":"Imports: of which from outside EU"},null,11]
["TOTEXPSB",null,null,"COKEOVEN",1,null,null,"Total exports","Coke oven coke","2021M06",{"$f":"VLOOKUP(I82, LanguageData, MATCH(LanguageChosen, Language[Language],0), FALSE)","v":"Coke oven coke"},{"$f":"VLOOKUP(H82, LanguageData, MATCH(LanguageChosen, Language[Language],0), FALSE)","v":"Total exports"},null,11]
["STOCKSTART",null,null,"COKEOVEN",1,null,null,"Stocks - beginning of period","Coke oven coke","2021M06",{"$f":"VLOOKUP(I83, LanguageData, MATCH(LanguageChosen, Language[Language],0), FALSE)","v":"Coke oven coke"},{"$f":"VLOOKUP(H83, LanguageData, MATCH(LanguageChosen, Language[Language],0), FALSE)","v":"Stocks - beginning of period"},null,11]
["STOCKEND",null,null,"COKEOVEN",1,null,null,"Stocks - end of period","Coke oven coke","2021M06",{"$f":"VLOOKUP(I84, LanguageData, MATCH(LanguageChosen, Language[Language],0), FALSE)","v":"Coke oven coke"},{"$f":"VLOOKUP(H84, LanguageData, MATCH(LanguageChosen, Language[Language],0), FALSE)","v":"Stocks - end of period"},null,11]
["STCHANAT",null,null,"COKEOVEN",1,null,null,"Stock changes","Coke oven coke","2021M06",{"$f":"VLOOKUP(I85, LanguageData, MATCH(LanguageChosen, Language[Language],0), FALSE)","v":"Coke oven coke"},{"$f":"VLOOKUP(H85, LanguageData, MATCH(LanguageChosen, Language[Language],0), FALSE)","v":"Stock changes"},null,11]
["INDCONC",null,null,"COKEOVEN",1,null,null,"Calculated inland deliveries","Coke oven coke","2021M06",{"$f":"VLOOKUP(I86, LanguageData, MATCH(LanguageChosen, Language[Language],0), FALSE)","v":"Coke oven coke"},{"$f":"VLOOKUP(H86, LanguageData, MATCH(LanguageChosen, Language[Language],0), FALSE)","v":"Calculated inland deliveries"},null,11]
["STATDIFF",null,null,"COKEOVEN",1,null,null,"Statistical differences","Coke oven coke","2021M06",{"$f":"VLOOKUP(I87, LanguageData, MATCH(LanguageChosen, Language[Language],0), FALSE)","v":"Coke oven coke"},{"$f":"VLOOKUP(H87, LanguageData, MATCH(LanguageChosen, Language[Language],0), FALSE)","v":"Statistical differences"},null,11]
["INTERNAD",null,null,"COKEOVEN",1,null,null,"Internal market deliveries (observed)","Coke oven coke","2021M06",{"$f":"VLOOKUP(I88, LanguageData, MATCH(LanguageChosen, Language[Language],0), FALSE)","v":"Coke oven coke"},{"$f":"VLOOKUP(H88, LanguageData, MATCH(LanguageChosen, Language[Language],0), FALSE)","v":"Internal market deliveries (observed)"},null,11]
["MAINPROD",null,null,"COKEOVEN",1,null,null,"Deliveries to main activity producers","Coke oven coke","2021M06",{"$f":"VLOOKUP(I89, LanguageData, MATCH(LanguageChosen, Language[Language],0), FALSE)","v":"Coke oven coke"},{"$f":"VLOOKUP(H89, LanguageData, MATCH(LanguageChosen, Language[Language],0), FALSE)","v":"Deliveries to main activity producers"},null,11]
["ECOKEOVS",null,null,"COKEOVEN",1,null,null,"Deliveries to coking plants","Coke oven coke","2021M06",{"$f":"VLOOKUP(I90, LanguageData, MATCH(LanguageChosen, Language[Language],0), FALSE)","v":"Coke oven coke"},{"$f":"VLOOKUP(H90, LanguageData, MATCH(LanguageChosen, Language[Language],0), FALSE)","v":"Deliveries to coking plants"},null,11]
["TOTIND",null,null,"COKEOVEN",1,null,null,"Deliveries to total industry","Coke oven coke","2021M06",{"$f":"VLOOKUP(I91, LanguageData, MATCH(LanguageChosen, Language[Language],0), FALSE)","v":"Coke oven coke"},{"$f":"VLOOKUP(H91, LanguageData, MATCH(LanguageChosen, Language[Language],0), FALSE)","v":"Deliveries to total industry"},null,11]
["IRONSTL",null,null,"COKEOVEN",1,null,null,"Deliveries to total industry of which to iron and steel industry","Coke oven coke","2021M06",{"$f":"VLOOKUP(I92, LanguageData, MATCH(LanguageChosen, Language[Language],0), FALSE)","v":"Coke oven coke"},{"$f":"VLOOKUP(H92, LanguageData, MATCH(LanguageChosen, Language[Language],0), FALSE)","v":"Deliveries to total industry of which to iron and steel industry"},null,11]
["OTHER",null,null,"COKEOVEN",1,null,null,"Other deliveries (services, households, …)","Coke oven coke","2021M06",{"$f":"VLOOKUP(I93, LanguageData, MATCH(LanguageChosen, Language[Language],0), FALSE)","v":"Coke oven coke"},{"$f":"VLOOKUP(H93, LanguageData, MATCH(LanguageChosen, Language[Language],0), FALSE)","v":"Other deliveries (services, households, …)"},null,11]
["INDPROD",null,null,"HARDCOAL",1,null,null,"Production ","Hard coal","2021M07",{"$f":"VLOOKUP(I94, LanguageData, MATCH(LanguageChosen, Language[Language],0), FALSE)","v":"Hard coal"},{"$f":"VLOOKUP(H94, LanguageData, MATCH(LanguageChosen, Language[Language],0), FALSE)","v":"Production "},null,10]
["OSOURCES",null,null,"HARDCOAL",1,null,null,"Recovered products","Hard coal","2021M07",{"$f":"VLOOKUP(I95, LanguageData, MATCH(LanguageChosen, Language[Language],0), FALSE)","v":"Hard coal"},{"$f":"VLOOKUP(H95, LanguageData, MATCH(LanguageChosen, Language[Language],0), FALSE)","v":"Recovered products"},null,10]
["TOTIMPSB",null,null,"HARDCOAL",1,null,null,"Total imports","Hard coal","2021M07",{"$f":"VLOOKUP(I96, LanguageData, MATCH(LanguageChosen, Language[Language],0), FALSE)","v":"Hard coal"},{"$f":"VLOOKUP(H96, LanguageData, MATCH(LanguageChosen, Language[Language],0), FALSE)","v":"Total imports"},null,10]
["TOTIMPSBEU",null,null,"HARDCOAL",1,null,null,"Imports: of which from outside EU","Hard coal","2021M07",{"$f":"VLOOKUP(I97, LanguageData, MATCH(LanguageChosen, Language[Language],0), FALSE)","v":"Hard coal"},{"$f":"VLOOKUP(H97, LanguageData, MATCH(LanguageChosen, Language[Language],0), FALSE)","v":"Imports: of which from outside EU"},null,10]
["TOTEXPSB",null,null,"HARDCOAL",1,null,null,"Total exports","Hard coal","2021M07",{"$f":"VLOOKUP(I98, LanguageData, MATCH(LanguageChosen, Language[Language],0), FALSE)","v":"Hard coal"},{"$f":"VLOOKUP(H98, LanguageData, MATCH(LanguageChosen, Language[Language],0), FALSE)","v":"Total exports"},null,10]
["STOCKSTART",null,null,"HARDCOAL",1,null,null,"Stocks - beginning of period","Hard coal","2021M07",{"$f":"VLOOKUP(I99, LanguageData, MATCH(LanguageChosen, Language[Language],0), FALSE)","v":"Hard coal"},{"$f":"VLOOKUP(H99, LanguageData, MATCH(LanguageChosen, Language[Language],0), FALSE)","v":"Stocks - beginning of period"},null,10]
["STOCKEND",null,null,"HARDCOAL",1,null,null,"Stocks - end of period","Hard coal","2021M07",{"$f":"VLOOKUP(I100, LanguageData, MATCH(LanguageChosen, Language[Language],0), FALSE)","v":"Hard coal"},{"$f":"VLOOKUP(H100, LanguageData, MATCH(LanguageChosen, Language[Language],0), FALSE)","v":"Stocks - end of period"},null,10]
["STCHANAT",null,null,"HARDCOAL",1,null,null,"Stock changes","Hard coal","2021M07",{"$f":"VLOOKUP(I101, LanguageData, MATCH(LanguageChosen, Language[Language],0), FALSE)","v":"Hard coal"},{"$f":"VLOOKUP(H101, LanguageData, MATCH(LanguageChosen, Language[Language],0), FALSE)","v":"Stock changes"},null,10]
["INDCONC",null,null,"HARDCOAL",1,null,null,"Calculated inland deliveries","Hard coal","2021M07",{"$f":"VLOOKUP(I102, LanguageData, MATCH(LanguageChosen, Language[Language],0), FALSE)","v":"Hard coal"},{"$f":"VLOOKUP(H102, LanguageData, MATCH(LanguageChosen, Language[Language],0), FALSE)","v":"Calculated inland deliveries"},null,10]
["STATDIFF",null,null,"HARDCOAL",1,null,null,"Statistical differences","Hard coal","2021M07",{"$f":"VLOOKUP(I103, LanguageData, MATCH(LanguageChosen, Language[Language],0), FALSE)","v":"Hard coal"},{"$f":"VLOOKUP(H103, LanguageData, MATCH(LanguageChosen, Language[Language],0), FALSE)","v":"Statistical differences"},null,10]
["INTERNAD",null,null,"HARDCOAL",1,null,null,"Internal market deliveries (observed)","Hard coal","2021M07",{"$f":"VLOOKUP(I104, LanguageData, MATCH(LanguageChosen, Language[Language],0), FALSE)","v":"Hard coal"},{"$f":"VLOOKUP(H104, LanguageData, MATCH(LanguageChosen, Language[Language],0), FALSE)","v":"Internal market deliveries (observed)"},null,10]
["MAINPROD",null,null,"HARDCOAL",1,null,null,"Deliveries to main activity producers","Hard coal","2021M07",{"$f":"VLOOKUP(I105, LanguageData, MATCH(LanguageChosen, Language[Language],0), FALSE)","v":"Hard coal"},{"$f":"VLOOKUP(H105, LanguageData, MATCH(LanguageChosen, Language[Language],0), FALSE)","v":"Deliveries to main activity producers"},null,10]
["ECOKEOVS",null,null,"HARDCOAL",1,null,null,"Deliveries to coking plants","Hard coal","2021M07",{"$f":"VLOOKUP(I106, LanguageData, MATCH(LanguageChosen, Language[Language],0), FALSE)","v":"Hard coal"},{"$f":"VLOOKUP(H106, LanguageData, MATCH(LanguageChosen, Language[Language],0), FALSE)","v":"Deliveries to coking plants"},null,10]
["TOTIND",null,null,"HARDCOAL",1,null,null,"Deliveries to total industry","Hard coal","2021M07",{"$f":"VLOOKUP(I107, LanguageData, MATCH(LanguageChosen, Language[Language],0), FALSE)","v":"Hard coal"},{"$f":"VLOOKUP(H107, LanguageData, MATCH(LanguageChosen, Language[Language],0), FALSE)","v":"Deliveries to total industry"},null,10]
["IRONSTL",null,null,"HARDCOAL",1,null,null,"Deliveries to total industry of which to iron and steel industry","Hard coal","2021M07",{"$f":"VLOOKUP(I108, LanguageData, MATCH(LanguageChosen, Language[Language],0), FALSE)","v":"Hard coal"},{"$f":"VLOOKUP(H108, LanguageData, MATCH(LanguageChosen, Language[Language],0), FALSE)","v":"Deliveries to total industry of which to iron and steel industry"},null,10]
["OTHER",null,null,"HARDCOAL",1,null,null,"Other deliveries (services, households, …)","Hard coal","2021M07",{"$f":"VLOOKUP(I109, LanguageData, MATCH(LanguageChosen, Language[Language],0), FALSE)","v":"Hard coal"},{"$f":"VLOOKUP(H109, LanguageData, MATCH(LanguageChosen, Language[Language],0), FALSE)","v":"Other deliveries (services, households, …)"},null,10]
["INDPROD",null,null,"BROWN",1,null,null,"Production ","Brown coal","2021M07",{"$f":"VLOOKUP(I110, LanguageData, MATCH(LanguageChosen, Language[Language],0), FALSE)","v":"Brown coal"},{"$f":"VLOOKUP(H110, LanguageData, MATCH(LanguageChosen, Language[Language],0), FALSE)","v":"Production "},null,10]
["OSOURCES",null,null,"BROWN",1,null,null,"Recovered products","Brown coal","2021M07",{"$f":"VLOOKUP(I111, LanguageData, MATCH(LanguageChosen, Language[Language],0), FALSE)","v":"Brown coal"},{"$f":"VLOOKUP(H111, LanguageData, MATCH(LanguageChosen, Language[Language],0), FALSE)","v":"Recovered products"},null,10]
["TOTIMPSB",null,null,"BROWN",1,null,null,"Total imports","Brown coal","2021M07",{"$f":"VLOOKUP(I112, LanguageData, MATCH(LanguageChosen, Language[Language],0), FALSE)","v":"Brown coal"},{"$f":"VLOOKUP(H112, LanguageData, MATCH(LanguageChosen, Language[Language],0), FALSE)","v":"Total imports"},null,10]
["TOTIMPSBEU",null,null,"BROWN",1,null,null,"Imports: of which from outside EU","Brown coal","2021M07",{"$f":"VLOOKUP(I113, LanguageData, MATCH(LanguageChosen, Language[Language],0), FALSE)","v":"Brown coal"},{"$f":"VLOOKUP(H113, LanguageData, MATCH(LanguageChosen, Language[Language],0), FALSE)","v":"Imports: of which from outside EU"},null,10]
["TOTEXPSB",null,null,"BROWN",1,null,null,"Total exports","Brown coal","2021M07",{"$f":"VLOOKUP(I114, LanguageData, MATCH(LanguageChosen, Language[Language],0), FALSE)","v":"Brown coal"},{"$f":"VLOOKUP(H114, LanguageData, MATCH(LanguageChosen, Language[Language],0), FALSE)","v":"Total exports"},null,10]
["STOCKSTART",null,null,"BROWN",1,null,null,"Stocks - beginning of period","Brown coal","2021M07",{"$f":"VLOOKUP(I115, LanguageData, MATCH(LanguageChosen, Language[Language],0), FALSE)","v":"Brown coal"},{"$f":"VLOOKUP(H115, LanguageData, MATCH(LanguageChosen, Language[Language],0), FALSE)","v":"Stocks - beginning of period"},null,10]
["STOCKEND",null,null,"BROWN",1,null,null,"Stocks - end of period","Brown coal","2021M07",{"$f":"VLOOKUP(I116, LanguageData, MATCH(LanguageChosen, Language[Language],0), FALSE)","v":"Brown coal"},{"$f":"VLOOKUP(H116, LanguageData, MATCH(LanguageChosen, Language[Language],0), FALSE)","v":"Stocks - end of period"},null,10]
["STCHANAT",null,null,"BROWN",1,null,null,"Stock changes","Brown coal","2021M07",{"$f":"VLOOKUP(I117, LanguageData, MATCH(LanguageChosen, Language[Language],0), FALSE)","v":"Brown coal"},{"$f":"VLOOKUP(H117, LanguageData, MATCH(LanguageChosen, Language[Language],0), FALSE)","v":"Stock changes"},null,10]
["INDCONC",null,null,"BROWN",1,null,null,"Calculated inland deliveries","Brown coal","2021M07",{"$f":"VLOOKUP(I118, LanguageData, MATCH(LanguageChosen, Language[Language],0), FALSE)","v":"Brown coal"},{"$f":"VLOOKUP(H118, LanguageData, MATCH(LanguageChosen, Language[Language],0), FALSE)","v":"Calculated inland deliveries"},null,10]
["STATDIFF",null,null,"BROWN",1,null,null,"Statistical differences","Brown coal","2021M07",{"$f":"VLOOKUP(I119, LanguageData, MATCH(LanguageChosen, Language[Language],0), FALSE)","v":"Brown coal"},{"$f":"VLOOKUP(H119, LanguageData, MATCH(LanguageChosen, Language[Language],0), FALSE)","v":"Statistical differences"},null,10]
["INTERNAD",null,null,"BROWN",1,null,null,"Internal market deliveries (observed)","Brown coal","2021M07",{"$f":"VLOOKUP(I120, LanguageData, MATCH(LanguageChosen, Language[Language],0), FALSE)","v":"Brown coal"},{"$f":"VLOOKUP(H120, LanguageData, MATCH(LanguageChosen, Language[Language],0), FALSE)","v":"Internal market deliveries (observed)"},null,10]
["MAINPROD",null,null,"BROWN",1,null,null,"Deliveries to main activity producers","Brown coal","2021M07",{"$f":"VLOOKUP(I121, LanguageData, MATCH(LanguageChosen, Language[Language],0), FALSE)","v":"Brown coal"},{"$f":"VLOOKUP(H121, LanguageData, MATCH(LanguageChosen, Language[Language],0), FALSE)","v":"Deliveries to main activity producers"},null,10]
["ECOKEOVS",null,null,"BROWN",1,null,null,"Deliveries to coking plants","Brown coal","2021M07",{"$f":"VLOOKUP(I122, LanguageData, MATCH(LanguageChosen, Language[Language],0), FALSE)","v":"Brown coal"},{"$f":"VLOOKUP(H122, LanguageData, MATCH(LanguageChosen, Language[Language],0), FALSE)","v":"Deliveries to coking plants"},null,10]
["TOTIND",null,null,"BROWN",1,null,null,"Deliveries to total industry","Brown coal","2021M07",{"$f":"VLOOKUP(I123, LanguageData, MATCH(LanguageChosen, Language[Language],0), FALSE)","v":"Brown coal"},{"$f":"VLOOKUP(H123, LanguageData, MATCH(LanguageChosen, Language[Language],0), FALSE)","v":"Deliveries to total industry"},null,10]
["IRONSTL",null,null,"BROWN",1,null,null,"Deliveries to total industry of which to iron and steel industry","Brown coal","2021M07",{"$f":"VLOOKUP(I124, LanguageData, MATCH(LanguageChosen, Language[Language],0), FALSE)","v":"Brown coal"},{"$f":"VLOOKUP(H124, LanguageData, MATCH(LanguageChosen, Language[Language],0), FALSE)","v":"Deliveries to total industry of which to iron and steel industry"},null,10]
["OTHER",null,null,"BROWN",1,null,null,"Other deliveries (services, households, …)","Brown coal","2021M07",{"$f":"VLOOKUP(I125, LanguageData, MATCH(LanguageChosen, Language[Language],0), FALSE)","v":"Brown coal"},{"$f":"VLOOKUP(H125, LanguageData, MATCH(LanguageChosen, Language[Language],0), FALSE)","v":"Other deliveries (services, households, …)"},null,10]
["INDPROD",null,null,"PEAT",1,null,null,"Production ","Peat","2021M07",{"$f":"VLOOKUP(I126, LanguageData, MATCH(LanguageChosen, Language[Language],0), FALSE)","v":"Peat"},{"$f":"VLOOKUP(H126, LanguageData, MATCH(LanguageChosen, Language[Language],0), FALSE)","v":"Production "},null,10]
["OSOURCES",null,null,"PEAT",1,null,null,"Recovered products","Peat","2021M07",{"$f":"VLOOKUP(I127, LanguageData, MATCH(LanguageChosen, Language[Language],0), FALSE)","v":"Peat"},{"$f":"VLOOKUP(H127, LanguageData, MATCH(LanguageChosen, Language[Language],0), FALSE)","v":"Recovered products"},null,10]
["TOTIMPSB",null,null,"PEAT",1,null,null,"Total imports","Peat","2021M07",{"$f":"VLOOKUP(I128, LanguageData, MATCH(LanguageChosen, Language[Language],0), FALSE)","v":"Peat"},{"$f":"VLOOKUP(H128, LanguageData, MATCH(LanguageChosen, Language[Language],0), FALSE)","v":"Total imports"},null,10]
["TOTIMPSBEU",null,null,"PEAT",1,null,null,"Imports: of which from outside EU","Peat","2021M07",{"$f":"VLOOKUP(I129, LanguageData, MATCH(LanguageChosen, Language[Language],0), FALSE)","v":"Peat"},{"$f":"VLOOKUP(H129, LanguageData, MATCH(LanguageChosen, Language[Language],0), FALSE)","v":"Imports: of which from outside EU"},null,10]
["TOTEXPSB",null,null,"PEAT",1,null,null,"Total exports","Peat","2021M07",{"$f":"VLOOKUP(I130, LanguageData, MATCH(LanguageChosen, Language[Language],0), FALSE)","v":"Peat"},{"$f":"VLOOKUP(H130, LanguageData, MATCH(LanguageChosen, Language[Language],0), FALSE)","v":"Total exports"},null,10]
["STOCKSTART",null,null,"PEAT",1,null,null,"Stocks - beginning of period","Peat","2021M07",{"$f":"VLOOKUP(I131, LanguageData, MATCH(LanguageChosen, Language[Language],0), FALSE)","v":"Peat"},{"$f":"VLOOKUP(H131, LanguageData, MATCH(LanguageChosen, Language[Language],0), FALSE)","v":"Stocks - beginning of period"},null,10]
["STOCKEND",null,null,"PEAT",1,null,null,"Stocks - end of period","Peat","2021M07",{"$f":"VLOOKUP(I132, LanguageData, MATCH(LanguageChosen, Language[Language],0), FALSE)","v":"Peat"},{"$f":"VLOOKUP(H132, LanguageData, MATCH(LanguageChosen, Language[Language],0), FALSE)","v":"Stocks - end of period"},null,10]
["STCHANAT",null,null,"PEAT",1,null,null,"Stock changes","Peat","2021M07",{"$f":"VLOOKUP(I133, LanguageData, MATCH(LanguageChosen, Language[Language],0), FALSE)","v":"Peat"},{"$f":"VLOOKUP(H133, LanguageData, MATCH(LanguageChosen, Language[Language],0), FALSE)","v":"Stock changes"},null,10]
["INDCONC",null,null,"PEAT",1,null,null,"Calculated inland deliveries","Peat","2021M07",{"$f":"VLOOKUP(I134, LanguageData, MATCH(LanguageChosen, Language[Language],0), FALSE)","v":"Peat"},{"$f":"VLOOKUP(H134, LanguageData, MATCH(LanguageChosen, Language[Language],0), FALSE)","v":"Calculated inland deliveries"},null,10]
["STATDIFF",null,null,"PEAT",1,null,null,"Statistical differences","Peat","2021M07",{"$f":"VLOOKUP(I135, LanguageData, MATCH(LanguageChosen, Language[Language],0), FALSE)","v":"Peat"},{"$f":"VLOOKUP(H135, LanguageData, MATCH(LanguageChosen, Language[Language],0), FALSE)","v":"Statistical differences"},null,10]
["INTERNAD",null,null,"PEAT",1,null,null,"Internal market deliveries (observed)","Peat","2021M07",{"$f":"VLOOKUP(I136, LanguageData, MATCH(LanguageChosen, Language[Language],0), FALSE)","v":"Peat"},{"$f":"VLOOKUP(H136, LanguageData, MATCH(LanguageChosen, Language[Language],0), FALSE)","v":"Internal market deliveries (observed)"},null,10]
["MAINPROD",null,null,"PEAT",1,null,null,"Deliveries to main activity producers","Peat","2021M07",{"$f":"VLOOKUP(I137, LanguageData, MATCH(LanguageChosen, Language[Language],0), FALSE)","v":"Peat"},{"$f":"VLOOKUP(H137, LanguageData, MATCH(LanguageChosen, Language[Language],0), FALSE)","v":"Deliveries to main activity producers"},null,10]
["ECOKEOVS",null,null,"PEAT",1,null,null,"Deliveries to coking plants","Peat","2021M07",{"$f":"VLOOKUP(I138, LanguageData, MATCH(LanguageChosen, Language[Language],0), FALSE)","v":"Peat"},{"$f":"VLOOKUP(H138, LanguageData, MATCH(LanguageChosen, Language[Language],0), FALSE)","v":"Deliveries to coking plants"},null,10]
["TOTIND",null,null,"PEAT",1,null,null,"Deliveries to total industry","Peat","2021M07",{"$f":"VLOOKUP(I139, LanguageData, MATCH(LanguageChosen, Language[Language],0), FALSE)","v":"Peat"},{"$f":"VLOOKUP(H139, LanguageData, MATCH(LanguageChosen, Language[Language],0), FALSE)","v":"Deliveries to total industry"},null,10]
["IRONSTL",null,null,"PEAT",1,null,null,"Deliveries to total industry of which to iron and steel industry","Peat","2021M07",{"$f":"VLOOKUP(I140, LanguageData, MATCH(LanguageChosen, Language[Language],0), FALSE)","v":"Peat"},{"$f":"VLOOKUP(H140, LanguageData, MATCH(LanguageChosen, Language[Language],0), FALSE)","v":"Deliveries to total industry of which to iron and steel industry"},null,10]
["OTHER",null,null,"PEAT",1,null,null,"Other deliveries (services, households, …)","Peat","2021M07",{"$f":"VLOOKUP(I141, LanguageData, MATCH(LanguageChosen, Language[Language],0), FALSE)","v":"Peat"},{"$f":"VLOOKUP(H141, LanguageData, MATCH(LanguageChosen, Language[Language],0), FALSE)","v":"Other deliveries (services, households, …)"},null,10]
["INDPROD",null,null,"OILSHALE",1,null,null,"Production ","Oil shale and oil sands","2021M07",{"$f":"VLOOKUP(I142, LanguageData, MATCH(LanguageChosen, Language[Language],0), FALSE)","v":"Oil shale and oil sands"},{"$f":"VLOOKUP(H142, LanguageData, MATCH(LanguageChosen, Language[Language],0), FALSE)","v":"Production "},null,10]
["OSOURCES",null,null,"OILSHALE",1,null,null,"Recovered products","Oil shale and oil sands",{"$f":"YEAR(DATE(LEFT($B$1,4),RIGHT($B$1,2)-N143,1)) & \"M\" & TEXT(MONTH(DATE(LEFT($B$1,4),RIGHT($B$1,2)-N143,1)),\"00\")","v":"2021M07"},{"$f":"VLOOKUP(I143, LanguageData, MATCH(LanguageChosen, Language[Language],0), FALSE)","v":"Oil shale and oil sands"},{"$f":"VLOOKUP(H143, LanguageData, MATCH(LanguageChosen, Language[Language],0), FALSE)","v":"Recovered products"},null,10]
["TOTIMPSB",null,null,"OILSHALE",1,null,null,"Total imports","Oil shale and oil sands","2021M07",{"$f":"VLOOKUP(I144, LanguageData, MATCH(LanguageChosen, Language[Language],0), FALSE)","v":"Oil shale and oil sands"},{"$f":"VLOOKUP(H144, LanguageData, MATCH(LanguageChosen, Language[Language],0), FALSE)","v":"Total imports"},null,10]
["TOTIMPSBEU",null,null,"OILSHALE",1,null,null,"Imports: of which from outside EU","Oil shale and oil sands","2021M07",{"$f":"VLOOKUP(I145, LanguageData, MATCH(LanguageChosen, Language[Language],0), FALSE)","v":"Oil shale and oil sands"},{"$f":"VLOOKUP(H145, LanguageData, MATCH(LanguageChosen, Language[Language],0), FALSE)","v":"Imports: of which from outside EU"},null,10]
["TOTEXPSB",null,null,"OILSHALE",1,null,null,"Total exports","Oil shale and oil sands","2021M07",{"$f":"VLOOKUP(I146, LanguageData, MATCH(LanguageChosen, Language[Language],0), FALSE)","v":"Oil shale and oil sands"},{"$f":"VLOOKUP(H146, LanguageData, MATCH(LanguageChosen, Language[Language],0), FALSE)","v":"Total exports"},null,10]
["STOCKSTART",null,null,"OILSHALE",1,null,null,"Stocks - beginning of period","Oil shale and oil sands","2021M07",{"$f":"VLOOKUP(I147, LanguageData, MATCH(LanguageChosen, Language[Language],0), FALSE)","v":"Oil shale and oil sands"},{"$f":"VLOOKUP(H147, LanguageData, MATCH(LanguageChosen, Language[Language],0), FALSE)","v":"Stocks - beginning of period"},null,10]
["STOCKEND",null,null,"OILSHALE",1,null,null,"Stocks - end of period","Oil shale and oil sands","2021M07",{"$f":"VLOOKUP(I148, LanguageData, MATCH(LanguageChosen, Language[Language],0), FALSE)","v":"Oil shale and oil sands"},{"$f":"VLOOKUP(H148, LanguageData, MATCH(LanguageChosen, Language[Language],0), FALSE)","v":"Stocks - end of period"},null,10]
["STCHANAT",null,null,"OILSHALE",1,null,null,"Stock changes","Oil shale and oil sands","2021M07",{"$f":"VLOOKUP(I149, LanguageData, MATCH(LanguageChosen, Language[Language],0), FALSE)","v":"Oil shale and oil sands"},{"$f":"VLOOKUP(H149, LanguageData, MATCH(LanguageChosen, Language[Language],0), FALSE)","v":"Stock changes"},null,10]
["INDCONC",null,null,"OILSHALE",1,null,null,"Calculated inland deliveries","Oil shale and oil sands","2021M07",{"$f":"VLOOKUP(I150, LanguageData, MATCH(LanguageChosen, Language[Language],0), FALSE)","v":"Oil shale and oil sands"},{"$f":"VLOOKUP(H150, LanguageData, MATCH(LanguageChosen, Language[Language],0), FALSE)","v":"Calculated inland deliveries"},null,10]
["STATDIFF",null,null,"OILSHALE",1,null,null,"Statistical differences","Oil shale and oil sands","2021M07",{"$f":"VLOOKUP(I151, LanguageData, MATCH(LanguageChosen, Language[Language],0), FALSE)","v":"Oil shale and oil sands"},{"$f":"VLOOKUP(H151, LanguageData, MATCH(LanguageChosen, Language[Language],0), FALSE)","v":"Statistical differences"},null,10]
["INTERNAD",null,null,"OILSHALE",1,null,null,"Internal market deliveries (observed)","Oil shale and oil sands","2021M07",{"$f":"VLOOKUP(I152, LanguageData, MATCH(LanguageChosen, Language[Language],0), FALSE)","v":"Oil shale and oil sands"},{"$f":"VLOOKUP(H152, LanguageData, MATCH(LanguageChosen, Language[Language],0), FALSE)","v":"Internal market deliveries (observed)"},null,10]
["MAINPROD",null,null,"OILSHALE",1,null,null,"Deliveries to main activity producers","Oil shale and oil sands","2021M07",{"$f":"VLOOKUP(I153, LanguageData, MATCH(LanguageChosen, Language[Language],0), FALSE)","v":"Oil shale and oil sands"},{"$f":"VLOOKUP(H153, LanguageData, MATCH(LanguageChosen, Language[Language],0), FALSE)","v":"Deliveries to main activity producers"},null,10]
["ECOKEOVS",null,null,"OILSHALE",1,null,null,"Deliveries to coking plants","Oil shale and oil sands","2021M07",{"$f":"VLOOKUP(I154, LanguageData, MATCH(LanguageChosen, Language[Language],0), FALSE)","v":"Oil shale and oil sands"},{"$f":"VLOOKUP(H154, LanguageData, MATCH(LanguageChosen, Language[Language],0), FALSE)","v":"Deliveries to coking plants"},null,10]
["TOTIND",null,null,"OILSHALE",1,null,null,"Deliveries to total industry","Oil shale and oil sands","2021M07",{"$f":"VLOOKUP(I155, LanguageData, MATCH(LanguageChosen, Language[Language],0), FALSE)","v":"Oil shale and oil sands"},{"$f":"VLOOKUP(H155, LanguageData, MATCH(LanguageChosen, Language[Language],0), FALSE)","v":"Deliveries to total industry"},null,10]
["IRONSTL",null,null,"OILSHALE",1,null,null,"Deliveries to total industry of which to iron and steel industry","Oil shale and oil sands","2021M07",{"$f":"VLOOKUP(I156, LanguageData, MATCH(LanguageChosen, Language[Language],0), FALSE)","v":"Oil shale and oil sands"},{"$f":"VLOOKUP(H156, LanguageData, MATCH(LanguageChosen, Language[Language],0), FALSE)","v":"Deliveries to total industry of which to iron and steel industry"},null,10]
["OTHER",null,null,"OILSHALE",1,null,null,"Other deliveries (services, households, …)","Oil shale and oil sands","2021M07",{"$f":"VLOOKUP(I157, LanguageData, MATCH(LanguageChosen, Language[Language],0), FALSE)","v":"Oil shale and oil sands"},{"$f":"VLOOKUP(H157, LanguageData, MATCH(LanguageChosen, Language[Language],0), FALSE)","v":"Other deliveries (services, households, …)"},null,10]
["INDPROD",null,null,"COKEOVEN",1,null,null,"Production ","Coke oven coke","2021M07",{"$f":"VLOOKUP(I158, LanguageData, MATCH(LanguageChosen, Language[Language],0), FALSE)","v":"Coke oven coke"},{"$f":"VLOOKUP(H158, LanguageData, MATCH(LanguageChosen, Language[Language],0), FALSE)","v":"Production "},null,10]
["OSOURCES",null,null,"COKEOVEN",1,null,null,"Recovered products","Coke oven coke","2021M07",{"$f":"VLOOKUP(I159, LanguageData, MATCH(LanguageChosen, Language[Language],0), FALSE)","v":"Coke oven coke"},{"$f":"VLOOKUP(H159, LanguageData, MATCH(LanguageChosen, Language[Language],0), FALSE)","v":"Recovered products"},null,10]
["TOTIMPSB",null,null,"COKEOVEN",1,null,null,"Total imports","Coke oven coke","2021M07",{"$f":"VLOOKUP(I160, LanguageData, MATCH(LanguageChosen, Language[Language],0), FALSE)","v":"Coke oven coke"},{"$f":"VLOOKUP(H160, LanguageData, MATCH(LanguageChosen, Language[Language],0), FALSE)","v":"Total imports"},null,10]
["TOTIMPSBEU",null,null,"COKEOVEN",1,null,null,"Imports: of which from outside EU","Coke oven coke","2021M07",{"$f":"VLOOKUP(I161, LanguageData, MATCH(LanguageChosen, Language[Language],0), FALSE)","v":"Coke oven coke"},{"$f":"VLOOKUP(H161, LanguageData, MATCH(LanguageChosen, Language[Language],0), FALSE)","v":"Imports: of which from outside EU"},null,10]
["TOTEXPSB",null,null,"COKEOVEN",1,null,null,"Total exports","Coke oven coke","2021M07",{"$f":"VLOOKUP(I162, LanguageData, MATCH(LanguageChosen, Language[Language],0), FALSE)","v":"Coke oven coke"},{"$f":"VLOOKUP(H162, LanguageData, MATCH(LanguageChosen, Language[Language],0), FALSE)","v":"Total exports"},null,10]
["STOCKSTART",null,null,"COKEOVEN",1,null,null,"Stocks - beginning of period","Coke oven coke","2021M07",{"$f":"VLOOKUP(I163, LanguageData, MATCH(LanguageChosen, Language[Language],0), FALSE)","v":"Coke oven coke"},{"$f":"VLOOKUP(H163, LanguageData, MATCH(LanguageChosen, Language[Language],0), FALSE)","v":"Stocks - beginning of period"},null,10]
["STOCKEND",null,null,"COKEOVEN",1,null,null,"Stocks - end of period","Coke oven coke","2021M07",{"$f":"VLOOKUP(I164, LanguageData, MATCH(LanguageChosen, Language[Language],0), FALSE)","v":"Coke oven coke"},{"$f":"VLOOKUP(H164, LanguageData, MATCH(LanguageChosen, Language[Language],0), FALSE)","v":"Stocks - end of period"},null,10]
["STCHANAT",null,null,"COKEOVEN",1,null,null,"Stock changes","Coke oven coke","2021M07",{"$f":"VLOOKUP(I165, LanguageData, MATCH(LanguageChosen, Language[Language],0), FALSE)","v":"Coke oven coke"},{"$f":"VLOOKUP(H165, LanguageData, MATCH(LanguageChosen, Language[Language],0), FALSE)","v":"Stock changes"},null,10]
["INDCONC",null,null,"COKEOVEN",1,null,null,"Calculated inland deliveries","Coke oven coke","2021M07",{"$f":"VLOOKUP(I166, LanguageData, MATCH(LanguageChosen, Language[Language],0), FALSE)","v":"Coke oven coke"},{"$f":"VLOOKUP(H166, LanguageData, MATCH(LanguageChosen, Language[Language],0), FALSE)","v":"Calculated inland deliveries"},null,10]
["STATDIFF",null,null,"COKEOVEN",1,null,null,"Statistical differences","Coke oven coke","2021M07",{"$f":"VLOOKUP(I167, LanguageData, MATCH(LanguageChosen, Language[Language],0), FALSE)","v":"Coke oven coke"},{"$f":"VLOOKUP(H167, LanguageData, MATCH(LanguageChosen, Language[Language],0), FALSE)","v":"Statistical differences"},null,10]
["INTERNAD",null,null,"COKEOVEN",1,null,null,"Internal market deliveries (observed)","Coke oven coke","2021M07",{"$f":"VLOOKUP(I168, LanguageData, MATCH(LanguageChosen, Language[Language],0), FALSE)","v":"Coke oven coke"},{"$f":"VLOOKUP(H168, LanguageData, MATCH(LanguageChosen, Language[Language],0), FALSE)","v":"Internal market deliveries (observed)"},null,10]
["MAINPROD",null,null,"COKEOVEN",1,null,null,"Deliveries to main activity producers","Coke oven coke","2021M07",{"$f":"VLOOKUP(I169, LanguageData, MATCH(LanguageChosen, Language[Language],0), FALSE)","v":"Coke oven coke"},{"$f":"VLOOKUP(H169, LanguageData, MATCH(LanguageChosen, Language[Language],0), FALSE)","v":"Deliveries to main activity producers"},null,10]
["ECOKEOVS",null,null,"COKEOVEN",1,null,null,"Deliveries to coking plants","Coke oven coke","2021M07",{"$f":"VLOOKUP(I170, LanguageData, MATCH(LanguageChosen, Language[Language],0), FALSE)","v":"Coke oven coke"},{"$f":"VLOOKUP(H170, LanguageData, MATCH(LanguageChosen, Language[Language],0), FALSE)","v":"Deliveries to coking plants"},null,10]
["TOTIND",null,null,"COKEOVEN",1,null,null,"Deliveries to total industry","Coke oven coke","2021M07",{"$f":"VLOOKUP(I171, LanguageData, MATCH(LanguageChosen, Language[Language],0), FALSE)","v":"Coke oven coke"},{"$f":"VLOOKUP(H171, LanguageData, MATCH(LanguageChosen, Language[Language],0), FALSE)","v":"Deliveries to total industry"},null,10]
["IRONSTL",null,null,"COKEOVEN",1,null,null,"Deliveries to total industry of which to iron and steel industry","Coke oven coke","2021M07",{"$f":"VLOOKUP(I172, LanguageData, MATCH(LanguageChosen, Language[Language],0), FALSE)","v":"Coke oven coke"},{"$f":"VLOOKUP(H172, LanguageData, MATCH(LanguageChosen, Language[Language],0), FALSE)","v":"Deliveries to total industry of which to iron and steel industry"},null,10]
["OTHER",null,null,"COKEOVEN",1,null,null,"Other deliveries (services, households, …)","Coke oven coke","2021M07",{"$f":"VLOOKUP(I173, LanguageData, MATCH(LanguageChosen, Language[Language],0), FALSE)","v":"Coke oven coke"},{"$f":"VLOOKUP(H173, LanguageData, MATCH(LanguageChosen, Language[Language],0), FALSE)","v":"Other deliveries (services, households, …)"},null,10]
["INDPROD",null,null,"HARDCOAL",1,null,null,"Production ","Hard coal","2021M08",{"$f":"VLOOKUP(I174, LanguageData, MATCH(LanguageChosen, Language[Language],0), FALSE)","v":"Hard coal"},{"$f":"VLOOKUP(H174, LanguageData, MATCH(LanguageChosen, Language[Language],0), FALSE)","v":"Production "},null,9]
["OSOURCES",null,null,"HARDCOAL",1,null,null,"Recovered products","Hard coal","2021M08",{"$f":"VLOOKUP(I175, LanguageData, MATCH(LanguageChosen, Language[Language],0), FALSE)","v":"Hard coal"},{"$f":"VLOOKUP(H175, LanguageData, MATCH(LanguageChosen, Language[Language],0), FALSE)","v":"Recovered products"},null,9]
["TOTIMPSB",null,null,"HARDCOAL",1,null,null,"Total imports","Hard coal","2021M08",{"$f":"VLOOKUP(I176, LanguageData, MATCH(LanguageChosen, Language[Language],0), FALSE)","v":"Hard coal"},{"$f":"VLOOKUP(H176, LanguageData, MATCH(LanguageChosen, Language[Language],0), FALSE)","v":"Total imports"},null,9]
["TOTIMPSBEU",null,null,"HARDCOAL",1,null,null,"Imports: of which from outside EU","Hard coal","2021M08",{"$f":"VLOOKUP(I177, LanguageData, MATCH(LanguageChosen, Language[Language],0), FALSE)","v":"Hard coal"},{"$f":"VLOOKUP(H177, LanguageData, MATCH(LanguageChosen, Language[Language],0), FALSE)","v":"Imports: of which from outside EU"},null,9]
["TOTEXPSB",null,null,"HARDCOAL",1,null,null,"Total exports","Hard coal","2021M08",{"$f":"VLOOKUP(I178, LanguageData, MATCH(LanguageChosen, Language[Language],0), FALSE)","v":"Hard coal"},{"$f":"VLOOKUP(H178, LanguageData, MATCH(LanguageChosen, Language[Language],0), FALSE)","v":"Total exports"},null,9]
["STOCKSTART",null,null,"HARDCOAL",1,null,null,"Stocks - beginning of period","Hard coal","2021M08",{"$f":"VLOOKUP(I179, LanguageData, MATCH(LanguageChosen, Language[Language],0), FALSE)","v":"Hard coal"},{"$f":"VLOOKUP(H179, LanguageData, MATCH(LanguageChosen, Language[Language],0), FALSE)","v":"Stocks - beginning of period"},null,9]
["STOCKEND",null,null,"HARDCOAL",1,null,null,"Stocks - end of period","Hard coal","2021M08",{"$f":"VLOOKUP(I180, LanguageData, MATCH(LanguageChosen, Language[Language],0), FALSE)","v":"Hard coal"},{"$f":"VLOOKUP(H180, LanguageData, MATCH(LanguageChosen, Language[Language],0), FALSE)","v":"Stocks - end of period"},null,9]
["STCHANAT",null,null,"HARDCOAL",1,null,null,"Stock changes","Hard coal","2021M08",{"$f":"VLOOKUP(I181, LanguageData, MATCH(LanguageChosen, Language[Language],0), FALSE)","v":"Hard coal"},{"$f":"VLOOKUP(H181, LanguageData, MATCH(LanguageChosen, Language[Language],0), FALSE)","v":"Stock changes"},null,9]
["INDCONC",null,null,"HARDCOAL",1,null,null,"Calculated inland deliveries","Hard coal","2021M08",{"$f":"VLOOKUP(I182, LanguageData, MATCH(LanguageChosen, Language[Language],0), FALSE)","v":"Hard coal"},{"$f":"VLOOKUP(H182, LanguageData, MATCH(LanguageChosen, Language[Language],0), FALSE)","v":"Calculated inland deliveries"},null,9]
["STATDIFF",null,null,"HARDCOAL",1,null,null,"Statistical differences","Hard coal","2021M08",{"$f":"VLOOKUP(I183, LanguageData, MATCH(LanguageChosen, Language[Language],0), FALSE)","v":"Hard coal"},{"$f":"VLOOKUP(H183, LanguageData, MATCH(LanguageChosen, Language[Language],0), FALSE)","v":"Statistical differences"},null,9]
["INTERNAD",null,null,"HARDCOAL",1,null,null,"Internal market deliveries (observed)","Hard coal","2021M08",{"$f":"VLOOKUP(I184, LanguageData, MATCH(LanguageChosen, Language[Language],0), FALSE)","v":"Hard coal"},{"$f":"VLOOKUP(H184, LanguageData, MATCH(LanguageChosen, Language[Language],0), FALSE)","v":"Internal market deliveries (observed)"},null,9]
["MAINPROD",null,null,"HARDCOAL",1,null,null,"Deliveries to main activity producers","Hard coal","2021M08",{"$f":"VLOOKUP(I185, LanguageData, MATCH(LanguageChosen, Language[Language],0), FALSE)","v":"Hard coal"},{"$f":"VLOOKUP(H185, LanguageData, MATCH(LanguageChosen, Language[Language],0), FALSE)","v":"Deliveries to main activity producers"},null,9]
["ECOKEOVS",null,null,"HARDCOAL",1,null,null,"Deliveries to coking plants","Hard coal","2021M08",{"$f":"VLOOKUP(I186, LanguageData, MATCH(LanguageChosen, Language[Language],0), FALSE)","v":"Hard coal"},{"$f":"VLOOKUP(H186, LanguageData, MATCH(LanguageChosen, Language[Language],0), FALSE)","v":"Deliveries to coking plants"},null,9]
["TOTIND",null,null,"HARDCOAL",1,null,null,"Deliveries to total industry","Hard coal","2021M08",{"$f":"VLOOKUP(I187, LanguageData, MATCH(LanguageChosen, Language[Language],0), FALSE)","v":"Hard coal"},{"$f":"VLOOKUP(H187, LanguageData, MATCH(LanguageChosen, Language[Language],0), FALSE)","v":"Deliveries to total industry"},null,9]
["IRONSTL",null,null,"HARDCOAL",1,null,null,"Deliveries to total industry of which to iron and steel industry","Hard coal","2021M08",{"$f":"VLOOKUP(I188, LanguageData, MATCH(LanguageChosen, Language[Language],0), FALSE)","v":"Hard coal"},{"$f":"VLOOKUP(H188, LanguageData, MATCH(LanguageChosen, Language[Language],0), FALSE)","v":"Deliveries to total industry of which to iron and steel industry"},null,9]
["OTHER",null,null,"HARDCOAL",1,null,null,"Other deliveries (services, households, …)","Hard coal","2021M08",{"$f":"VLOOKUP(I189, LanguageData, MATCH(LanguageChosen, Language[Language],0), FALSE)","v":"Hard coal"},{"$f":"VLOOKUP(H189, LanguageData, MATCH(LanguageChosen, Language[Language],0), FALSE)","v":"Other deliveries (services, households, …)"},null,9]
["INDPROD",null,null,"BROWN",1,null,null,"Production ","Brown coal","2021M08",{"$f":"VLOOKUP(I190, LanguageData, MATCH(LanguageChosen, Language[Language],0), FALSE)","v":"Brown coal"},{"$f":"VLOOKUP(H190, LanguageData, MATCH(LanguageChosen, Language[Language],0), FALSE)","v":"Production "},null,9]
["OSOURCES",null,null,"BROWN",1,null,null,"Recovered products","Brown coal","2021M08",{"$f":"VLOOKUP(I191, LanguageData, MATCH(LanguageChosen, Language[Language],0), FALSE)","v":"Brown coal"},{"$f":"VLOOKUP(H191, LanguageData, MATCH(LanguageChosen, Language[Language],0), FALSE)","v":"Recovered products"},null,9]
["TOTIMPSB",null,null,"BROWN",1,null,null,"Total imports","Brown coal","2021M08",{"$f":"VLOOKUP(I192, LanguageData, MATCH(LanguageChosen, Language[Language],0), FALSE)","v":"Brown coal"},{"$f":"VLOOKUP(H192, LanguageData, MATCH(LanguageChosen, Language[Language],0), FALSE)","v":"Total imports"},null,9]
["TOTIMPSBEU",null,null,"BROWN",1,null,null,"Imports: of which from outside EU","Brown coal","2021M08",{"$f":"VLOOKUP(I193, LanguageData, MATCH(LanguageChosen, Language[Language],0), FALSE)","v":"Brown coal"},{"$f":"VLOOKUP(H193, LanguageData, MATCH(LanguageChosen, Language[Language],0), FALSE)","v":"Imports: of which from outside EU"},null,9]
["TOTEXPSB",null,null,"BROWN",1,null,null,"Total exports","Brown coal","2021M08",{"$f":"VLOOKUP(I194, LanguageData, MATCH(LanguageChosen, Language[Language],0), FALSE)","v":"Brown coal"},{"$f":"VLOOKUP(H194, LanguageData, MATCH(LanguageChosen, Language[Language],0), FALSE)","v":"Total exports"},null,9]
["STOCKSTART",null,null,"BROWN",1,null,null,"Stocks - beginning of period","Brown coal","2021M08",{"$f":"VLOOKUP(I195, LanguageData, MATCH(LanguageChosen, Language[Language],0), FALSE)","v":"Brown coal"},{"$f":"VLOOKUP(H195, LanguageData, MATCH(LanguageChosen, Language[Language],0), FALSE)","v":"Stocks - beginning of period"},null,9]
["STOCKEND",null,null,"BROWN",1,null,null,"Stocks - end of period","Brown coal","2021M08",{"$f":"VLOOKUP(I196, LanguageData, MATCH(LanguageChosen, Language[Language],0), FALSE)","v":"Brown coal"},{"$f":"VLOOKUP(H196, LanguageData, MATCH(LanguageChosen, Language[Language],0), FALSE)","v":"Stocks - end of period"},null,9]
["STCHANAT",null,null,"BROWN",1,null,null,"Stock changes","Brown coal","2021M08",{"$f":"VLOOKUP(I197, LanguageData, MATCH(LanguageChosen, Language[Language],0), FALSE)","v":"Brown coal"},{"$f":"VLOOKUP(H197, LanguageData, MATCH(LanguageChosen, Language[Language],0), FALSE)","v":"Stock changes"},null,9]
["INDCONC",null,null,"BROWN",1,null,null,"Calculated inland deliveries","Brown coal","2021M08",{"$f":"VLOOKUP(I198, LanguageData, MATCH(LanguageChosen, Language[Language],0), FALSE)","v":"Brown coal"},{"$f":"VLOOKUP(H198, LanguageData, MATCH(LanguageChosen, Language[Language],0), FALSE)","v":"Calculated inland deliveries"},null,9]
["STATDIFF",null,null,"BROWN",1,null,null,"Statistical differences","Brown coal","2021M08",{"$f":"VLOOKUP(I199, LanguageData, MATCH(LanguageChosen, Language[Language],0), FALSE)","v":"Brown coal"},{"$f":"VLOOKUP(H199, LanguageData, MATCH(LanguageChosen, Language[Language],0), FALSE)","v":"Statistical differences"},null,9]
["INTERNAD",null,null,"BROWN",1,null,null,"Internal market deliveries (observed)","Brown coal","2021M08",{"$f":"VLOOKUP(I200, LanguageData, MATCH(LanguageChosen, Language[Language],0), FALSE)","v":"Brown coal"},{"$f":"VLOOKUP(H200, LanguageData, MATCH(LanguageChosen, Language[Language],0), FALSE)","v":"Internal market deliveries (observed)"},null,9]
["MAINPROD",null,null,"BROWN",1,null,null,"Deliveries to main activity producers","Brown coal","2021M08",{"$f":"VLOOKUP(I201, LanguageData, MATCH(LanguageChosen, Language[Language],0), FALSE)","v":"Brown coal"},{"$f":"VLOOKUP(H201, LanguageData, MATCH(LanguageChosen, Language[Language],0), FALSE)","v":"Deliveries to main activity producers"},null,9]
["ECOKEOVS",null,null,"BROWN",1,null,null,"Deliveries to coking plants","Brown coal","2021M08",{"$f":"VLOOKUP(I202, LanguageData, MATCH(LanguageChosen, Language[Language],0), FALSE)","v":"Brown coal"},{"$f":"VLOOKUP(H202, LanguageData, MATCH(LanguageChosen, Language[Language],0), FALSE)","v":"Deliveries to coking plants"},null,9]
["TOTIND",null,null,"BROWN",1,null,null,"Deliveries to total industry","Brown coal","2021M08",{"$f":"VLOOKUP(I203, LanguageData, MATCH(LanguageChosen, Language[Language],0), FALSE)","v":"Brown coal"},{"$f":"VLOOKUP(H203, LanguageData, MATCH(LanguageChosen, Language[Language],0), FALSE)","v":"Deliveries to total industry"},null,9]
["IRONSTL",null,null,"BROWN",1,null,null,"Deliveries to total industry of which to iron and steel industry","Brown coal","2021M08",{"$f":"VLOOKUP(I204, LanguageData, MATCH(LanguageChosen, Language[Language],0), FALSE)","v":"Brown coal"},{"$f":"VLOOKUP(H204, LanguageData, MATCH(LanguageChosen, Language[Language],0), FALSE)","v":"Deliveries to total industry of which to iron and steel industry"},null,9]
["OTHER",null,null,"BROWN",1,null,null,"Other deliveries (services, households, …)","Brown coal","2021M08",{"$f":"VLOOKUP(I205, LanguageData, MATCH(LanguageChosen, Language[Language],0), FALSE)","v":"Brown coal"},{"$f":"VLOOKUP(H205, LanguageData, MATCH(LanguageChosen, Language[Language],0), FALSE)","v":"Other deliveries (services, households, …)"},null,9]
["INDPROD",null,null,"PEAT",1,null,null,"Production ","Peat","2021M08",{"$f":"VLOOKUP(I206, LanguageData, MATCH(LanguageChosen, Language[Language],0), FALSE)","v":"Peat"},{"$f":"VLOOKUP(H206, LanguageData, MATCH(LanguageChosen, Language[Language],0), FALSE)","v":"Production "},null,9]
["OSOURCES",null,null,"PEAT",1,null,null,"Recovered products","Peat",{"$f":"YEAR(DATE(LEFT($B$1,4),RIGHT($B$1,2)-N207,1)) & \"M\" & TEXT(MONTH(DATE(LEFT($B$1,4),RIGHT($B$1,2)-N207,1)),\"00\")","v":"2021M08"},{"$f":"VLOOKUP(I207, LanguageData, MATCH(LanguageChosen, Language[Language],0), FALSE)","v":"Peat"},{"$f":"VLOOKUP(H207, LanguageData, MATCH(LanguageChosen, Language[Language],0), FALSE)","v":"Recovered products"},null,9]
["TOTIMPSB",null,null,"PEAT",1,null,null,"Total imports","Peat","2021M08",{"$f":"VLOOKUP(I208, LanguageData, MATCH(LanguageChosen, Language[Language],0), FALSE)","v":"Peat"},{"$f":"VLOOKUP(H208, LanguageData, MATCH(LanguageChosen, Language[Language],0), FALSE)","v":"Total imports"},null,9]
["TOTIMPSBEU",null,null,"PEAT",1,null,null,"Imports: of which from outside EU","Peat","2021M08",{"$f":"VLOOKUP(I209, LanguageData, MATCH(LanguageChosen, Language[Language],0), FALSE)","v":"Peat"},{"$f":"VLOOKUP(H209, LanguageData, MATCH(LanguageChosen, Language[Language],0), FALSE)","v":"Imports: of which from outside EU"},null,9]
["TOTEXPSB",null,null,"PEAT",1,null,null,"Total exports","Peat","2021M08",{"$f":"VLOOKUP(I210, LanguageData, MATCH(LanguageChosen, Language[Language],0), FALSE)","v":"Peat"},{"$f":"VLOOKUP(H210, LanguageData, MATCH(LanguageChosen, Language[Language],0), FALSE)","v":"Total exports"},null,9]
["STOCKSTART",null,null,"PEAT",1,null,null,"Stocks - beginning of period","Peat","2021M08",{"$f":"VLOOKUP(I211, LanguageData, MATCH(LanguageChosen, Language[Language],0), FALSE)","v":"Peat"},{"$f":"VLOOKUP(H211, LanguageData, MATCH(LanguageChosen, Language[Language],0), FALSE)","v":"Stocks - beginning of period"},null,9]
["STOCKEND",null,null,"PEAT",1,null,null,"Stocks - end of period","Peat","2021M08",{"$f":"VLOOKUP(I212, LanguageData, MATCH(LanguageChosen, Language[Language],0), FALSE)","v":"Peat"},{"$f":"VLOOKUP(H212, LanguageData, MATCH(LanguageChosen, Language[Language],0), FALSE)","v":"Stocks - end of period"},null,9]
["STCHANAT",null,null,"PEAT",1,null,null,"Stock changes","Peat","2021M08",{"$f":"VLOOKUP(I213, LanguageData, MATCH(LanguageChosen, Language[Language],0), FALSE)","v":"Peat"},{"$f":"VLOOKUP(H213, LanguageData, MATCH(LanguageChosen, Language[Language],0), FALSE)","v":"Stock changes"},null,9]
["INDCONC",null,null,"PEAT",1,null,null,"Calculated inland deliveries","Peat","2021M08",{"$f":"VLOOKUP(I214, LanguageData, MATCH(LanguageChosen, Language[Language],0), FALSE)","v":"Peat"},{"$f":"VLOOKUP(H214, LanguageData, MATCH(LanguageChosen, Language[Language],0), FALSE)","v":"Calculated inland deliveries"},null,9]
["STATDIFF",null,null,"PEAT",1,null,null,"Statistical differences","Peat","2021M08",{"$f":"VLOOKUP(I215, LanguageData, MATCH(LanguageChosen, Language[Language],0), FALSE)","v":"Peat"},{"$f":"VLOOKUP(H215, LanguageData, MATCH(LanguageChosen, Language[Language],0), FALSE)","v":"Statistical differences"},null,9]
["INTERNAD",null,null,"PEAT",1,null,null,"Internal market deliveries (observed)","Peat","2021M08",{"$f":"VLOOKUP(I216, LanguageData, MATCH(LanguageChosen, Language[Language],0), FALSE)","v":"Peat"},{"$f":"VLOOKUP(H216, LanguageData, MATCH(LanguageChosen, Language[Language],0), FALSE)","v":"Internal market deliveries (observed)"},null,9]
["MAINPROD",null,null,"PEAT",1,null,null,"Deliveries to main activity producers","Peat","2021M08",{"$f":"VLOOKUP(I217, LanguageData, MATCH(LanguageChosen, Language[Language],0), FALSE)","v":"Peat"},{"$f":"VLOOKUP(H217, LanguageData, MATCH(LanguageChosen, Language[Language],0), FALSE)","v":"Deliveries to main activity producers"},null,9]
["ECOKEOVS",null,null,"PEAT",1,null,null,"Deliveries to coking plants","Peat","2021M08",{"$f":"VLOOKUP(I218, LanguageData, MATCH(LanguageChosen, Language[Language],0), FALSE)","v":"Peat"},{"$f":"VLOOKUP(H218, LanguageData, MATCH(LanguageChosen, Language[Language],0), FALSE)","v":"Deliveries to coking plants"},null,9]
["TOTIND",null,null,"PEAT",1,null,null,"Deliveries to total industry","Peat","2021M08",{"$f":"VLOOKUP(I219, LanguageData, MATCH(LanguageChosen, Language[Language],0), FALSE)","v":"Peat"},{"$f":"VLOOKUP(H219, LanguageData, MATCH(LanguageChosen, Language[Language],0), FALSE)","v":"Deliveries to total industry"},null,9]
["IRONSTL",null,null,"PEAT",1,null,null,"Deliveries to total industry of which to iron and steel industry","Peat","2021M08",{"$f":"VLOOKUP(I220, LanguageData, MATCH(LanguageChosen, Language[Language],0), FALSE)","v":"Peat"},{"$f":"VLOOKUP(H220, LanguageData, MATCH(LanguageChosen, Language[Language],0), FALSE)","v":"Deliveries to total industry of which to iron and steel industry"},null,9]
["OTHER",null,null,"PEAT",1,null,null,"Other deliveries (services, households, …)","Peat","2021M08",{"$f":"VLOOKUP(I221, LanguageData, MATCH(LanguageChosen, Language[Language],0), FALSE)","v":"Peat"},{"$f":"VLOOKUP(H221, LanguageData, MATCH(LanguageChosen, Language[Language],0), FALSE)","v":"Other deliveries (services, households, …)"},null,9]
["INDPROD",null,null,"OILSHALE",1,null,null,"Production ","Oil shale and oil sands","2021M08",{"$f":"VLOOKUP(I222, LanguageData, MATCH(LanguageChosen, Language[Language],0), FALSE)","v":"Oil shale and oil sands"},{"$f":"VLOOKUP(H222, LanguageData, MATCH(LanguageChosen, Language[Language],0), FALSE)","v":"Production "},null,9]
["OSOURCES",null,null,"OILSHALE",1,null,null,"Recovered products","Oil shale and oil sands","2021M08",{"$f":"VLOOKUP(I223, LanguageData, MATCH(LanguageChosen, Language[Language],0), FALSE)","v":"Oil shale and oil sands"},{"$f":"VLOOKUP(H223, LanguageData, MATCH(LanguageChosen, Language[Language],0), FALSE)","v":"Recovered products"},null,9]
["TOTIMPSB",null,null,"OILSHALE",1,null,null,"Total imports","Oil shale and oil sands","2021M08",{"$f":"VLOOKUP(I224, LanguageData, MATCH(LanguageChosen, Language[Language],0), FALSE)","v":"Oil shale and oil sands"},{"$f":"VLOOKUP(H224, LanguageData, MATCH(LanguageChosen, Language[Language],0), FALSE)","v":"Total imports"},null,9]
["TOTIMPSBEU",null,null,"OILSHALE",1,null,null,"Imports: of which from outside EU","Oil shale and oil sands","2021M08",{"$f":"VLOOKUP(I225, LanguageData, MATCH(LanguageChosen, Language[Language],0), FALSE)","v":"Oil shale and oil sands"},{"$f":"VLOOKUP(H225, LanguageData, MATCH(LanguageChosen, Language[Language],0), FALSE)","v":"Imports: of which from outside EU"},null,9]
["TOTEXPSB",null,null,"OILSHALE",1,null,null,"Total exports","Oil shale and oil sands","2021M08",{"$f":"VLOOKUP(I226, LanguageData, MATCH(LanguageChosen, Language[Language],0), FALSE)","v":"Oil shale and oil sands"},{"$f":"VLOOKUP(H226, LanguageData, MATCH(LanguageChosen, Language[Language],0), FALSE)","v":"Total exports"},null,9]
["STOCKSTART",null,null,"OILSHALE",1,null,null,"Stocks - beginning of period","Oil shale and oil sands","2021M08",{"$f":"VLOOKUP(I227, LanguageData, MATCH(LanguageChosen, Language[Language],0), FALSE)","v":"Oil shale and oil sands"},{"$f":"VLOOKUP(H227, LanguageData, MATCH(LanguageChosen, Language[Language],0), FALSE)","v":"Stocks - beginning of period"},null,9]
["STOCKEND",null,null,"OILSHALE",1,null,null,"Stocks - end of period","Oil shale and oil sands","2021M08",{"$f":"VLOOKUP(I228, LanguageData, MATCH(LanguageChosen, Language[Language],0), FALSE)","v":"Oil shale and oil sands"},{"$f":"VLOOKUP(H228, LanguageData, MATCH(LanguageChosen, Language[Language],0), FALSE)","v":"Stocks - end of period"},null,9]
["STCHANAT",null,null,"OILSHALE",1,null,null,"Stock changes","Oil shale and oil sands","2021M08",{"$f":"VLOOKUP(I229, LanguageData, MATCH(LanguageChosen, Language[Language],0), FALSE)","v":"Oil shale and oil sands"},{"$f":"VLOOKUP(H229, LanguageData, MATCH(LanguageChosen, Language[Language],0), FALSE)","v":"Stock changes"},null,9]
["INDCONC",null,null,"OILSHALE",1,null,null,"Calculated inland deliveries","Oil shale and oil sands","2021M08",{"$f":"VLOOKUP(I230, LanguageData, MATCH(LanguageChosen, Language[Language],0), FALSE)","v":"Oil shale and oil sands"},{"$f":"VLOOKUP(H230, LanguageData, MATCH(LanguageChosen, Language[Language],0), FALSE)","v":"Calculated inland deliveries"},null,9]
["STATDIFF",null,null,"OILSHALE",1,null,null,"Statistical differences","Oil shale and oil sands","2021M08",{"$f":"VLOOKUP(I231, LanguageData, MATCH(LanguageChosen, Language[Language],0), FALSE)","v":"Oil shale and oil sands"},{"$f":"VLOOKUP(H231, LanguageData, MATCH(LanguageChosen, Language[Language],0), FALSE)","v":"Statistical differences"},null,9]
["INTERNAD",null,null,"OILSHALE",1,null,null,"Internal market deliveries (observed)","Oil shale and oil sands","2021M08",{"$f":"VLOOKUP(I232, LanguageData, MATCH(LanguageChosen, Language[Language],0), FALSE)","v":"Oil shale and oil sands"},{"$f":"VLOOKUP(H232, LanguageData, MATCH(LanguageChosen, Language[Language],0), FALSE)","v":"Internal market deliveries (observed)"},null,9]
["MAINPROD",null,null,"OILSHALE",1,null,null,"Deliveries to main activity producers","Oil shale and oil sands","2021M08",{"$f":"VLOOKUP(I233, LanguageData, MATCH(LanguageChosen, Language[Language],0), FALSE)","v":"Oil shale and oil sands"},{"$f":"VLOOKUP(H233, LanguageData, MATCH(LanguageChosen, Language[Language],0), FALSE)","v":"Deliveries to main activity producers"},null,9]
["ECOKEOVS",null,null,"OILSHALE",1,null,null,"Deliveries to coking plants","Oil shale and oil sands","2021M08",{"$f":"VLOOKUP(I234, LanguageData, MATCH(LanguageChosen, Language[Language],0), FALSE)","v":"Oil shale and oil sands"},{"$f":"VLOOKUP(H234, LanguageData, MATCH(LanguageChosen, Language[Language],0), FALSE)","v":"Deliveries to coking plants"},null,9]
["TOTIND",null,null,"OILSHALE",1,null,null,"Deliveries to total industry","Oil shale and oil sands","2021M08",{"$f":"VLOOKUP(I235, LanguageData, MATCH(LanguageChosen, Language[Language],0), FALSE)","v":"Oil shale and oil sands"},{"$f":"VLOOKUP(H235, LanguageData, MATCH(LanguageChosen, Language[Language],0), FALSE)","v":"Deliveries to total industry"},null,9]
["IRONSTL",null,null,"OILSHALE",1,null,null,"Deliveries to total industry of which to iron and steel industry","Oil shale and oil sands","2021M08",{"$f":"VLOOKUP(I236, LanguageData, MATCH(LanguageChosen, Language[Language],0), FALSE)","v":"Oil shale and oil sands"},{"$f":"VLOOKUP(H236, LanguageData, MATCH(LanguageChosen, Language[Language],0), FALSE)","v":"Deliveries to total industry of which to iron and steel industry"},null,9]
["OTHER",null,null,"OILSHALE",1,null,null,"Other deliveries (services, households, …)","Oil shale and oil sands","2021M08",{"$f":"VLOOKUP(I237, LanguageData, MATCH(LanguageChosen, Language[Language],0), FALSE)","v":"Oil shale and oil sands"},{"$f":"VLOOKUP(H237, LanguageData, MATCH(LanguageChosen, Language[Language],0), FALSE)","v":"Other deliveries (services, households, …)"},null,9]
["INDPROD",null,null,"COKEOVEN",1,null,null,"Production ","Coke oven coke","2021M08",{"$f":"VLOOKUP(I238, LanguageData, MATCH(LanguageChosen, Language[Language],0), FALSE)","v":"Coke oven coke"},{"$f":"VLOOKUP(H238, LanguageData, MATCH(LanguageChosen, Language[Language],0), FALSE)","v":"Production "},null,9]
["OSOURCES",null,null,"COKEOVEN",1,null,null,"Recovered products","Coke oven coke","2021M08",{"$f":"VLOOKUP(I239, LanguageData, MATCH(LanguageChosen, Language[Language],0), FALSE)","v":"Coke oven coke"},{"$f":"VLOOKUP(H239, LanguageData, MATCH(LanguageChosen, Language[Language],0), FALSE)","v":"Recovered products"},null,9]
["TOTIMPSB",null,null,"COKEOVEN",1,null,null,"Total imports","Coke oven coke","2021M08",{"$f":"VLOOKUP(I240, LanguageData, MATCH(LanguageChosen, Language[Language],0), FALSE)","v":"Coke oven coke"},{"$f":"VLOOKUP(H240, LanguageData, MATCH(LanguageChosen, Language[Language],0), FALSE)","v":"Total imports"},null,9]
["TOTIMPSBEU",null,null,"COKEOVEN",1,null,null,"Imports: of which from outside EU","Coke oven coke","2021M08",{"$f":"VLOOKUP(I241, LanguageData, MATCH(LanguageChosen, Language[Language],0), FALSE)","v":"Coke oven coke"},{"$f":"VLOOKUP(H241, LanguageData, MATCH(LanguageChosen, Language[Language],0), FALSE)","v":"Imports: of which from outside EU"},null,9]
["TOTEXPSB",null,null,"COKEOVEN",1,null,null,"Total exports","Coke oven coke","2021M08",{"$f":"VLOOKUP(I242, LanguageData, MATCH(LanguageChosen, Language[Language],0), FALSE)","v":"Coke oven coke"},{"$f":"VLOOKUP(H242, LanguageData, MATCH(LanguageChosen, Language[Language],0), FALSE)","v":"Total exports"},null,9]
["STOCKSTART",null,null,"COKEOVEN",1,null,null,"Stocks - beginning of period","Coke oven coke","2021M08",{"$f":"VLOOKUP(I243, LanguageData, MATCH(LanguageChosen, Language[Language],0), FALSE)","v":"Coke oven coke"},{"$f":"VLOOKUP(H243, LanguageData, MATCH(LanguageChosen, Language[Language],0), FALSE)","v":"Stocks - beginning of period"},null,9]
["STOCKEND",null,null,"COKEOVEN",1,null,null,"Stocks - end of period","Coke oven coke","2021M08",{"$f":"VLOOKUP(I244, LanguageData, MATCH(LanguageChosen, Language[Language],0), FALSE)","v":"Coke oven coke"},{"$f":"VLOOKUP(H244, LanguageData, MATCH(LanguageChosen, Language[Language],0), FALSE)","v":"Stocks - end of period"},null,9]
["STCHANAT",null,null,"COKEOVEN",1,null,null,"Stock changes","Coke oven coke","2021M08",{"$f":"VLOOKUP(I245, LanguageData, MATCH(LanguageChosen, Language[Language],0), FALSE)","v":"Coke oven coke"},{"$f":"VLOOKUP(H245, LanguageData, MATCH(LanguageChosen, Language[Language],0), FALSE)","v":"Stock changes"},null,9]
["INDCONC",null,null,"COKEOVEN",1,null,null,"Calculated inland deliveries","Coke oven coke","2021M08",{"$f":"VLOOKUP(I246, LanguageData, MATCH(LanguageChosen, Language[Language],0), FALSE)","v":"Coke oven coke"},{"$f":"VLOOKUP(H246, LanguageData, MATCH(LanguageChosen, Language[Language],0), FALSE)","v":"Calculated inland deliveries"},null,9]
["STATDIFF",null,null,"COKEOVEN",1,null,null,"Statistical differences","Coke oven coke","2021M08",{"$f":"VLOOKUP(I247, LanguageData, MATCH(LanguageChosen, Language[Language],0), FALSE)","v":"Coke oven coke"},{"$f":"VLOOKUP(H247, LanguageData, MATCH(LanguageChosen, Language[Language],0), FALSE)","v":"Statistical differences"},null,9]
["INTERNAD",null,null,"COKEOVEN",1,null,null,"Internal market deliveries (observed)","Coke oven coke","2021M08",{"$f":"VLOOKUP(I248, LanguageData, MATCH(LanguageChosen, Language[Language],0), FALSE)","v":"Coke oven coke"},{"$f":"VLOOKUP(H248, LanguageData, MATCH(LanguageChosen, Language[Language],0), FALSE)","v":"Internal market deliveries (observed)"},null,9]
["MAINPROD",null,null,"COKEOVEN",1,null,null,"Deliveries to main activity producers","Coke oven coke","2021M08",{"$f":"VLOOKUP(I249, LanguageData, MATCH(LanguageChosen, Language[Language],0), FALSE)","v":"Coke oven coke"},{"$f":"VLOOKUP(H249, LanguageData, MATCH(LanguageChosen, Language[Language],0), FALSE)","v":"Deliveries to main activity producers"},null,9]
["ECOKEOVS",null,null,"COKEOVEN",1,null,null,"Deliveries to coking plants","Coke oven coke","2021M08",{"$f":"VLOOKUP(I250, LanguageData, MATCH(LanguageChosen, Language[Language],0), FALSE)","v":"Coke oven coke"},{"$f":"VLOOKUP(H250, LanguageData, MATCH(LanguageChosen, Language[Language],0), FALSE)","v":"Deliveries to coking plants"},null,9]
["TOTIND",null,null,"COKEOVEN",1,null,null,"Deliveries to total industry","Coke oven coke","2021M08",{"$f":"VLOOKUP(I251, LanguageData, MATCH(LanguageChosen, Language[Language],0), FALSE)","v":"Coke oven coke"},{"$f":"VLOOKUP(H251, LanguageData, MATCH(LanguageChosen, Language[Language],0), FALSE)","v":"Deliveries to total industry"},null,9]
["IRONSTL",null,null,"COKEOVEN",1,null,null,"Deliveries to total industry of which to iron and steel industry","Coke oven coke","2021M08",{"$f":"VLOOKUP(I252, LanguageData, MATCH(LanguageChosen, Language[Language],0), FALSE)","v":"Coke oven coke"},{"$f":"VLOOKUP(H252, LanguageData, MATCH(LanguageChosen, Language[Language],0), FALSE)","v":"Deliveries to total industry of which to iron and steel industry"},null,9]
["OTHER",null,null,"COKEOVEN",1,null,null,"Other deliveries (services, households, …)","Coke oven coke","2021M08",{"$f":"VLOOKUP(I253, LanguageData, MATCH(LanguageChosen, Language[Language],0), FALSE)","v":"Coke oven coke"},{"$f":"VLOOKUP(H253, LanguageData, MATCH(LanguageChosen, Language[Language],0), FALSE)","v":"Other deliveries (services, households, …)"},null,9]
["INDPROD",null,null,"HARDCOAL",1,null,null,"Production ","Hard coal","2021M09",{"$f":"VLOOKUP(I254, LanguageData, MATCH(LanguageChosen, Language[Language],0), FALSE)","v":"Hard coal"},{"$f":"VLOOKUP(H254, LanguageData, MATCH(LanguageChosen, Language[Language],0), FALSE)","v":"Production "},null,8]
["OSOURCES",null,null,"HARDCOAL",1,null,null,"Recovered products","Hard coal","2021M09",{"$f":"VLOOKUP(I255, LanguageData, MATCH(LanguageChosen, Language[Language],0), FALSE)","v":"Hard coal"},{"$f":"VLOOKUP(H255, LanguageData, MATCH(LanguageChosen, Language[Language],0), FALSE)","v":"Recovered products"},null,8]
["TOTIMPSB",null,null,"HARDCOAL",1,null,null,"Total imports","Hard coal","2021M09",{"$f":"VLOOKUP(I256, LanguageData, MATCH(LanguageChosen, Language[Language],0), FALSE)","v":"Hard coal"},{"$f":"VLOOKUP(H256, LanguageData, MATCH(LanguageChosen, Language[Language],0), FALSE)","v":"Total imports"},null,8]
["TOTIMPSBEU",null,null,"HARDCOAL",1,null,null,"Imports: of which from outside EU","Hard coal","2021M09",{"$f":"VLOOKUP(I257, LanguageData, MATCH(LanguageChosen, Language[Language],0), FALSE)","v":"Hard coal"},{"$f":"VLOOKUP(H257, LanguageData, MATCH(LanguageChosen, Language[Language],0), FALSE)","v":"Imports: of which from outside EU"},null,8]
["TOTEXPSB",null,null,"HARDCOAL",1,null,null,"Total exports","Hard coal","2021M09",{"$f":"VLOOKUP(I258, LanguageData, MATCH(LanguageChosen, Language[Language],0), FALSE)","v":"Hard coal"},{"$f":"VLOOKUP(H258, LanguageData, MATCH(LanguageChosen, Language[Language],0), FALSE)","v":"Total exports"},null,8]
["STOCKSTART",null,null,"HARDCOAL",1,null,null,"Stocks - beginning of period","Hard coal","2021M09",{"$f":"VLOOKUP(I259, LanguageData, MATCH(LanguageChosen, Language[Language],0), FALSE)","v":"Hard coal"},{"$f":"VLOOKUP(H259, LanguageData, MATCH(LanguageChosen, Language[Language],0), FALSE)","v":"Stocks - beginning of period"},null,8]
["STOCKEND",null,null,"HARDCOAL",1,null,null,"Stocks - end of period","Hard coal","2021M09",{"$f":"VLOOKUP(I260, LanguageData, MATCH(LanguageChosen, Language[Language],0), FALSE)","v":"Hard coal"},{"$f":"VLOOKUP(H260, LanguageData, MATCH(LanguageChosen, Language[Language],0), FALSE)","v":"Stocks - end of period"},null,8]
["STCHANAT",null,null,"HARDCOAL",1,null,null,"Stock changes","Hard coal","2021M09",{"$f":"VLOOKUP(I261, LanguageData, MATCH(LanguageChosen, Language[Language],0), FALSE)","v":"Hard coal"},{"$f":"VLOOKUP(H261, LanguageData, MATCH(LanguageChosen, Language[Language],0), FALSE)","v":"Stock changes"},null,8]
["INDCONC",null,null,"HARDCOAL",1,null,null,"Calculated inland deliveries","Hard coal","2021M09",{"$f":"VLOOKUP(I262, LanguageData, MATCH(LanguageChosen, Language[Language],0), FALSE)","v":"Hard coal"},{"$f":"VLOOKUP(H262, LanguageData, MATCH(LanguageChosen, Language[Language],0), FALSE)","v":"Calculated inland deliveries"},null,8]
["STATDIFF",null,null,"HARDCOAL",1,null,null,"Statistical differences","Hard coal","2021M09",{"$f":"VLOOKUP(I263, LanguageData, MATCH(LanguageChosen, Language[Language],0), FALSE)","v":"Hard coal"},{"$f":"VLOOKUP(H263, LanguageData, MATCH(LanguageChosen, Language[Language],0), FALSE)","v":"Statistical differences"},null,8]
["INTERNAD",null,null,"HARDCOAL",1,null,null,"Internal market deliveries (observed)","Hard coal","2021M09",{"$f":"VLOOKUP(I264, LanguageData, MATCH(LanguageChosen, Language[Language],0), FALSE)","v":"Hard coal"},{"$f":"VLOOKUP(H264, LanguageData, MATCH(LanguageChosen, Language[Language],0), FALSE)","v":"Internal market deliveries (observed)"},null,8]
["MAINPROD",null,null,"HARDCOAL",1,null,null,"Deliveries to main activity producers","Hard coal","2021M09",{"$f":"VLOOKUP(I265, LanguageData, MATCH(LanguageChosen, Language[Language],0), FALSE)","v":"Hard coal"},{"$f":"VLOOKUP(H265, LanguageData, MATCH(LanguageChosen, Language[Language],0), FALSE)","v":"Deliveries to main activity producers"},null,8]
["ECOKEOVS",null,null,"HARDCOAL",1,null,null,"Deliveries to coking plants","Hard coal","2021M09",{"$f":"VLOOKUP(I266, LanguageData, MATCH(LanguageChosen, Language[Language],0), FALSE)","v":"Hard coal"},{"$f":"VLOOKUP(H266, LanguageData, MATCH(LanguageChosen, Language[Language],0), FALSE)","v":"Deliveries to coking plants"},null,8]
["TOTIND",null,null,"HARDCOAL",1,null,null,"Deliveries to total industry","Hard coal","2021M09",{"$f":"VLOOKUP(I267, LanguageData, MATCH(LanguageChosen, Language[Language],0), FALSE)","v":"Hard coal"},{"$f":"VLOOKUP(H267, LanguageData, MATCH(LanguageChosen, Language[Language],0), FALSE)","v":"Deliveries to total industry"},null,8]
["IRONSTL",null,null,"HARDCOAL",1,null,null,"Deliveries to total industry of which to iron and steel industry","Hard coal","2021M09",{"$f":"VLOOKUP(I268, LanguageData, MATCH(LanguageChosen, Language[Language],0), FALSE)","v":"Hard coal"},{"$f":"VLOOKUP(H268, LanguageData, MATCH(LanguageChosen, Language[Language],0), FALSE)","v":"Deliveries to total industry of which to iron and steel industry"},null,8]
["OTHER",null,null,"HARDCOAL",1,null,null,"Other deliveries (services, households, …)","Hard coal","2021M09",{"$f":"VLOOKUP(I269, LanguageData, MATCH(LanguageChosen, Language[Language],0), FALSE)","v":"Hard coal"},{"$f":"VLOOKUP(H269, LanguageData, MATCH(LanguageChosen, Language[Language],0), FALSE)","v":"Other deliveries (services, households, …)"},null,8]
["INDPROD",null,null,"BROWN",1,null,null,"Production ","Brown coal","2021M09",{"$f":"VLOOKUP(I270, LanguageData, MATCH(LanguageChosen, Language[Language],0), FALSE)","v":"Brown coal"},{"$f":"VLOOKUP(H270, LanguageData, MATCH(LanguageChosen, Language[Language],0), FALSE)","v":"Production "},null,8]
["OSOURCES",null,null,"BROWN",1,null,null,"Recovered products","Brown coal",{"$f":"YEAR(DATE(LEFT($B$1,4),RIGHT($B$1,2)-N271,1)) & \"M\" & TEXT(MONTH(DATE(LEFT($B$1,4),RIGHT($B$1,2)-N271,1)),\"00\")","v":"2021M09"},{"$f":"VLOOKUP(I271, LanguageData, MATCH(LanguageChosen, Language[Language],0), FALSE)","v":"Brown coal"},{"$f":"VLOOKUP(H271, LanguageData, MATCH(LanguageChosen, Language[Language],0), FALSE)","v":"Recovered products"},null,8]
["TOTIMPSB",null,null,"BROWN",1,null,null,"Total imports","Brown coal","2021M09",{"$f":"VLOOKUP(I272, LanguageData, MATCH(LanguageChosen, Language[Language],0), FALSE)","v":"Brown coal"},{"$f":"VLOOKUP(H272, LanguageData, MATCH(LanguageChosen, Language[Language],0), FALSE)","v":"Total imports"},null,8]
["TOTIMPSBEU",null,null,"BROWN",1,null,null,"Imports: of which from outside EU","Brown coal","2021M09",{"$f":"VLOOKUP(I273, LanguageData, MATCH(LanguageChosen, Language[Language],0), FALSE)","v":"Brown coal"},{"$f":"VLOOKUP(H273, LanguageData, MATCH(LanguageChosen, Language[Language],0), FALSE)","v":"Imports: of which from outside EU"},null,8]
["TOTEXPSB",null,null,"BROWN",1,null,null,"Total exports","Brown coal","2021M09",{"$f":"VLOOKUP(I274, LanguageData, MATCH(LanguageChosen, Language[Language],0), FALSE)","v":"Brown coal"},{"$f":"VLOOKUP(H274, LanguageData, MATCH(LanguageChosen, Language[Language],0), FALSE)","v":"Total exports"},null,8]
["STOCKSTART",null,null,"BROWN",1,null,null,"Stocks - beginning of period","Brown coal","2021M09",{"$f":"VLOOKUP(I275, LanguageData, MATCH(LanguageChosen, Language[Language],0), FALSE)","v":"Brown coal"},{"$f":"VLOOKUP(H275, LanguageData, MATCH(LanguageChosen, Language[Language],0), FALSE)","v":"Stocks - beginning of period"},null,8]
["STOCKEND",null,null,"BROWN",1,null,null,"Stocks - end of period","Brown coal","2021M09",{"$f":"VLOOKUP(I276, LanguageData, MATCH(LanguageChosen, Language[Language],0), FALSE)","v":"Brown coal"},{"$f":"VLOOKUP(H276, LanguageData, MATCH(LanguageChosen, Language[Language],0), FALSE)","v":"Stocks - end of period"},null,8]
["STCHANAT",null,null,"BROWN",1,null,null,"Stock changes","Brown coal","2021M09",{"$f":"VLOOKUP(I277, LanguageData, MATCH(LanguageChosen, Language[Language],0), FALSE)","v":"Brown coal"},{"$f":"VLOOKUP(H277, LanguageData, MATCH(LanguageChosen, Language[Language],0), FALSE)","v":"Stock changes"},null,8]
["INDCONC",null,null,"BROWN",1,null,null,"Calculated inland deliveries","Brown coal","2021M09",{"$f":"VLOOKUP(I278, LanguageData, MATCH(LanguageChosen, Language[Language],0), FALSE)","v":"Brown coal"},{"$f":"VLOOKUP(H278, LanguageData, MATCH(LanguageChosen, Language[Language],0), FALSE)","v":"Calculated inland deliveries"},null,8]
["STATDIFF",null,null,"BROWN",1,null,null,"Statistical differences","Brown coal","2021M09",{"$f":"VLOOKUP(I279, LanguageData, MATCH(LanguageChosen, Language[Language],0), FALSE)","v":"Brown coal"},{"$f":"VLOOKUP(H279, LanguageData, MATCH(LanguageChosen, Language[Language],0), FALSE)","v":"Statistical differences"},null,8]
["INTERNAD",null,null,"BROWN",1,null,null,"Internal market deliveries (observed)","Brown coal","2021M09",{"$f":"VLOOKUP(I280, LanguageData, MATCH(LanguageChosen, Language[Language],0), FALSE)","v":"Brown coal"},{"$f":"VLOOKUP(H280, LanguageData, MATCH(LanguageChosen, Language[Language],0), FALSE)","v":"Internal market deliveries (observed)"},null,8]
["MAINPROD",null,null,"BROWN",1,null,null,"Deliveries to main activity producers","Brown coal","2021M09",{"$f":"VLOOKUP(I281, LanguageData, MATCH(LanguageChosen, Language[Language],0), FALSE)","v":"Brown coal"},{"$f":"VLOOKUP(H281, LanguageData, MATCH(LanguageChosen, Language[Language],0), FALSE)","v":"Deliveries to main activity producers"},null,8]
["ECOKEOVS",null,null,"BROWN",1,null,null,"Deliveries to coking plants","Brown coal","2021M09",{"$f":"VLOOKUP(I282, LanguageData, MATCH(LanguageChosen, Language[Language],0), FALSE)","v":"Brown coal"},{"$f":"VLOOKUP(H282, LanguageData, MATCH(LanguageChosen, Language[Language],0), FALSE)","v":"Deliveries to coking plants"},null,8]
["TOTIND",null,null,"BROWN",1,null,null,"Deliveries to total industry","Brown coal","2021M09",{"$f":"VLOOKUP(I283, LanguageData, MATCH(LanguageChosen, Language[Language],0), FALSE)","v":"Brown coal"},{"$f":"VLOOKUP(H283, LanguageData, MATCH(LanguageChosen, Language[Language],0), FALSE)","v":"Deliveries to total industry"},null,8]
["IRONSTL",null,null,"BROWN",1,null,null,"Deliveries to total industry of which to iron and steel industry","Brown coal","2021M09",{"$f":"VLOOKUP(I284, LanguageData, MATCH(LanguageChosen, Language[Language],0), FALSE)","v":"Brown coal"},{"$f":"VLOOKUP(H284, LanguageData, MATCH(LanguageChosen, Language[Language],0), FALSE)","v":"Deliveries to total industry of which to iron and steel industry"},null,8]
["OTHER",null,null,"BROWN",1,null,null,"Other deliveries (services, households, …)","Brown coal","2021M09",{"$f":"VLOOKUP(I285, LanguageData, MATCH(LanguageChosen, Language[Language],0), FALSE)","v":"Brown coal"},{"$f":"VLOOKUP(H285, LanguageData, MATCH(LanguageChosen, Language[Language],0), FALSE)","v":"Other deliveries (services, households, …)"},null,8]
["INDPROD",null,null,"PEAT",1,null,null,"Production ","Peat","2021M09",{"$f":"VLOOKUP(I286, LanguageData, MATCH(LanguageChosen, Language[Language],0), FALSE)","v":"Peat"},{"$f":"VLOOKUP(H286, LanguageData, MATCH(LanguageChosen, Language[Language],0), FALSE)","v":"Production "},null,8]
["OSOURCES",null,null,"PEAT",1,null,null,"Recovered products","Peat","2021M09",{"$f":"VLOOKUP(I287, LanguageData, MATCH(LanguageChosen, Language[Language],0), FALSE)","v":"Peat"},{"$f":"VLOOKUP(H287, LanguageData, MATCH(LanguageChosen, Language[Language],0), FALSE)","v":"Recovered products"},null,8]
["TOTIMPSB",null,null,"PEAT",1,null,null,"Total imports","Peat","2021M09",{"$f":"VLOOKUP(I288, LanguageData, MATCH(LanguageChosen, Language[Language],0), FALSE)","v":"Peat"},{"$f":"VLOOKUP(H288, LanguageData, MATCH(LanguageChosen, Language[Language],0), FALSE)","v":"Total imports"},null,8]
["TOTIMPSBEU",null,null,"PEAT",1,null,null,"Imports: of which from outside EU","Peat","2021M09",{"$f":"VLOOKUP(I289, LanguageData, MATCH(LanguageChosen, Language[Language],0), FALSE)","v":"Peat"},{"$f":"VLOOKUP(H289, LanguageData, MATCH(LanguageChosen, Language[Language],0), FALSE)","v":"Imports: of which from outside EU"},null,8]
["TOTEXPSB",null,null,"PEAT",1,null,null,"Total exports","Peat","2021M09",{"$f":"VLOOKUP(I290, LanguageData, MATCH(LanguageChosen, Language[Language],0), FALSE)","v":"Peat"},{"$f":"VLOOKUP(H290, LanguageData, MATCH(LanguageChosen, Language[Language],0), FALSE)","v":"Total exports"},null,8]
["STOCKSTART",null,null,"PEAT",1,null,null,"Stocks - beginning of period","Peat","2021M09",{"$f":"VLOOKUP(I291, LanguageData, MATCH(LanguageChosen, Language[Language],0), FALSE)","v":"Peat"},{"$f":"VLOOKUP(H291, LanguageData, MATCH(LanguageChosen, Language[Language],0), FALSE)","v":"Stocks - beginning of period"},null,8]
["STOCKEND",null,null,"PEAT",1,null,null,"Stocks - end of period","Peat","2021M09",{"$f":"VLOOKUP(I292, LanguageData, MATCH(LanguageChosen, Language[Language],0), FALSE)","v":"Peat"},{"$f":"VLOOKUP(H292, LanguageData, MATCH(LanguageChosen, Language[Language],0), FALSE)","v":"Stocks - end of period"},null,8]
["STCHANAT",null,null,"PEAT",1,null,null,"Stock changes","Peat","2021M09",{"$f":"VLOOKUP(I293, LanguageData, MATCH(LanguageChosen, Language[Language],0), FALSE)","v":"Peat"},{"$f":"VLOOKUP(H293, LanguageData, MATCH(LanguageChosen, Language[Language],0), FALSE)","v":"Stock changes"},null,8]
["INDCONC",null,null,"PEAT",1,null,null,"Calculated inland deliveries","Peat","2021M09",{"$f":"VLOOKUP(I294, LanguageData, MATCH(LanguageChosen, Language[Language],0), FALSE)","v":"Peat"},{"$f":"VLOOKUP(H294, LanguageData, MATCH(LanguageChosen, Language[Language],0), FALSE)","v":"Calculated inland deliveries"},null,8]
["STATDIFF",null,null,"PEAT",1,null,null,"Statistical differences","Peat","2021M09",{"$f":"VLOOKUP(I295, LanguageData, MATCH(LanguageChosen, Language[Language],0), FALSE)","v":"Peat"},{"$f":"VLOOKUP(H295, LanguageData, MATCH(LanguageChosen, Language[Language],0), FALSE)","v":"Statistical differences"},null,8]
["INTERNAD",null,null,"PEAT",1,null,null,"Internal market deliveries (observed)","Peat","2021M09",{"$f":"VLOOKUP(I296, LanguageData, MATCH(LanguageChosen, Language[Language],0), FALSE)","v":"Peat"},{"$f":"VLOOKUP(H296, LanguageData, MATCH(LanguageChosen, Language[Language],0), FALSE)","v":"Internal market deliveries (observed)"},null,8]
["MAINPROD",null,null,"PEAT",1,null,null,"Deliveries to main activity producers","Peat","2021M09",{"$f":"VLOOKUP(I297, LanguageData, MATCH(LanguageChosen, Language[Language],0), FALSE)","v":"Peat"},{"$f":"VLOOKUP(H297, LanguageData, MATCH(LanguageChosen, Language[Language],0), FALSE)","v":"Deliveries to main activity producers"},null,8]
["ECOKEOVS",null,null,"PEAT",1,null,null,"Deliveries to coking plants","Peat","2021M09",{"$f":"VLOOKUP(I298, LanguageData, MATCH(LanguageChosen, Language[Language],0), FALSE)","v":"Peat"},{"$f":"VLOOKUP(H298, LanguageData, MATCH(LanguageChosen, Language[Language],0), FALSE)","v":"Deliveries to coking plants"},null,8]
["TOTIND",null,null,"PEAT",1,null,null,"Deliveries to total industry","Peat","2021M09",{"$f":"VLOOKUP(I299, LanguageData, MATCH(LanguageChosen, Language[Language],0), FALSE)","v":"Peat"},{"$f":"VLOOKUP(H299, LanguageData, MATCH(LanguageChosen, Language[Language],0), FALSE)","v":"Deliveries to total industry"},null,8]
["IRONSTL",null,null,"PEAT",1,null,null,"Deliveries to total industry of which to iron and steel industry","Peat","2021M09",{"$f":"VLOOKUP(I300, LanguageData, MATCH(LanguageChosen, Language[Language],0), FALSE)","v":"Peat"},{"$f":"VLOOKUP(H300, LanguageData, MATCH(LanguageChosen, Language[Language],0), FALSE)","v":"Deliveries to total industry of which to iron and steel industry"},null,8]
["OTHER",null,null,"PEAT",1,null,null,"Other deliveries (services, households, …)","Peat","2021M09",{"$f":"VLOOKUP(I301, LanguageData, MATCH(LanguageChosen, Language[Language],0), FALSE)","v":"Peat"},{"$f":"VLOOKUP(H301, LanguageData, MATCH(LanguageChosen, Language[Language],0), FALSE)","v":"Other deliveries (services, households, …)"},null,8]
["INDPROD",null,null,"OILSHALE",1,null,null,"Production ","Oil shale and oil sands","2021M09",{"$f":"VLOOKUP(I302, LanguageData, MATCH(LanguageChosen, Language[Language],0), FALSE)","v":"Oil shale and oil sands"},{"$f":"VLOOKUP(H302, LanguageData, MATCH(LanguageChosen, Language[Language],0), FALSE)","v":"Production "},null,8]
["OSOURCES",null,null,"OILSHALE",1,null,null,"Recovered products","Oil shale and oil sands","2021M09",{"$f":"VLOOKUP(I303, LanguageData, MATCH(LanguageChosen, Language[Language],0), FALSE)","v":"Oil shale and oil sands"},{"$f":"VLOOKUP(H303, LanguageData, MATCH(LanguageChosen, Language[Language],0), FALSE)","v":"Recovered products"},null,8]
["TOTIMPSB",null,null,"OILSHALE",1,null,null,"Total imports","Oil shale and oil sands","2021M09",{"$f":"VLOOKUP(I304, LanguageData, MATCH(LanguageChosen, Language[Language],0), FALSE)","v":"Oil shale and oil sands"},{"$f":"VLOOKUP(H304, LanguageData, MATCH(LanguageChosen, Language[Language],0), FALSE)","v":"Total imports"},null,8]
["TOTIMPSBEU",null,null,"OILSHALE",1,null,null,"Imports: of which from outside EU","Oil shale and oil sands","2021M09",{"$f":"VLOOKUP(I305, LanguageData, MATCH(LanguageChosen, Language[Language],0), FALSE)","v":"Oil shale and oil sands"},{"$f":"VLOOKUP(H305, LanguageData, MATCH(LanguageChosen, Language[Language],0), FALSE)","v":"Imports: of which from outside EU"},null,8]
["TOTEXPSB",null,null,"OILSHALE",1,null,null,"Total exports","Oil shale and oil sands","2021M09",{"$f":"VLOOKUP(I306, LanguageData, MATCH(LanguageChosen, Language[Language],0), FALSE)","v":"Oil shale and oil sands"},{"$f":"VLOOKUP(H306, LanguageData, MATCH(LanguageChosen, Language[Language],0), FALSE)","v":"Total exports"},null,8]
["STOCKSTART",null,null,"OILSHALE",1,null,null,"Stocks - beginning of period","Oil shale and oil sands","2021M09",{"$f":"VLOOKUP(I307, LanguageData, MATCH(LanguageChosen, Language[Language],0), FALSE)","v":"Oil shale and oil sands"},{"$f":"VLOOKUP(H307, LanguageData, MATCH(LanguageChosen, Language[Language],0), FALSE)","v":"Stocks - beginning of period"},null,8]
["STOCKEND",null,null,"OILSHALE",1,null,null,"Stocks - end of period","Oil shale and oil sands","2021M09",{"$f":"VLOOKUP(I308, LanguageData, MATCH(LanguageChosen, Language[Language],0), FALSE)","v":"Oil shale and oil sands"},{"$f":"VLOOKUP(H308, LanguageData, MATCH(LanguageChosen, Language[Language],0), FALSE)","v":"Stocks - end of period"},null,8]
["STCHANAT",null,null,"OILSHALE",1,null,null,"Stock changes","Oil shale and oil sands","2021M09",{"$f":"VLOOKUP(I309, LanguageData, MATCH(LanguageChosen, Language[Language],0), FALSE)","v":"Oil shale and oil sands"},{"$f":"VLOOKUP(H309, LanguageData, MATCH(LanguageChosen, Language[Language],0), FALSE)","v":"Stock changes"},null,8]
["INDCONC",null,null,"OILSHALE",1,null,null,"Calculated inland deliveries","Oil shale and oil sands","2021M09",{"$f":"VLOOKUP(I310, LanguageData, MATCH(LanguageChosen, Language[Language],0), FALSE)","v":"Oil shale and oil sands"},{"$f":"VLOOKUP(H310, LanguageData, MATCH(LanguageChosen, Language[Language],0), FALSE)","v":"Calculated inland deliveries"},null,8]
["STATDIFF",null,null,"OILSHALE",1,null,null,"Statistical differences","Oil shale and oil sands","2021M09",{"$f":"VLOOKUP(I311, LanguageData, MATCH(LanguageChosen, Language[Language],0), FALSE)","v":"Oil shale and oil sands"},{"$f":"VLOOKUP(H311, LanguageData, MATCH(LanguageChosen, Language[Language],0), FALSE)","v":"Statistical differences"},null,8]
["INTERNAD",null,null,"OILSHALE",1,null,null,"Internal market deliveries (observed)","Oil shale and oil sands","2021M09",{"$f":"VLOOKUP(I312, LanguageData, MATCH(LanguageChosen, Language[Language],0), FALSE)","v":"Oil shale and oil sands"},{"$f":"VLOOKUP(H312, LanguageData, MATCH(LanguageChosen, Language[Language],0), FALSE)","v":"Internal market deliveries (observed)"},null,8]
["MAINPROD",null,null,"OILSHALE",1,null,null,"Deliveries to main activity producers","Oil shale and oil sands","2021M09",{"$f":"VLOOKUP(I313, LanguageData, MATCH(LanguageChosen, Language[Language],0), FALSE)","v":"Oil shale and oil sands"},{"$f":"VLOOKUP(H313, LanguageData, MATCH(LanguageChosen, Language[Language],0), FALSE)","v":"Deliveries to main activity producers"},null,8]
["ECOKEOVS",null,null,"OILSHALE",1,null,null,"Deliveries to coking plants","Oil shale and oil sands","2021M09",{"$f":"VLOOKUP(I314, LanguageData, MATCH(LanguageChosen, Language[Language],0), FALSE)","v":"Oil shale and oil sands"},{"$f":"VLOOKUP(H314, LanguageData, MATCH(LanguageChosen, Language[Language],0), FALSE)","v":"Deliveries to coking plants"},null,8]
["TOTIND",null,null,"OILSHALE",1,null,null,"Deliveries to total industry","Oil shale and oil sands","2021M09",{"$f":"VLOOKUP(I315, LanguageData, MATCH(LanguageChosen, Language[Language],0), FALSE)","v":"Oil shale and oil sands"},{"$f":"VLOOKUP(H315, LanguageData, MATCH(LanguageChosen, Language[Language],0), FALSE)","v":"Deliveries to total industry"},null,8]
["IRONSTL",null,null,"OILSHALE",1,null,null,"Deliveries to total industry of which to iron and steel industry","Oil shale and oil sands","2021M09",{"$f":"VLOOKUP(I316, LanguageData, MATCH(LanguageChosen, Language[Language],0), FALSE)","v":"Oil shale and oil sands"},{"$f":"VLOOKUP(H316, LanguageData, MATCH(LanguageChosen, Language[Language],0), FALSE)","v":"Deliveries to total industry of which to iron and steel industry"},null,8]
["OTHER",null,null,"OILSHALE",1,null,null,"Other deliveries (services, households, …)","Oil shale and oil sands","2021M09",{"$f":"VLOOKUP(I317, LanguageData, MATCH(LanguageChosen, Language[Language],0), FALSE)","v":"Oil shale and oil sands"},{"$f":"VLOOKUP(H317, LanguageData, MATCH(LanguageChosen, Language[Language],0), FALSE)","v":"Other deliveries (services, households, …)"},null,8]
["INDPROD",null,null,"COKEOVEN",1,null,null,"Production ","Coke oven coke","2021M09",{"$f":"VLOOKUP(I318, LanguageData, MATCH(LanguageChosen, Language[Language],0), FALSE)","v":"Coke oven coke"},{"$f":"VLOOKUP(H318, LanguageData, MATCH(LanguageChosen, Language[Language],0), FALSE)","v":"Production "},null,8]
["OSOURCES",null,null,"COKEOVEN",1,null,null,"Recovered products","Coke oven coke","2021M09",{"$f":"VLOOKUP(I319, LanguageData, MATCH(LanguageChosen, Language[Language],0), FALSE)","v":"Coke oven coke"},{"$f":"VLOOKUP(H319, LanguageData, MATCH(LanguageChosen, Language[Language],0), FALSE)","v":"Recovered products"},null,8]
["TOTIMPSB",null,null,"COKEOVEN",1,null,null,"Total imports","Coke oven coke","2021M09",{"$f":"VLOOKUP(I320, LanguageData, MATCH(LanguageChosen, Language[Language],0), FALSE)","v":"Coke oven coke"},{"$f":"VLOOKUP(H320, LanguageData, MATCH(LanguageChosen, Language[Language],0), FALSE)","v":"Total imports"},null,8]
["TOTIMPSBEU",null,null,"COKEOVEN",1,null,null,"Imports: of which from outside EU","Coke oven coke","2021M09",{"$f":"VLOOKUP(I321, LanguageData, MATCH(LanguageChosen, Language[Language],0), FALSE)","v":"Coke oven coke"},{"$f":"VLOOKUP(H321, LanguageData, MATCH(LanguageChosen, Language[Language],0), FALSE)","v":"Imports: of which from outside EU"},null,8]
["TOTEXPSB",null,null,"COKEOVEN",1,null,null,"Total exports","Coke oven coke","2021M09",{"$f":"VLOOKUP(I322, LanguageData, MATCH(LanguageChosen, Language[Language],0), FALSE)","v":"Coke oven coke"},{"$f":"VLOOKUP(H322, LanguageData, MATCH(LanguageChosen, Language[Language],0), FALSE)","v":"Total exports"},null,8]
["STOCKSTART",null,null,"COKEOVEN",1,null,null,"Stocks - beginning of period","Coke oven coke","2021M09",{"$f":"VLOOKUP(I323, LanguageData, MATCH(LanguageChosen, Language[Language],0), FALSE)","v":"Coke oven coke"},{"$f":"VLOOKUP(H323, LanguageData, MATCH(LanguageChosen, Language[Language],0), FALSE)","v":"Stocks - beginning of period"},null,8]
["STOCKEND",null,null,"COKEOVEN",1,null,null,"Stocks - end of period","Coke oven coke","2021M09",{"$f":"VLOOKUP(I324, LanguageData, MATCH(LanguageChosen, Language[Language],0), FALSE)","v":"Coke oven coke"},{"$f":"VLOOKUP(H324, LanguageData, MATCH(LanguageChosen, Language[Language],0), FALSE)","v":"Stocks - end of period"},null,8]
["STCHANAT",null,null,"COKEOVEN",1,null,null,"Stock changes","Coke oven coke","2021M09",{"$f":"VLOOKUP(I325, LanguageData, MATCH(LanguageChosen, Language[Language],0), FALSE)","v":"Coke oven coke"},{"$f":"VLOOKUP(H325, LanguageData, MATCH(LanguageChosen, Language[Language],0), FALSE)","v":"Stock changes"},null,8]
["INDCONC",null,null,"COKEOVEN",1,null,null,"Calculated inland deliveries","Coke oven coke","2021M09",{"$f":"VLOOKUP(I326, LanguageData, MATCH(LanguageChosen, Language[Language],0), FALSE)","v":"Coke oven coke"},{"$f":"VLOOKUP(H326, LanguageData, MATCH(LanguageChosen, Language[Language],0), FALSE)","v":"Calculated inland deliveries"},null,8]
["STATDIFF",null,null,"COKEOVEN",1,null,null,"Statistical differences","Coke oven coke","2021M09",{"$f":"VLOOKUP(I327, LanguageData, MATCH(LanguageChosen, Language[Language],0), FALSE)","v":"Coke oven coke"},{"$f":"VLOOKUP(H327, LanguageData, MATCH(LanguageChosen, Language[Language],0), FALSE)","v":"Statistical differences"},null,8]
["INTERNAD",null,null,"COKEOVEN",1,null,null,"Internal market deliveries (observed)","Coke oven coke","2021M09",{"$f":"VLOOKUP(I328, LanguageData, MATCH(LanguageChosen, Language[Language],0), FALSE)","v":"Coke oven coke"},{"$f":"VLOOKUP(H328, LanguageData, MATCH(LanguageChosen, Language[Language],0), FALSE)","v":"Internal market deliveries (observed)"},null,8]
["MAINPROD",null,null,"COKEOVEN",1,null,null,"Deliveries to main activity producers","Coke oven coke","2021M09",{"$f":"VLOOKUP(I329, LanguageData, MATCH(LanguageChosen, Language[Language],0), FALSE)","v":"Coke oven coke"},{"$f":"VLOOKUP(H329, LanguageData, MATCH(LanguageChosen, Language[Language],0), FALSE)","v":"Deliveries to main activity producers"},null,8]
["ECOKEOVS",null,null,"COKEOVEN",1,null,null,"Deliveries to coking plants","Coke oven coke","2021M09",{"$f":"VLOOKUP(I330, LanguageData, MATCH(LanguageChosen, Language[Language],0), FALSE)","v":"Coke oven coke"},{"$f":"VLOOKUP(H330, LanguageData, MATCH(LanguageChosen, Language[Language],0), FALSE)","v":"Deliveries to coking plants"},null,8]
["TOTIND",null,null,"COKEOVEN",1,null,null,"Deliveries to total industry","Coke oven coke","2021M09",{"$f":"VLOOKUP(I331, LanguageData, MATCH(LanguageChosen, Language[Language],0), FALSE)","v":"Coke oven coke"},{"$f":"VLOOKUP(H331, LanguageData, MATCH(LanguageChosen, Language[Language],0), FALSE)","v":"Deliveries to total industry"},null,8]
["IRONSTL",null,null,"COKEOVEN",1,null,null,"Deliveries to total industry of which to iron and steel industry","Coke oven coke","2021M09",{"$f":"VLOOKUP(I332, LanguageData, MATCH(LanguageChosen, Language[Language],0), FALSE)","v":"Coke oven coke"},{"$f":"VLOOKUP(H332, LanguageData, MATCH(LanguageChosen, Language[Language],0), FALSE)","v":"Deliveries to total industry of which to iron and steel industry"},null,8]
["OTHER",null,null,"COKEOVEN",1,null,null,"Other deliveries (services, households, …)","Coke oven coke","2021M09",{"$f":"VLOOKUP(I333, LanguageData, MATCH(LanguageChosen, Language[Language],0), FALSE)","v":"Coke oven coke"},{"$f":"VLOOKUP(H333, LanguageData, MATCH(LanguageChosen, Language[Language],0), FALSE)","v":"Other deliveries (services, households, …)"},null,8]
["INDPROD",null,null,"HARDCOAL",1,null,null,"Production ","Hard coal","2021M10",{"$f":"VLOOKUP(I334, LanguageData, MATCH(LanguageChosen, Language[Language],0), FALSE)","v":"Hard coal"},{"$f":"VLOOKUP(H334, LanguageData, MATCH(LanguageChosen, Language[Language],0), FALSE)","v":"Production "},null,7]
["OSOURCES",null,null,"HARDCOAL",1,null,null,"Recovered products","Hard coal",{"$f":"YEAR(DATE(LEFT($B$1,4),RIGHT($B$1,2)-N335,1)) & \"M\" & TEXT(MONTH(DATE(LEFT($B$1,4),RIGHT($B$1,2)-N335,1)),\"00\")","v":"2021M10"},{"$f":"VLOOKUP(I335, LanguageData, MATCH(LanguageChosen, Language[Language],0), FALSE)","v":"Hard coal"},{"$f":"VLOOKUP(H335, LanguageData, MATCH(LanguageChosen, Language[Language],0), FALSE)","v":"Recovered products"},null,7]
["TOTIMPSB",null,null,"HARDCOAL",1,null,null,"Total imports","Hard coal","2021M10",{"$f":"VLOOKUP(I336, LanguageData, MATCH(LanguageChosen, Language[Language],0), FALSE)","v":"Hard coal"},{"$f":"VLOOKUP(H336, LanguageData, MATCH(LanguageChosen, Language[Language],0), FALSE)","v":"Total imports"},null,7]
["TOTIMPSBEU",null,null,"HARDCOAL",1,null,null,"Imports: of which from outside EU","Hard coal","2021M10",{"$f":"VLOOKUP(I337, LanguageData, MATCH(LanguageChosen, Language[Language],0), FALSE)","v":"Hard coal"},{"$f":"VLOOKUP(H337, LanguageData, MATCH(LanguageChosen, Language[Language],0), FALSE)","v":"Imports: of which from outside EU"},null,7]
["TOTEXPSB",null,null,"HARDCOAL",1,null,null,"Total exports","Hard coal","2021M10",{"$f":"VLOOKUP(I338, LanguageData, MATCH(LanguageChosen, Language[Language],0), FALSE)","v":"Hard coal"},{"$f":"VLOOKUP(H338, LanguageData, MATCH(LanguageChosen, Language[Language],0), FALSE)","v":"Total exports"},null,7]
["STOCKSTART",null,null,"HARDCOAL",1,null,null,"Stocks - beginning of period","Hard coal","2021M10",{"$f":"VLOOKUP(I339, LanguageData, MATCH(LanguageChosen, Language[Language],0), FALSE)","v":"Hard coal"},{"$f":"VLOOKUP(H339, LanguageData, MATCH(LanguageChosen, Language[Language],0), FALSE)","v":"Stocks - beginning of period"},null,7]
["STOCKEND",null,null,"HARDCOAL",1,null,null,"Stocks - end of period","Hard coal","2021M10",{"$f":"VLOOKUP(I340, LanguageData, MATCH(LanguageChosen, Language[Language],0), FALSE)","v":"Hard coal"},{"$f":"VLOOKUP(H340, LanguageData, MATCH(LanguageChosen, Language[Language],0), FALSE)","v":"Stocks - end of period"},null,7]
["STCHANAT",null,null,"HARDCOAL",1,null,null,"Stock changes","Hard coal","2021M10",{"$f":"VLOOKUP(I341, LanguageData, MATCH(LanguageChosen, Language[Language],0), FALSE)","v":"Hard coal"},{"$f":"VLOOKUP(H341, LanguageData, MATCH(LanguageChosen, Language[Language],0), FALSE)","v":"Stock changes"},null,7]
["INDCONC",null,null,"HARDCOAL",1,null,null,"Calculated inland deliveries","Hard coal","2021M10",{"$f":"VLOOKUP(I342, LanguageData, MATCH(LanguageChosen, Language[Language],0), FALSE)","v":"Hard coal"},{"$f":"VLOOKUP(H342, LanguageData, MATCH(LanguageChosen, Language[Language],0), FALSE)","v":"Calculated inland deliveries"},null,7]
["STATDIFF",null,null,"HARDCOAL",1,null,null,"Statistical differences","Hard coal","2021M10",{"$f":"VLOOKUP(I343, LanguageData, MATCH(LanguageChosen, Language[Language],0), FALSE)","v":"Hard coal"},{"$f":"VLOOKUP(H343, LanguageData, MATCH(LanguageChosen, Language[Language],0), FALSE)","v":"Statistical differences"},null,7]
["INTERNAD",null,null,"HARDCOAL",1,null,null,"Internal market deliveries (observed)","Hard coal","2021M10",{"$f":"VLOOKUP(I344, LanguageData, MATCH(LanguageChosen, Language[Language],0), FALSE)","v":"Hard coal"},{"$f":"VLOOKUP(H344, LanguageData, MATCH(LanguageChosen, Language[Language],0), FALSE)","v":"Internal market deliveries (observed)"},null,7]
["MAINPROD",null,null,"HARDCOAL",1,null,null,"Deliveries to main activity producers","Hard coal","2021M10",{"$f":"VLOOKUP(I345, LanguageData, MATCH(LanguageChosen, Language[Language],0), FALSE)","v":"Hard coal"},{"$f":"VLOOKUP(H345, LanguageData, MATCH(LanguageChosen, Language[Language],0), FALSE)","v":"Deliveries to main activity producers"},null,7]
["ECOKEOVS",null,null,"HARDCOAL",1,null,null,"Deliveries to coking plants","Hard coal","2021M10",{"$f":"VLOOKUP(I346, LanguageData, MATCH(LanguageChosen, Language[Language],0), FALSE)","v":"Hard coal"},{"$f":"VLOOKUP(H346, LanguageData, MATCH(LanguageChosen, Language[Language],0), FALSE)","v":"Deliveries to coking plants"},null,7]
["TOTIND",null,null,"HARDCOAL",1,null,null,"Deliveries to total industry","Hard coal","2021M10",{"$f":"VLOOKUP(I347, LanguageData, MATCH(LanguageChosen, Language[Language],0), FALSE)","v":"Hard coal"},{"$f":"VLOOKUP(H347, LanguageData, MATCH(LanguageChosen, Language[Language],0), FALSE)","v":"Deliveries to total industry"},null,7]
["IRONSTL",null,null,"HARDCOAL",1,null,null,"Deliveries to total industry of which to iron and steel industry","Hard coal","2021M10",{"$f":"VLOOKUP(I348, LanguageData, MATCH(LanguageChosen, Language[Language],0), FALSE)","v":"Hard coal"},{"$f":"VLOOKUP(H348, LanguageData, MATCH(LanguageChosen, Language[Language],0), FALSE)","v":"Deliveries to total industry of which to iron and steel industry"},null,7]
["OTHER",null,null,"HARDCOAL",1,null,null,"Other deliveries (services, households, …)","Hard coal","2021M10",{"$f":"VLOOKUP(I349, LanguageData, MATCH(LanguageChosen, Language[Language],0), FALSE)","v":"Hard coal"},{"$f":"VLOOKUP(H349, LanguageData, MATCH(LanguageChosen, Language[Language],0), FALSE)","v":"Other deliveries (services, households, …)"},null,7]
["INDPROD",null,null,"BROWN",1,null,null,"Production ","Brown coal","2021M10",{"$f":"VLOOKUP(I350, LanguageData, MATCH(LanguageChosen, Language[Language],0), FALSE)","v":"Brown coal"},{"$f":"VLOOKUP(H350, LanguageData, MATCH(LanguageChosen, Language[Language],0), FALSE)","v":"Production "},null,7]
["OSOURCES",null,null,"BROWN",1,null,null,"Recovered products","Brown coal","2021M10",{"$f":"VLOOKUP(I351, LanguageData, MATCH(LanguageChosen, Language[Language],0), FALSE)","v":"Brown coal"},{"$f":"VLOOKUP(H351, LanguageData, MATCH(LanguageChosen, Language[Language],0), FALSE)","v":"Recovered products"},null,7]
["TOTIMPSB",null,null,"BROWN",1,null,null,"Total imports","Brown coal","2021M10",{"$f":"VLOOKUP(I352, LanguageData, MATCH(LanguageChosen, Language[Language],0), FALSE)","v":"Brown coal"},{"$f":"VLOOKUP(H352, LanguageData, MATCH(LanguageChosen, Language[Language],0), FALSE)","v":"Total imports"},null,7]
["TOTIMPSBEU",null,null,"BROWN",1,null,null,"Imports: of which from outside EU","Brown coal","2021M10",{"$f":"VLOOKUP(I353, LanguageData, MATCH(LanguageChosen, Language[Language],0), FALSE)","v":"Brown coal"},{"$f":"VLOOKUP(H353, LanguageData, MATCH(LanguageChosen, Language[Language],0), FALSE)","v":"Imports: of which from outside EU"},null,7]
["TOTEXPSB",null,null,"BROWN",1,null,null,"Total exports","Brown coal","2021M10",{"$f":"VLOOKUP(I354, LanguageData, MATCH(LanguageChosen, Language[Language],0), FALSE)","v":"Brown coal"},{"$f":"VLOOKUP(H354, LanguageData, MATCH(LanguageChosen, Language[Language],0), FALSE)","v":"Total exports"},null,7]
["STOCKSTART",null,null,"BROWN",1,null,null,"Stocks - beginning of period","Brown coal","2021M10",{"$f":"VLOOKUP(I355, LanguageData, MATCH(LanguageChosen, Language[Language],0), FALSE)","v":"Brown coal"},{"$f":"VLOOKUP(H355, LanguageData, MATCH(LanguageChosen, Language[Language],0), FALSE)","v":"Stocks - beginning of period"},null,7]
["STOCKEND",null,null,"BROWN",1,null,null,"Stocks - end of period","Brown coal","2021M10",{"$f":"VLOOKUP(I356, LanguageData, MATCH(LanguageChosen, Language[Language],0), FALSE)","v":"Brown coal"},{"$f":"VLOOKUP(H356, LanguageData, MATCH(LanguageChosen, Language[Language],0), FALSE)","v":"Stocks - end of period"},null,7]
["STCHANAT",null,null,"BROWN",1,null,null,"Stock changes","Brown coal","2021M10",{"$f":"VLOOKUP(I357, LanguageData, MATCH(LanguageChosen, Language[Language],0), FALSE)","v":"Brown coal"},{"$f":"VLOOKUP(H357, LanguageData, MATCH(LanguageChosen, Language[Language],0), FALSE)","v":"Stock changes"},null,7]
["INDCONC",null,null,"BROWN",1,null,null,"Calculated inland deliveries","Brown coal","2021M10",{"$f":"VLOOKUP(I358, LanguageData, MATCH(LanguageChosen, Language[Language],0), FALSE)","v":"Brown coal"},{"$f":"VLOOKUP(H358, LanguageData, MATCH(LanguageChosen, Language[Language],0), FALSE)","v":"Calculated inland deliveries"},null,7]
["STATDIFF",null,null,"BROWN",1,null,null,"Statistical differences","Brown coal","2021M10",{"$f":"VLOOKUP(I359, LanguageData, MATCH(LanguageChosen, Language[Language],0), FALSE)","v":"Brown coal"},{"$f":"VLOOKUP(H359, LanguageData, MATCH(LanguageChosen, Language[Language],0), FALSE)","v":"Statistical differences"},null,7]
["INTERNAD",null,null,"BROWN",1,null,null,"Internal market deliveries (observed)","Brown coal","2021M10",{"$f":"VLOOKUP(I360, LanguageData, MATCH(LanguageChosen, Language[Language],0), FALSE)","v":"Brown coal"},{"$f":"VLOOKUP(H360, LanguageData, MATCH(LanguageChosen, Language[Language],0), FALSE)","v":"Internal market deliveries (observed)"},null,7]
["MAINPROD",null,null,"BROWN",1,null,null,"Deliveries to main activity producers","Brown coal","2021M10",{"$f":"VLOOKUP(I361, LanguageData, MATCH(LanguageChosen, Language[Language],0), FALSE)","v":"Brown coal"},{"$f":"VLOOKUP(H361, LanguageData, MATCH(LanguageChosen, Language[Language],0), FALSE)","v":"Deliveries to main activity producers"},null,7]
["ECOKEOVS",null,null,"BROWN",1,null,null,"Deliveries to coking plants","Brown coal","2021M10",{"$f":"VLOOKUP(I362, LanguageData, MATCH(LanguageChosen, Language[Language],0), FALSE)","v":"Brown coal"},{"$f":"VLOOKUP(H362, LanguageData, MATCH(LanguageChosen, Language[Language],0), FALSE)","v":"Deliveries to coking plants"},null,7]
["TOTIND",null,null,"BROWN",1,null,null,"Deliveries to total industry","Brown coal","2021M10",{"$f":"VLOOKUP(I363, LanguageData, MATCH(LanguageChosen, Language[Language],0), FALSE)","v":"Brown coal"},{"$f":"VLOOKUP(H363, LanguageData, MATCH(LanguageChosen, Language[Language],0), FALSE)","v":"Deliveries to total industry"},null,7]
["IRONSTL",null,null,"BROWN",1,null,null,"Deliveries to total industry of which to iron and steel industry","Brown coal","2021M10",{"$f":"VLOOKUP(I364, LanguageData, MATCH(LanguageChosen, Language[Language],0), FALSE)","v":"Brown coal"},{"$f":"VLOOKUP(H364, LanguageData, MATCH(LanguageChosen, Language[Language],0), FALSE)","v":"Deliveries to total industry of which to iron and steel industry"},null,7]
["OTHER",null,null,"BROWN",1,null,null,"Other deliveries (services, households, …)","Brown coal","2021M10",{"$f":"VLOOKUP(I365, LanguageData, MATCH(LanguageChosen, Language[Language],0), FALSE)","v":"Brown coal"},{"$f":"VLOOKUP(H365, LanguageData, MATCH(LanguageChosen, Language[Language],0), FALSE)","v":"Other deliveries (services, households, …)"},null,7]
["INDPROD",null,null,"PEAT",1,null,null,"Production ","Peat","2021M10",{"$f":"VLOOKUP(I366, LanguageData, MATCH(LanguageChosen, Language[Language],0), FALSE)","v":"Peat"},{"$f":"VLOOKUP(H366, LanguageData, MATCH(LanguageChosen, Language[Language],0), FALSE)","v":"Production "},null,7]
["OSOURCES",null,null,"PEAT",1,null,null,"Recovered products","Peat","2021M10",{"$f":"VLOOKUP(I367, LanguageData, MATCH(LanguageChosen, Language[Language],0), FALSE)","v":"Peat"},{"$f":"VLOOKUP(H367, LanguageData, MATCH(LanguageChosen, Language[Language],0), FALSE)","v":"Recovered products"},null,7]
["TOTIMPSB",null,null,"PEAT",1,null,null,"Total imports","Peat","2021M10",{"$f":"VLOOKUP(I368, LanguageData, MATCH(LanguageChosen, Language[Language],0), FALSE)","v":"Peat"},{"$f":"VLOOKUP(H368, LanguageData, MATCH(LanguageChosen, Language[Language],0), FALSE)","v":"Total imports"},null,7]
["TOTIMPSBEU",null,null,"PEAT",1,null,null,"Imports: of which from outside EU","Peat","2021M10",{"$f":"VLOOKUP(I369, LanguageData, MATCH(LanguageChosen, Language[Language],0), FALSE)","v":"Peat"},{"$f":"VLOOKUP(H369, LanguageData, MATCH(LanguageChosen, Language[Language],0), FALSE)","v":"Imports: of which from outside EU"},null,7]
["TOTEXPSB",null,null,"PEAT",1,null,null,"Total exports","Peat","2021M10",{"$f":"VLOOKUP(I370, LanguageData, MATCH(LanguageChosen, Language[Language],0), FALSE)","v":"Peat"},{"$f":"VLOOKUP(H370, LanguageData, MATCH(LanguageChosen, Language[Language],0), FALSE)","v":"Total exports"},null,7]
["STOCKSTART",null,null,"PEAT",1,null,null,"Stocks - beginning of period","Peat","2021M10",{"$f":"VLOOKUP(I371, LanguageData, MATCH(LanguageChosen, Language[Language],0), FALSE)","v":"Peat"},{"$f":"VLOOKUP(H371, LanguageData, MATCH(LanguageChosen, Language[Language],0), FALSE)","v":"Stocks - beginning of period"},null,7]
["STOCKEND",null,null,"PEAT",1,null,null,"Stocks - end of period","Peat","2021M10",{"$f":"VLOOKUP(I372, LanguageData, MATCH(LanguageChosen, Language[Language],0), FALSE)","v":"Peat"},{"$f":"VLOOKUP(H372, LanguageData, MATCH(LanguageChosen, Language[Language],0), FALSE)","v":"Stocks - end of period"},null,7]
["STCHANAT",null,null,"PEAT",1,null,null,"Stock changes","Peat","2021M10",{"$f":"VLOOKUP(I373, LanguageData, MATCH(LanguageChosen, Language[Language],0), FALSE)","v":"Peat"},{"$f":"VLOOKUP(H373, LanguageData, MATCH(LanguageChosen, Language[Language],0), FALSE)","v":"Stock changes"},null,7]
["INDCONC",null,null,"PEAT",1,null,null,"Calculated inland deliveries","Peat","2021M10",{"$f":"VLOOKUP(I374, LanguageData, MATCH(LanguageChosen, Language[Language],0), FALSE)","v":"Peat"},{"$f":"VLOOKUP(H374, LanguageData, MATCH(LanguageChosen, Language[Language],0), FALSE)","v":"Calculated inland deliveries"},null,7]
["STATDIFF",null,null,"PEAT",1,null,null,"Statistical differences","Peat","2021M10",{"$f":"VLOOKUP(I375, LanguageData, MATCH(LanguageChosen, Language[Language],0), FALSE)","v":"Peat"},{"$f":"VLOOKUP(H375, LanguageData, MATCH(LanguageChosen, Language[Language],0), FALSE)","v":"Statistical differences"},null,7]
["INTERNAD",null,null,"PEAT",1,null,null,"Internal market deliveries (observed)","Peat","2021M10",{"$f":"VLOOKUP(I376, LanguageData, MATCH(LanguageChosen, Language[Language],0), FALSE)","v":"Peat"},{"$f":"VLOOKUP(H376, LanguageData, MATCH(LanguageChosen, Language[Language],0), FALSE)","v":"Internal market deliveries (observed)"},null,7]
["MAINPROD",null,null,"PEAT",1,null,null,"Deliveries to main activity producers","Peat","2021M10",{"$f":"VLOOKUP(I377, LanguageData, MATCH(LanguageChosen, Language[Language],0), FALSE)","v":"Peat"},{"$f":"VLOOKUP(H377, LanguageData, MATCH(LanguageChosen, Language[Language],0), FALSE)","v":"Deliveries to main activity producers"},null,7]
["ECOKEOVS",null,null,"PEAT",1,null,null,"Deliveries to coking plants","Peat","2021M10",{"$f":"VLOOKUP(I378, LanguageData, MATCH(LanguageChosen, Language[Language],0), FALSE)","v":"Peat"},{"$f":"VLOOKUP(H378, LanguageData, MATCH(LanguageChosen, Language[Language],0), FALSE)","v":"Deliveries to coking plants"},null,7]
["TOTIND",null,null,"PEAT",1,null,null,"Deliveries to total industry","Peat","2021M10",{"$f":"VLOOKUP(I379, LanguageData, MATCH(LanguageChosen, Language[Language],0), FALSE)","v":"Peat"},{"$f":"VLOOKUP(H379, LanguageData, MATCH(LanguageChosen, Language[Language],0), FALSE)","v":"Deliveries to total industry"},null,7]
["IRONSTL",null,null,"PEAT",1,null,null,"Deliveries to total industry of which to iron and steel industry","Peat","2021M10",{"$f":"VLOOKUP(I380, LanguageData, MATCH(LanguageChosen, Language[Language],0), FALSE)","v":"Peat"},{"$f":"VLOOKUP(H380, LanguageData, MATCH(LanguageChosen, Language[Language],0), FALSE)","v":"Deliveries to total industry of which to iron and steel industry"},null,7]
["OTHER",null,null,"PEAT",1,null,null,"Other deliveries (services, households, …)","Peat","2021M10",{"$f":"VLOOKUP(I381, LanguageData, MATCH(LanguageChosen, Language[Language],0), FALSE)","v":"Peat"},{"$f":"VLOOKUP(H381, LanguageData, MATCH(LanguageChosen, Language[Language],0), FALSE)","v":"Other deliveries (services, households, …)"},null,7]
["INDPROD",null,null,"OILSHALE",1,null,null,"Production ","Oil shale and oil sands","2021M10",{"$f":"VLOOKUP(I382, LanguageData, MATCH(LanguageChosen, Language[Language],0), FALSE)","v":"Oil shale and oil sands"},{"$f":"VLOOKUP(H382, LanguageData, MATCH(LanguageChosen, Language[Language],0), FALSE)","v":"Production "},null,7]
["OSOURCES",null,null,"OILSHALE",1,null,null,"Recovered products","Oil shale and oil sands","2021M10",{"$f":"VLOOKUP(I383, LanguageData, MATCH(LanguageChosen, Language[Language],0), FALSE)","v":"Oil shale and oil sands"},{"$f":"VLOOKUP(H383, LanguageData, MATCH(LanguageChosen, Language[Language],0), FALSE)","v":"Recovered products"},null,7]
["TOTIMPSB",null,null,"OILSHALE",1,null,null,"Total imports","Oil shale and oil sands","2021M10",{"$f":"VLOOKUP(I384, LanguageData, MATCH(LanguageChosen, Language[Language],0), FALSE)","v":"Oil shale and oil sands"},{"$f":"VLOOKUP(H384, LanguageData, MATCH(LanguageChosen, Language[Language],0), FALSE)","v":"Total imports"},null,7]
["TOTIMPSBEU",null,null,"OILSHALE",1,null,null,"Imports: of which from outside EU","Oil shale and oil sands","2021M10",{"$f":"VLOOKUP(I385, LanguageData, MATCH(LanguageChosen, Language[Language],0), FALSE)","v":"Oil shale and oil sands"},{"$f":"VLOOKUP(H385, LanguageData, MATCH(LanguageChosen, Language[Language],0), FALSE)","v":"Imports: of which from outside EU"},null,7]
["TOTEXPSB",null,null,"OILSHALE",1,null,null,"Total exports","Oil shale and oil sands","2021M10",{"$f":"VLOOKUP(I386, LanguageData, MATCH(LanguageChosen, Language[Language],0), FALSE)","v":"Oil shale and oil sands"},{"$f":"VLOOKUP(H386, LanguageData, MATCH(LanguageChosen, Language[Language],0), FALSE)","v":"Total exports"},null,7]
["STOCKSTART",null,null,"OILSHALE",1,null,null,"Stocks - beginning of period","Oil shale and oil sands","2021M10",{"$f":"VLOOKUP(I387, LanguageData, MATCH(LanguageChosen, Language[Language],0), FALSE)","v":"Oil shale and oil sands"},{"$f":"VLOOKUP(H387, LanguageData, MATCH(LanguageChosen, Language[Language],0), FALSE)","v":"Stocks - beginning of period"},null,7]
["STOCKEND",null,null,"OILSHALE",1,null,null,"Stocks - end of period","Oil shale and oil sands","2021M10",{"$f":"VLOOKUP(I388, LanguageData, MATCH(LanguageChosen, Language[Language],0), FALSE)","v":"Oil shale and oil sands"},{"$f":"VLOOKUP(H388, LanguageData, MATCH(LanguageChosen, Language[Language],0), FALSE)","v":"Stocks - end of period"},null,7]
["STCHANAT",null,null,"OILSHALE",1,null,null,"Stock changes","Oil shale and oil sands","2021M10",{"$f":"VLOOKUP(I389, LanguageData, MATCH(LanguageChosen, Language[Language],0), FALSE)","v":"Oil shale and oil sands"},{"$f":"VLOOKUP(H389, LanguageData, MATCH(LanguageChosen, Language[Language],0), FALSE)","v":"Stock changes"},null,7]
["INDCONC",null,null,"OILSHALE",1,null,null,"Calculated inland deliveries","Oil shale and oil sands","2021M10",{"$f":"VLOOKUP(I390, LanguageData, MATCH(LanguageChosen, Language[Language],0), FALSE)","v":"Oil shale and oil sands"},{"$f":"VLOOKUP(H390, LanguageData, MATCH(LanguageChosen, Language[Language],0), FALSE)","v":"Calculated inland deliveries"},null,7]
["STATDIFF",null,null,"OILSHALE",1,null,null,"Statistical differences","Oil shale and oil sands","2021M10",{"$f":"VLOOKUP(I391, LanguageData, MATCH(LanguageChosen, Language[Language],0), FALSE)","v":"Oil shale and oil sands"},{"$f":"VLOOKUP(H391, LanguageData, MATCH(LanguageChosen, Language[Language],0), FALSE)","v":"Statistical differences"},null,7]
["INTERNAD",null,null,"OILSHALE",1,null,null,"Internal market deliveries (observed)","Oil shale and oil sands","2021M10",{"$f":"VLOOKUP(I392, LanguageData, MATCH(LanguageChosen, Language[Language],0), FALSE)","v":"Oil shale and oil sands"},{"$f":"VLOOKUP(H392, LanguageData, MATCH(LanguageChosen, Language[Language],0), FALSE)","v":"Internal market deliveries (observed)"},null,7]
["MAINPROD",null,null,"OILSHALE",1,null,null,"Deliveries to main activity producers","Oil shale and oil sands","2021M10",{"$f":"VLOOKUP(I393, LanguageData, MATCH(LanguageChosen, Language[Language],0), FALSE)","v":"Oil shale and oil sands"},{"$f":"VLOOKUP(H393, LanguageData, MATCH(LanguageChosen, Language[Language],0), FALSE)","v":"Deliveries to main activity producers"},null,7]
["ECOKEOVS",null,null,"OILSHALE",1,null,null,"Deliveries to coking plants","Oil shale and oil sands","2021M10",{"$f":"VLOOKUP(I394, LanguageData, MATCH(LanguageChosen, Language[Language],0), FALSE)","v":"Oil shale and oil sands"},{"$f":"VLOOKUP(H394, LanguageData, MATCH(LanguageChosen, Language[Language],0), FALSE)","v":"Deliveries to coking plants"},null,7]
["TOTIND",null,null,"OILSHALE",1,null,null,"Deliveries to total industry","Oil shale and oil sands","2021M10",{"$f":"VLOOKUP(I395, LanguageData, MATCH(LanguageChosen, Language[Language],0), FALSE)","v":"Oil shale and oil sands"},{"$f":"VLOOKUP(H395, LanguageData, MATCH(LanguageChosen, Language[Language],0), FALSE)","v":"Deliveries to total industry"},null,7]
["IRONSTL",null,null,"OILSHALE",1,null,null,"Deliveries to total industry of which to iron and steel industry","Oil shale and oil sands","2021M10",{"$f":"VLOOKUP(I396, LanguageData, MATCH(LanguageChosen, Language[Language],0), FALSE)","v":"Oil shale and oil sands"},{"$f":"VLOOKUP(H396, LanguageData, MATCH(LanguageChosen, Language[Language],0), FALSE)","v":"Deliveries to total industry of which to iron and steel industry"},null,7]
["OTHER",null,null,"OILSHALE",1,null,null,"Other deliveries (services, households, …)","Oil shale and oil sands","2021M10",{"$f":"VLOOKUP(I397, LanguageData, MATCH(LanguageChosen, Language[Language],0), FALSE)","v":"Oil shale and oil sands"},{"$f":"VLOOKUP(H397, LanguageData, MATCH(LanguageChosen, Language[Language],0), FALSE)","v":"Other deliveries (services, households, …)"},null,7]
["INDPROD",null,null,"COKEOVEN",1,null,null,"Production ","Coke oven coke","2021M10",{"$f":"VLOOKUP(I398, LanguageData, MATCH(LanguageChosen, Language[Language],0), FALSE)","v":"Coke oven coke"},{"$f":"VLOOKUP(H398, LanguageData, MATCH(LanguageChosen, Language[Language],0), FALSE)","v":"Production "},null,7]
["OSOURCES",null,null,"COKEOVEN",1,null,null,"Recovered products","Coke oven coke",{"$f":"YEAR(DATE(LEFT($B$1,4),RIGHT($B$1,2)-N399,1)) & \"M\" & TEXT(MONTH(DATE(LEFT($B$1,4),RIGHT($B$1,2)-N399,1)),\"00\")","v":"2021M10"},{"$f":"VLOOKUP(I399, LanguageData, MATCH(LanguageChosen, Language[Language],0), FALSE)","v":"Coke oven coke"},{"$f":"VLOOKUP(H399, LanguageData, MATCH(LanguageChosen, Language[Language],0), FALSE)","v":"Recovered products"},null,7]
["TOTIMPSB",null,null,"COKEOVEN",1,null,null,"Total imports","Coke oven coke","2021M10",{"$f":"VLOOKUP(I400, LanguageData, MATCH(LanguageChosen, Language[Language],0), FALSE)","v":"Coke oven coke"},{"$f":"VLOOKUP(H400, LanguageData, MATCH(LanguageChosen, Language[Language],0), FALSE)","v":"Total imports"},null,7]
["TOTIMPSBEU",null,null,"COKEOVEN",1,null,null,"Imports: of which from outside EU","Coke oven coke","2021M10",{"$f":"VLOOKUP(I401, LanguageData, MATCH(LanguageChosen, Language[Language],0), FALSE)","v":"Coke oven coke"},{"$f":"VLOOKUP(H401, LanguageData, MATCH(LanguageChosen, Language[Language],0), FALSE)","v":"Imports: of which from outside EU"},null,7]
["TOTEXPSB",null,null,"COKEOVEN",1,null,null,"Total exports","Coke oven coke","2021M10",{"$f":"VLOOKUP(I402, LanguageData, MATCH(LanguageChosen, Language[Language],0), FALSE)","v":"Coke oven coke"},{"$f":"VLOOKUP(H402, LanguageData, MATCH(LanguageChosen, Language[Language],0), FALSE)","v":"Total exports"},null,7]
["STOCKSTART",null,null,"COKEOVEN",1,null,null,"Stocks - beginning of period","Coke oven coke","2021M10",{"$f":"VLOOKUP(I403, LanguageData, MATCH(LanguageChosen, Language[Language],0), FALSE)","v":"Coke oven coke"},{"$f":"VLOOKUP(H403, LanguageData, MATCH(LanguageChosen, Language[Language],0), FALSE)","v":"Stocks - beginning of period"},null,7]
["STOCKEND",null,null,"COKEOVEN",1,null,null,"Stocks - end of period","Coke oven coke","2021M10",{"$f":"VLOOKUP(I404, LanguageData, MATCH(LanguageChosen, Language[Language],0), FALSE)","v":"Coke oven coke"},{"$f":"VLOOKUP(H404, LanguageData, MATCH(LanguageChosen, Language[Language],0), FALSE)","v":"Stocks - end of period"},null,7]
["STCHANAT",null,null,"COKEOVEN",1,null,null,"Stock changes","Coke oven coke","2021M10",{"$f":"VLOOKUP(I405, LanguageData, MATCH(LanguageChosen, Language[Language],0), FALSE)","v":"Coke oven coke"},{"$f":"VLOOKUP(H405, LanguageData, MATCH(LanguageChosen, Language[Language],0), FALSE)","v":"Stock changes"},null,7]
["INDCONC",null,null,"COKEOVEN",1,null,null,"Calculated inland deliveries","Coke oven coke","2021M10",{"$f":"VLOOKUP(I406, LanguageData, MATCH(LanguageChosen, Language[Language],0), FALSE)","v":"Coke oven coke"},{"$f":"VLOOKUP(H406, LanguageData, MATCH(LanguageChosen, Language[Language],0), FALSE)","v":"Calculated inland deliveries"},null,7]
["STATDIFF",null,null,"COKEOVEN",1,null,null,"Statistical differences","Coke oven coke","2021M10",{"$f":"VLOOKUP(I407, LanguageData, MATCH(LanguageChosen, Language[Language],0), FALSE)","v":"Coke oven coke"},{"$f":"VLOOKUP(H407, LanguageData, MATCH(LanguageChosen, Language[Language],0), FALSE)","v":"Statistical differences"},null,7]
["INTERNAD",null,null,"COKEOVEN",1,null,null,"Internal market deliveries (observed)","Coke oven coke","2021M10",{"$f":"VLOOKUP(I408, LanguageData, MATCH(LanguageChosen, Language[Language],0), FALSE)","v":"Coke oven coke"},{"$f":"VLOOKUP(H408, LanguageData, MATCH(LanguageChosen, Language[Language],0), FALSE)","v":"Internal market deliveries (observed)"},null,7]
["MAINPROD",null,null,"COKEOVEN",1,null,null,"Deliveries to main activity producers","Coke oven coke","2021M10",{"$f":"VLOOKUP(I409, LanguageData, MATCH(LanguageChosen, Language[Language],0), FALSE)","v":"Coke oven coke"},{"$f":"VLOOKUP(H409, LanguageData, MATCH(LanguageChosen, Language[Language],0), FALSE)","v":"Deliveries to main activity producers"},null,7]
["ECOKEOVS",null,null,"COKEOVEN",1,null,null,"Deliveries to coking plants","Coke oven coke","2021M10",{"$f":"VLOOKUP(I410, LanguageData, MATCH(LanguageChosen, Language[Language],0), FALSE)","v":"Coke oven coke"},{"$f":"VLOOKUP(H410, LanguageData, MATCH(LanguageChosen, Language[Language],0), FALSE)","v":"Deliveries to coking plants"},null,7]
["TOTIND",null,null,"COKEOVEN",1,null,null,"Deliveries to total industry","Coke oven coke","2021M10",{"$f":"VLOOKUP(I411, LanguageData, MATCH(LanguageChosen, Language[Language],0), FALSE)","v":"Coke oven coke"},{"$f":"VLOOKUP(H411, LanguageData, MATCH(LanguageChosen, Language[Language],0), FALSE)","v":"Deliveries to total industry"},null,7]
["IRONSTL",null,null,"COKEOVEN",1,null,null,"Deliveries to total industry of which to iron and steel industry","Coke oven coke","2021M10",{"$f":"VLOOKUP(I412, LanguageData, MATCH(LanguageChosen, Language[Language],0), FALSE)","v":"Coke oven coke"},{"$f":"VLOOKUP(H412, LanguageData, MATCH(LanguageChosen, Language[Language],0), FALSE)","v":"Deliveries to total industry of which to iron and steel industry"},null,7]
["OTHER",null,null,"COKEOVEN",1,null,null,"Other deliveries (services, households, …)","Coke oven coke","2021M10",{"$f":"VLOOKUP(I413, LanguageData, MATCH(LanguageChosen, Language[Language],0), FALSE)","v":"Coke oven coke"},{"$f":"VLOOKUP(H413, LanguageData, MATCH(LanguageChosen, Language[Language],0), FALSE)","v":"Other deliveries (services, households, …)"},null,7]
["INDPROD",null,null,"HARDCOAL",1,null,null,"Production ","Hard coal","2021M11",{"$f":"VLOOKUP(I414, LanguageData, MATCH(LanguageChosen, Language[Language],0), FALSE)","v":"Hard coal"},{"$f":"VLOOKUP(H414, LanguageData, MATCH(LanguageChosen, Language[Language],0), FALSE)","v":"Production "},null,6]
["OSOURCES",null,null,"HARDCOAL",1,null,null,"Recovered products","Hard coal","2021M11",{"$f":"VLOOKUP(I415, LanguageData, MATCH(LanguageChosen, Language[Language],0), FALSE)","v":"Hard coal"},{"$f":"VLOOKUP(H415, LanguageData, MATCH(LanguageChosen, Language[Language],0), FALSE)","v":"Recovered products"},null,6]
["TOTIMPSB",null,null,"HARDCOAL",1,null,null,"Total imports","Hard coal","2021M11",{"$f":"VLOOKUP(I416, LanguageData, MATCH(LanguageChosen, Language[Language],0), FALSE)","v":"Hard coal"},{"$f":"VLOOKUP(H416, LanguageData, MATCH(LanguageChosen, Language[Language],0), FALSE)","v":"Total imports"},null,6]
["TOTIMPSBEU",null,null,"HARDCOAL",1,null,null,"Imports: of which from outside EU","Hard coal","2021M11",{"$f":"VLOOKUP(I417, LanguageData, MATCH(LanguageChosen, Language[Language],0), FALSE)","v":"Hard coal"},{"$f":"VLOOKUP(H417, LanguageData, MATCH(LanguageChosen, Language[Language],0), FALSE)","v":"Imports: of which from outside EU"},null,6]
["TOTEXPSB",null,null,"HARDCOAL",1,null,null,"Total exports","Hard coal","2021M11",{"$f":"VLOOKUP(I418, LanguageData, MATCH(LanguageChosen, Language[Language],0), FALSE)","v":"Hard coal"},{"$f":"VLOOKUP(H418, LanguageData, MATCH(LanguageChosen, Language[Language],0), FALSE)","v":"Total exports"},null,6]
["STOCKSTART",null,null,"HARDCOAL",1,null,null,"Stocks - beginning of period","Hard coal","2021M11",{"$f":"VLOOKUP(I419, LanguageData, MATCH(LanguageChosen, Language[Language],0), FALSE)","v":"Hard coal"},{"$f":"VLOOKUP(H419, LanguageData, MATCH(LanguageChosen, Language[Language],0), FALSE)","v":"Stocks - beginning of period"},null,6]
["STOCKEND",null,null,"HARDCOAL",1,null,null,"Stocks - end of period","Hard coal","2021M11",{"$f":"VLOOKUP(I420, LanguageData, MATCH(LanguageChosen, Language[Language],0), FALSE)","v":"Hard coal"},{"$f":"VLOOKUP(H420, LanguageData, MATCH(LanguageChosen, Language[Language],0), FALSE)","v":"Stocks - end of period"},null,6]
["STCHANAT",null,null,"HARDCOAL",1,null,null,"Stock changes","Hard coal","2021M11",{"$f":"VLOOKUP(I421, LanguageData, MATCH(LanguageChosen, Language[Language],0), FALSE)","v":"Hard coal"},{"$f":"VLOOKUP(H421, LanguageData, MATCH(LanguageChosen, Language[Language],0), FALSE)","v":"Stock changes"},null,6]
["INDCONC",null,null,"HARDCOAL",1,null,null,"Calculated inland deliveries","Hard coal","2021M11",{"$f":"VLOOKUP(I422, LanguageData, MATCH(LanguageChosen, Language[Language],0), FALSE)","v":"Hard coal"},{"$f":"VLOOKUP(H422, LanguageData, MATCH(LanguageChosen, Language[Language],0), FALSE)","v":"Calculated inland deliveries"},null,6]
["STATDIFF",null,null,"HARDCOAL",1,null,null,"Statistical differences","Hard coal","2021M11",{"$f":"VLOOKUP(I423, LanguageData, MATCH(LanguageChosen, Language[Language],0), FALSE)","v":"Hard coal"},{"$f":"VLOOKUP(H423, LanguageData, MATCH(LanguageChosen, Language[Language],0), FALSE)","v":"Statistical differences"},null,6]
["INTERNAD",null,null,"HARDCOAL",1,null,null,"Internal market deliveries (observed)","Hard coal","2021M11",{"$f":"VLOOKUP(I424, LanguageData, MATCH(LanguageChosen, Language[Language],0), FALSE)","v":"Hard coal"},{"$f":"VLOOKUP(H424, LanguageData, MATCH(LanguageChosen, Language[Language],0), FALSE)","v":"Internal market deliveries (observed)"},null,6]
["MAINPROD",null,null,"HARDCOAL",1,null,null,"Deliveries to main activity producers","Hard coal","2021M11",{"$f":"VLOOKUP(I425, LanguageData, MATCH(LanguageChosen, Language[Language],0), FALSE)","v":"Hard coal"},{"$f":"VLOOKUP(H425, LanguageData, MATCH(LanguageChosen, Language[Language],0), FALSE)","v":"Deliveries to main activity producers"},null,6]
["ECOKEOVS",null,null,"HARDCOAL",1,null,null,"Deliveries to coking plants","Hard coal","2021M11",{"$f":"VLOOKUP(I426, LanguageData, MATCH(LanguageChosen, Language[Language],0), FALSE)","v":"Hard coal"},{"$f":"VLOOKUP(H426, LanguageData, MATCH(LanguageChosen, Language[Language],0), FALSE)","v":"Deliveries to coking plants"},null,6]
["TOTIND",null,null,"HARDCOAL",1,null,null,"Deliveries to total industry","Hard coal","2021M11",{"$f":"VLOOKUP(I427, LanguageData, MATCH(LanguageChosen, Language[Language],0), FALSE)","v":"Hard coal"},{"$f":"VLOOKUP(H427, LanguageData, MATCH(LanguageChosen, Language[Language],0), FALSE)","v":"Deliveries to total industry"},null,6]
["IRONSTL",null,null,"HARDCOAL",1,null,null,"Deliveries to total industry of which to iron and steel industry","Hard coal","2021M11",{"$f":"VLOOKUP(I428, LanguageData, MATCH(LanguageChosen, Language[Language],0), FALSE)","v":"Hard coal"},{"$f":"VLOOKUP(H428, LanguageData, MATCH(LanguageChosen, Language[Language],0), FALSE)","v":"Deliveries to total industry of which to iron and steel industry"},null,6]
["OTHER",null,null,"HARDCOAL",1,null,null,"Other deliveries (services, households, …)","Hard coal","2021M11",{"$f":"VLOOKUP(I429, LanguageData, MATCH(LanguageChosen, Language[Language],0), FALSE)","v":"Hard coal"},{"$f":"VLOOKUP(H429, LanguageData, MATCH(LanguageChosen, Language[Language],0), FALSE)","v":"Other deliveries (services, households, …)"},null,6]
["INDPROD",null,null,"BROWN",1,null,null,"Production ","Brown coal","2021M11",{"$f":"VLOOKUP(I430, LanguageData, MATCH(LanguageChosen, Language[Language],0), FALSE)","v":"Brown coal"},{"$f":"VLOOKUP(H430, LanguageData, MATCH(LanguageChosen, Language[Language],0), FALSE)","v":"Production "},null,6]
["OSOURCES",null,null,"BROWN",1,null,null,"Recovered products","Brown coal","2021M11",{"$f":"VLOOKUP(I431, LanguageData, MATCH(LanguageChosen, Language[Language],0), FALSE)","v":"Brown coal"},{"$f":"VLOOKUP(H431, LanguageData, MATCH(LanguageChosen, Language[Language],0), FALSE)","v":"Recovered products"},null,6]
["TOTIMPSB",null,null,"BROWN",1,null,null,"Total imports","Brown coal","2021M11",{"$f":"VLOOKUP(I432, LanguageData, MATCH(LanguageChosen, Language[Language],0), FALSE)","v":"Brown coal"},{"$f":"VLOOKUP(H432, LanguageData, MATCH(LanguageChosen, Language[Language],0), FALSE)","v":"Total imports"},null,6]
["TOTIMPSBEU",null,null,"BROWN",1,null,null,"Imports: of which from outside EU","Brown coal","2021M11",{"$f":"VLOOKUP(I433, LanguageData, MATCH(LanguageChosen, Language[Language],0), FALSE)","v":"Brown coal"},{"$f":"VLOOKUP(H433, LanguageData, MATCH(LanguageChosen, Language[Language],0), FALSE)","v":"Imports: of which from outside EU"},null,6]
["TOTEXPSB",null,null,"BROWN",1,null,null,"Total exports","Brown coal","2021M11",{"$f":"VLOOKUP(I434, LanguageData, MATCH(LanguageChosen, Language[Language],0), FALSE)","v":"Brown coal"},{"$f":"VLOOKUP(H434, LanguageData, MATCH(LanguageChosen, Language[Language],0), FALSE)","v":"Total exports"},null,6]
["STOCKSTART",null,null,"BROWN",1,null,null,"Stocks - beginning of period","Brown coal","2021M11",{"$f":"VLOOKUP(I435, LanguageData, MATCH(LanguageChosen, Language[Language],0), FALSE)","v":"Brown coal"},{"$f":"VLOOKUP(H435, LanguageData, MATCH(LanguageChosen, Language[Language],0), FALSE)","v":"Stocks - beginning of period"},null,6]
["STOCKEND",null,null,"BROWN",1,null,null,"Stocks - end of period","Brown coal","2021M11",{"$f":"VLOOKUP(I436, LanguageData, MATCH(LanguageChosen, Language[Language],0), FALSE)","v":"Brown coal"},{"$f":"VLOOKUP(H436, LanguageData, MATCH(LanguageChosen, Language[Language],0), FALSE)","v":"Stocks - end of period"},null,6]
["STCHANAT",null,null,"BROWN",1,null,null,"Stock changes","Brown coal","2021M11",{"$f":"VLOOKUP(I437, LanguageData, MATCH(LanguageChosen, Language[Language],0), FALSE)","v":"Brown coal"},{"$f":"VLOOKUP(H437, LanguageData, MATCH(LanguageChosen, Language[Language],0), FALSE)","v":"Stock changes"},null,6]
["INDCONC",null,null,"BROWN",1,null,null,"Calculated inland deliveries","Brown coal","2021M11",{"$f":"VLOOKUP(I438, LanguageData, MATCH(LanguageChosen, Language[Language],0), FALSE)","v":"Brown coal"},{"$f":"VLOOKUP(H438, LanguageData, MATCH(LanguageChosen, Language[Language],0), FALSE)","v":"Calculated inland deliveries"},null,6]
["STATDIFF",null,null,"BROWN",1,null,null,"Statistical differences","Brown coal","2021M11",{"$f":"VLOOKUP(I439, LanguageData, MATCH(LanguageChosen, Language[Language],0), FALSE)","v":"Brown coal"},{"$f":"VLOOKUP(H439, LanguageData, MATCH(LanguageChosen, Language[Language],0), FALSE)","v":"Statistical differences"},null,6]
["INTERNAD",null,null,"BROWN",1,null,null,"Internal market deliveries (observed)","Brown coal","2021M11",{"$f":"VLOOKUP(I440, LanguageData, MATCH(LanguageChosen, Language[Language],0), FALSE)","v":"Brown coal"},{"$f":"VLOOKUP(H440, LanguageData, MATCH(LanguageChosen, Language[Language],0), FALSE)","v":"Internal market deliveries (observed)"},null,6]
["MAINPROD",null,null,"BROWN",1,null,null,"Deliveries to main activity producers","Brown coal","2021M11",{"$f":"VLOOKUP(I441, LanguageData, MATCH(LanguageChosen, Language[Language],0), FALSE)","v":"Brown coal"},{"$f":"VLOOKUP(H441, LanguageData, MATCH(LanguageChosen, Language[Language],0), FALSE)","v":"Deliveries to main activity producers"},null,6]
["ECOKEOVS",null,null,"BROWN",1,null,null,"Deliveries to coking plants","Brown coal","2021M11",{"$f":"VLOOKUP(I442, LanguageData, MATCH(LanguageChosen, Language[Language],0), FALSE)","v":"Brown coal"},{"$f":"VLOOKUP(H442, LanguageData, MATCH(LanguageChosen, Language[Language],0), FALSE)","v":"Deliveries to coking plants"},null,6]
["TOTIND",null,null,"BROWN",1,null,null,"Deliveries to total industry","Brown coal","2021M11",{"$f":"VLOOKUP(I443, LanguageData, MATCH(LanguageChosen, Language[Language],0), FALSE)","v":"Brown coal"},{"$f":"VLOOKUP(H443, LanguageData, MATCH(LanguageChosen, Language[Language],0), FALSE)","v":"Deliveries to total industry"},null,6]
["IRONSTL",null,null,"BROWN",1,null,null,"Deliveries to total industry of which to iron and steel industry","Brown coal","2021M11",{"$f":"VLOOKUP(I444, LanguageData, MATCH(LanguageChosen, Language[Language],0), FALSE)","v":"Brown coal"},{"$f":"VLOOKUP(H444, LanguageData, MATCH(LanguageChosen, Language[Language],0), FALSE)","v":"Deliveries to total industry of which to iron and steel industry"},null,6]
["OTHER",null,null,"BROWN",1,null,null,"Other deliveries (services, households, …)","Brown coal","2021M11",{"$f":"VLOOKUP(I445, LanguageData, MATCH(LanguageChosen, Language[Language],0), FALSE)","v":"Brown coal"},{"$f":"VLOOKUP(H445, LanguageData, MATCH(LanguageChosen, Language[Language],0), FALSE)","v":"Other deliveries (services, households, …)"},null,6]
["INDPROD",null,null,"PEAT",1,null,null,"Production ","Peat","2021M11",{"$f":"VLOOKUP(I446, LanguageData, MATCH(LanguageChosen, Language[Language],0), FALSE)","v":"Peat"},{"$f":"VLOOKUP(H446, LanguageData, MATCH(LanguageChosen, Language[Language],0), FALSE)","v":"Production "},null,6]
["OSOURCES",null,null,"PEAT",1,null,null,"Recovered products","Peat","2021M11",{"$f":"VLOOKUP(I447, LanguageData, MATCH(LanguageChosen, Language[Language],0), FALSE)","v":"Peat"},{"$f":"VLOOKUP(H447, LanguageData, MATCH(LanguageChosen, Language[Language],0), FALSE)","v":"Recovered products"},null,6]
["TOTIMPSB",null,null,"PEAT",1,null,null,"Total imports","Peat","2021M11",{"$f":"VLOOKUP(I448, LanguageData, MATCH(LanguageChosen, Language[Language],0), FALSE)","v":"Peat"},{"$f":"VLOOKUP(H448, LanguageData, MATCH(LanguageChosen, Language[Language],0), FALSE)","v":"Total imports"},null,6]
["TOTIMPSBEU",null,null,"PEAT",1,null,null,"Imports: of which from outside EU","Peat","2021M11",{"$f":"VLOOKUP(I449, LanguageData, MATCH(LanguageChosen, Language[Language],0), FALSE)","v":"Peat"},{"$f":"VLOOKUP(H449, LanguageData, MATCH(LanguageChosen, Language[Language],0), FALSE)","v":"Imports: of which from outside EU"},null,6]
["TOTEXPSB",null,null,"PEAT",1,null,null,"Total exports","Peat","2021M11",{"$f":"VLOOKUP(I450, LanguageData, MATCH(LanguageChosen, Language[Language],0), FALSE)","v":"Peat"},{"$f":"VLOOKUP(H450, LanguageData, MATCH(LanguageChosen, Language[Language],0), FALSE)","v":"Total exports"},null,6]
["STOCKSTART",null,null,"PEAT",1,null,null,"Stocks - beginning of period","Peat","2021M11",{"$f":"VLOOKUP(I451, LanguageData, MATCH(LanguageChosen, Language[Language],0), FALSE)","v":"Peat"},{"$f":"VLOOKUP(H451, LanguageData, MATCH(LanguageChosen, Language[Language],0), FALSE)","v":"Stocks - beginning of period"},null,6]
["STOCKEND",null,null,"PEAT",1,null,null,"Stocks - end of period","Peat","2021M11",{"$f":"VLOOKUP(I452, LanguageData, MATCH(LanguageChosen, Language[Language],0), FALSE)","v":"Peat"},{"$f":"VLOOKUP(H452, LanguageData, MATCH(LanguageChosen, Language[Language],0), FALSE)","v":"Stocks - end of period"},null,6]
["STCHANAT",null,null,"PEAT",1,null,null,"Stock changes","Peat","2021M11",{"$f":"VLOOKUP(I453, LanguageData, MATCH(LanguageChosen, Language[Language],0), FALSE)","v":"Peat"},{"$f":"VLOOKUP(H453, LanguageData, MATCH(LanguageChosen, Language[Language],0), FALSE)","v":"Stock changes"},null,6]
["INDCONC",null,null,"PEAT",1,null,null,"Calculated inland deliveries","Peat","2021M11",{"$f":"VLOOKUP(I454, LanguageData, MATCH(LanguageChosen, Language[Language],0), FALSE)","v":"Peat"},{"$f":"VLOOKUP(H454, LanguageData, MATCH(LanguageChosen, Language[Language],0), FALSE)","v":"Calculated inland deliveries"},null,6]
["STATDIFF",null,null,"PEAT",1,null,null,"Statistical differences","Peat","2021M11",{"$f":"VLOOKUP(I455, LanguageData, MATCH(LanguageChosen, Language[Language],0), FALSE)","v":"Peat"},{"$f":"VLOOKUP(H455, LanguageData, MATCH(LanguageChosen, Language[Language],0), FALSE)","v":"Statistical differences"},null,6]
["INTERNAD",null,null,"PEAT",1,null,null,"Internal market deliveries (observed)","Peat","2021M11",{"$f":"VLOOKUP(I456, LanguageData, MATCH(LanguageChosen, Language[Language],0), FALSE)","v":"Peat"},{"$f":"VLOOKUP(H456, LanguageData, MATCH(LanguageChosen, Language[Language],0), FALSE)","v":"Internal market deliveries (observed)"},null,6]
["MAINPROD",null,null,"PEAT",1,null,null,"Deliveries to main activity producers","Peat","2021M11",{"$f":"VLOOKUP(I457, LanguageData, MATCH(LanguageChosen, Language[Language],0), FALSE)","v":"Peat"},{"$f":"VLOOKUP(H457, LanguageData, MATCH(LanguageChosen, Language[Language],0), FALSE)","v":"Deliveries to main activity producers"},null,6]
["ECOKEOVS",null,null,"PEAT",1,null,null,"Deliveries to coking plants","Peat","2021M11",{"$f":"VLOOKUP(I458, LanguageData, MATCH(LanguageChosen, Language[Language],0), FALSE)","v":"Peat"},{"$f":"VLOOKUP(H458, LanguageData, MATCH(LanguageChosen, Language[Language],0), FALSE)","v":"Deliveries to coking plants"},null,6]
["TOTIND",null,null,"PEAT",1,null,null,"Deliveries to total industry","Peat","2021M11",{"$f":"VLOOKUP(I459, LanguageData, MATCH(LanguageChosen, Language[Language],0), FALSE)","v":"Peat"},{"$f":"VLOOKUP(H459, LanguageData, MATCH(LanguageChosen, Language[Language],0), FALSE)","v":"Deliveries to total industry"},null,6]
["IRONSTL",null,null,"PEAT",1,null,null,"Deliveries to total industry of which to iron and steel industry","Peat","2021M11",{"$f":"VLOOKUP(I460, LanguageData, MATCH(LanguageChosen, Language[Language],0), FALSE)","v":"Peat"},{"$f":"VLOOKUP(H460, LanguageData, MATCH(LanguageChosen, Language[Language],0), FALSE)","v":"Deliveries to total industry of which to iron and steel industry"},null,6]
["OTHER",null,null,"PEAT",1,null,null,"Other deliveries (services, households, …)","Peat","2021M11",{"$f":"VLOOKUP(I461, LanguageData, MATCH(LanguageChosen, Language[Language],0), FALSE)","v":"Peat"},{"$f":"VLOOKUP(H461, LanguageData, MATCH(LanguageChosen, Language[Language],0), FALSE)","v":"Other deliveries (services, households, …)"},null,6]
["INDPROD",null,null,"OILSHALE",1,null,null,"Production ","Oil shale and oil sands","2021M11",{"$f":"VLOOKUP(I462, LanguageData, MATCH(LanguageChosen, Language[Language],0), FALSE)","v":"Oil shale and oil sands"},{"$f":"VLOOKUP(H462, LanguageData, MATCH(LanguageChosen, Language[Language],0), FALSE)","v":"Production "},null,6]
["OSOURCES",null,null,"OILSHALE",1,null,null,"Recovered products","Oil shale and oil sands",{"$f":"YEAR(DATE(LEFT($B$1,4),RIGHT($B$1,2)-N463,1)) & \"M\" & TEXT(MONTH(DATE(LEFT($B$1,4),RIGHT($B$1,2)-N463,1)),\"00\")","v":"2021M11"},{"$f":"VLOOKUP(I463, LanguageData, MATCH(LanguageChosen, Language[Language],0), FALSE)","v":"Oil shale and oil sands"},{"$f":"VLOOKUP(H463, LanguageData, MATCH(LanguageChosen, Language[Language],0), FALSE)","v":"Recovered products"},null,6]
["TOTIMPSB",null,null,"OILSHALE",1,null,null,"Total imports","Oil shale and oil sands","2021M11",{"$f":"VLOOKUP(I464, LanguageData, MATCH(LanguageChosen, Language[Language],0), FALSE)","v":"Oil shale and oil sands"},{"$f":"VLOOKUP(H464, LanguageData, MATCH(LanguageChosen, Language[Language],0), FALSE)","v":"Total imports"},null,6]
["TOTIMPSBEU",null,null,"OILSHALE",1,null,null,"Imports: of which from outside EU","Oil shale and oil sands","2021M11",{"$f":"VLOOKUP(I465, LanguageData, MATCH(LanguageChosen, Language[Language],0), FALSE)","v":"Oil shale and oil sands"},{"$f":"VLOOKUP(H465, LanguageData, MATCH(LanguageChosen, Language[Language],0), FALSE)","v":"Imports: of which from outside EU"},null,6]
["TOTEXPSB",null,null,"OILSHALE",1,null,null,"Total exports","Oil shale and oil sands","2021M11",{"$f":"VLOOKUP(I466, LanguageData, MATCH(LanguageChosen, Language[Language],0), FALSE)","v":"Oil shale and oil sands"},{"$f":"VLOOKUP(H466, LanguageData, MATCH(LanguageChosen, Language[Language],0), FALSE)","v":"Total exports"},null,6]
["STOCKSTART",null,null,"OILSHALE",1,null,null,"Stocks - beginning of period","Oil shale and oil sands","2021M11",{"$f":"VLOOKUP(I467, LanguageData, MATCH(LanguageChosen, Language[Language],0), FALSE)","v":"Oil shale and oil sands"},{"$f":"VLOOKUP(H467, LanguageData, MATCH(LanguageChosen, Language[Language],0), FALSE)","v":"Stocks - beginning of period"},null,6]
["STOCKEND",null,null,"OILSHALE",1,null,null,"Stocks - end of period","Oil shale and oil sands","2021M11",{"$f":"VLOOKUP(I468, LanguageData, MATCH(LanguageChosen, Language[Language],0), FALSE)","v":"Oil shale and oil sands"},{"$f":"VLOOKUP(H468, LanguageData, MATCH(LanguageChosen, Language[Language],0), FALSE)","v":"Stocks - end of period"},null,6]
["STCHANAT",null,null,"OILSHALE",1,null,null,"Stock changes","Oil shale and oil sands","2021M11",{"$f":"VLOOKUP(I469, LanguageData, MATCH(LanguageChosen, Language[Language],0), FALSE)","v":"Oil shale and oil sands"},{"$f":"VLOOKUP(H469, LanguageData, MATCH(LanguageChosen, Language[Language],0), FALSE)","v":"Stock changes"},null,6]
["INDCONC",null,null,"OILSHALE",1,null,null,"Calculated inland deliveries","Oil shale and oil sands","2021M11",{"$f":"VLOOKUP(I470, LanguageData, MATCH(LanguageChosen, Language[Language],0), FALSE)","v":"Oil shale and oil sands"},{"$f":"VLOOKUP(H470, LanguageData, MATCH(LanguageChosen, Language[Language],0), FALSE)","v":"Calculated inland deliveries"},null,6]
["STATDIFF",null,null,"OILSHALE",1,null,null,"Statistical differences","Oil shale and oil sands","2021M11",{"$f":"VLOOKUP(I471, LanguageData, MATCH(LanguageChosen, Language[Language],0), FALSE)","v":"Oil shale and oil sands"},{"$f":"VLOOKUP(H471, LanguageData, MATCH(LanguageChosen, Language[Language],0), FALSE)","v":"Statistical differences"},null,6]
["INTERNAD",null,null,"OILSHALE",1,null,null,"Internal market deliveries (observed)","Oil shale and oil sands","2021M11",{"$f":"VLOOKUP(I472, LanguageData, MATCH(LanguageChosen, Language[Language],0), FALSE)","v":"Oil shale and oil sands"},{"$f":"VLOOKUP(H472, LanguageData, MATCH(LanguageChosen, Language[Language],0), FALSE)","v":"Internal market deliveries (observed)"},null,6]
["MAINPROD",null,null,"OILSHALE",1,null,null,"Deliveries to main activity producers","Oil shale and oil sands","2021M11",{"$f":"VLOOKUP(I473, LanguageData, MATCH(LanguageChosen, Language[Language],0), FALSE)","v":"Oil shale and oil sands"},{"$f":"VLOOKUP(H473, LanguageData, MATCH(LanguageChosen, Language[Language],0), FALSE)","v":"Deliveries to main activity producers"},null,6]
["ECOKEOVS",null,null,"OILSHALE",1,null,null,"Deliveries to coking plants","Oil shale and oil sands","2021M11",{"$f":"VLOOKUP(I474, LanguageData, MATCH(LanguageChosen, Language[Language],0), FALSE)","v":"Oil shale and oil sands"},{"$f":"VLOOKUP(H474, LanguageData, MATCH(LanguageChosen, Language[Language],0), FALSE)","v":"Deliveries to coking plants"},null,6]
["TOTIND",null,null,"OILSHALE",1,null,null,"Deliveries to total industry","Oil shale and oil sands","2021M11",{"$f":"VLOOKUP(I475, LanguageData, MATCH(LanguageChosen, Language[Language],0), FALSE)","v":"Oil shale and oil sands"},{"$f":"VLOOKUP(H475, LanguageData, MATCH(LanguageChosen, Language[Language],0), FALSE)","v":"Deliveries to total industry"},null,6]
["IRONSTL",null,null,"OILSHALE",1,null,null,"Deliveries to total industry of which to iron and steel industry","Oil shale and oil sands","2021M11",{"$f":"VLOOKUP(I476, LanguageData, MATCH(LanguageChosen, Language[Language],0), FALSE)","v":"Oil shale and oil sands"},{"$f":"VLOOKUP(H476, LanguageData, MATCH(LanguageChosen, Language[Language],0), FALSE)","v":"Deliveries to total industry of which to iron and steel industry"},null,6]
["OTHER",null,null,"OILSHALE",1,null,null,"Other deliveries (services, households, …)","Oil shale and oil sands","2021M11",{"$f":"VLOOKUP(I477, LanguageData, MATCH(LanguageChosen, Language[Language],0), FALSE)","v":"Oil shale and oil sands"},{"$f":"VLOOKUP(H477, LanguageData, MATCH(LanguageChosen, Language[Language],0), FALSE)","v":"Other deliveries (services, households, …)"},null,6]
["INDPROD",null,null,"COKEOVEN",1,null,null,"Production ","Coke oven coke","2021M11",{"$f":"VLOOKUP(I478, LanguageData, MATCH(LanguageChosen, Language[Language],0), FALSE)","v":"Coke oven coke"},{"$f":"VLOOKUP(H478, LanguageData, MATCH(LanguageChosen, Language[Language],0), FALSE)","v":"Production "},null,6]
["OSOURCES",null,null,"COKEOVEN",1,null,null,"Recovered products","Coke oven coke","2021M11",{"$f":"VLOOKUP(I479, LanguageData, MATCH(LanguageChosen, Language[Language],0), FALSE)","v":"Coke oven coke"},{"$f":"VLOOKUP(H479, LanguageData, MATCH(LanguageChosen, Language[Language],0), FALSE)","v":"Recovered products"},null,6]
["TOTIMPSB",null,null,"COKEOVEN",1,null,null,"Total imports","Coke oven coke","2021M11",{"$f":"VLOOKUP(I480, LanguageData, MATCH(LanguageChosen, Language[Language],0), FALSE)","v":"Coke oven coke"},{"$f":"VLOOKUP(H480, LanguageData, MATCH(LanguageChosen, Language[Language],0), FALSE)","v":"Total imports"},null,6]
["TOTIMPSBEU",null,null,"COKEOVEN",1,null,null,"Imports: of which from outside EU","Coke oven coke","2021M11",{"$f":"VLOOKUP(I481, LanguageData, MATCH(LanguageChosen, Language[Language],0), FALSE)","v":"Coke oven coke"},{"$f":"VLOOKUP(H481, LanguageData, MATCH(LanguageChosen, Language[Language],0), FALSE)","v":"Imports: of which from outside EU"},null,6]
["TOTEXPSB",null,null,"COKEOVEN",1,null,null,"Total exports","Coke oven coke","2021M11",{"$f":"VLOOKUP(I482, LanguageData, MATCH(LanguageChosen, Language[Language],0), FALSE)","v":"Coke oven coke"},{"$f":"VLOOKUP(H482, LanguageData, MATCH(LanguageChosen, Language[Language],0), FALSE)","v":"Total exports"},null,6]
["STOCKSTART",null,null,"COKEOVEN",1,null,null,"Stocks - beginning of period","Coke oven coke","2021M11",{"$f":"VLOOKUP(I483, LanguageData, MATCH(LanguageChosen, Language[Language],0), FALSE)","v":"Coke oven coke"},{"$f":"VLOOKUP(H483, LanguageData, MATCH(LanguageChosen, Language[Language],0), FALSE)","v":"Stocks - beginning of period"},null,6]
["STOCKEND",null,null,"COKEOVEN",1,null,null,"Stocks - end of period","Coke oven coke","2021M11",{"$f":"VLOOKUP(I484, LanguageData, MATCH(LanguageChosen, Language[Language],0), FALSE)","v":"Coke oven coke"},{"$f":"VLOOKUP(H484, LanguageData, MATCH(LanguageChosen, Language[Language],0), FALSE)","v":"Stocks - end of period"},null,6]
["STCHANAT",null,null,"COKEOVEN",1,null,null,"Stock changes","Coke oven coke","2021M11",{"$f":"VLOOKUP(I485, LanguageData, MATCH(LanguageChosen, Language[Language],0), FALSE)","v":"Coke oven coke"},{"$f":"VLOOKUP(H485, LanguageData, MATCH(LanguageChosen, Language[Language],0), FALSE)","v":"Stock changes"},null,6]
["INDCONC",null,null,"COKEOVEN",1,null,null,"Calculated inland deliveries","Coke oven coke","2021M11",{"$f":"VLOOKUP(I486, LanguageData, MATCH(LanguageChosen, Language[Language],0), FALSE)","v":"Coke oven coke"},{"$f":"VLOOKUP(H486, LanguageData, MATCH(LanguageChosen, Language[Language],0), FALSE)","v":"Calculated inland deliveries"},null,6]
["STATDIFF",null,null,"COKEOVEN",1,null,null,"Statistical differences","Coke oven coke","2021M11",{"$f":"VLOOKUP(I487, LanguageData, MATCH(LanguageChosen, Language[Language],0), FALSE)","v":"Coke oven coke"},{"$f":"VLOOKUP(H487, LanguageData, MATCH(LanguageChosen, Language[Language],0), FALSE)","v":"Statistical differences"},null,6]
["INTERNAD",null,null,"COKEOVEN",1,null,null,"Internal market deliveries (observed)","Coke oven coke","2021M11",{"$f":"VLOOKUP(I488, LanguageData, MATCH(LanguageChosen, Language[Language],0), FALSE)","v":"Coke oven coke"},{"$f":"VLOOKUP(H488, LanguageData, MATCH(LanguageChosen, Language[Language],0), FALSE)","v":"Internal market deliveries (observed)"},null,6]
["MAINPROD",null,null,"COKEOVEN",1,null,null,"Deliveries to main activity producers","Coke oven coke","2021M11",{"$f":"VLOOKUP(I489, LanguageData, MATCH(LanguageChosen, Language[Language],0), FALSE)","v":"Coke oven coke"},{"$f":"VLOOKUP(H489, LanguageData, MATCH(LanguageChosen, Language[Language],0), FALSE)","v":"Deliveries to main activity producers"},null,6]
["ECOKEOVS",null,null,"COKEOVEN",1,null,null,"Deliveries to coking plants","Coke oven coke","2021M11",{"$f":"VLOOKUP(I490, LanguageData, MATCH(LanguageChosen, Language[Language],0), FALSE)","v":"Coke oven coke"},{"$f":"VLOOKUP(H490, LanguageData, MATCH(LanguageChosen, Language[Language],0), FALSE)","v":"Deliveries to coking plants"},null,6]
["TOTIND",null,null,"COKEOVEN",1,null,null,"Deliveries to total industry","Coke oven coke","2021M11",{"$f":"VLOOKUP(I491, LanguageData, MATCH(LanguageChosen, Language[Language],0), FALSE)","v":"Coke oven coke"},{"$f":"VLOOKUP(H491, LanguageData, MATCH(LanguageChosen, Language[Language],0), FALSE)","v":"Deliveries to total industry"},null,6]
["IRONSTL",null,null,"COKEOVEN",1,null,null,"Deliveries to total industry of which to iron and steel industry","Coke oven coke","2021M11",{"$f":"VLOOKUP(I492, LanguageData, MATCH(LanguageChosen, Language[Language],0), FALSE)","v":"Coke oven coke"},{"$f":"VLOOKUP(H492, LanguageData, MATCH(LanguageChosen, Language[Language],0), FALSE)","v":"Deliveries to total industry of which to iron and steel industry"},null,6]
["OTHER",null,null,"COKEOVEN",1,null,null,"Other deliveries (services, households, …)","Coke oven coke","2021M11",{"$f":"VLOOKUP(I493, LanguageData, MATCH(LanguageChosen, Language[Language],0), FALSE)","v":"Coke oven coke"},{"$f":"VLOOKUP(H493, LanguageData, MATCH(LanguageChosen, Language[Language],0), FALSE)","v":"Other deliveries (services, households, …)"},null,6]
["INDPROD",null,null,"HARDCOAL",1,null,null,"Production ","Hard coal","2021M12",{"$f":"VLOOKUP(I494, LanguageData, MATCH(LanguageChosen, Language[Language],0), FALSE)","v":"Hard coal"},{"$f":"VLOOKUP(H494, LanguageData, MATCH(LanguageChosen, Language[Language],0), FALSE)","v":"Production "},null,5]
["OSOURCES",null,null,"HARDCOAL",1,null,null,"Recovered products","Hard coal","2021M12",{"$f":"VLOOKUP(I495, LanguageData, MATCH(LanguageChosen, Language[Language],0), FALSE)","v":"Hard coal"},{"$f":"VLOOKUP(H495, LanguageData, MATCH(LanguageChosen, Language[Language],0), FALSE)","v":"Recovered products"},null,5]
["TOTIMPSB",null,null,"HARDCOAL",1,null,null,"Total imports","Hard coal","2021M12",{"$f":"VLOOKUP(I496, LanguageData, MATCH(LanguageChosen, Language[Language],0), FALSE)","v":"Hard coal"},{"$f":"VLOOKUP(H496, LanguageData, MATCH(LanguageChosen, Language[Language],0), FALSE)","v":"Total imports"},null,5]
["TOTIMPSBEU",null,null,"HARDCOAL",1,null,null,"Imports: of which from outside EU","Hard coal","2021M12",{"$f":"VLOOKUP(I497, LanguageData, MATCH(LanguageChosen, Language[Language],0), FALSE)","v":"Hard coal"},{"$f":"VLOOKUP(H497, LanguageData, MATCH(LanguageChosen, Language[Language],0), FALSE)","v":"Imports: of which from outside EU"},null,5]
["TOTEXPSB",null,null,"HARDCOAL",1,null,null,"Total exports","Hard coal","2021M12",{"$f":"VLOOKUP(I498, LanguageData, MATCH(LanguageChosen, Language[Language],0), FALSE)","v":"Hard coal"},{"$f":"VLOOKUP(H498, LanguageData, MATCH(LanguageChosen, Language[Language],0), FALSE)","v":"Total exports"},null,5]
["STOCKSTART",null,null,"HARDCOAL",1,null,null,"Stocks - beginning of period","Hard coal","2021M12",{"$f":"VLOOKUP(I499, LanguageData, MATCH(LanguageChosen, Language[Language],0), FALSE)","v":"Hard coal"},{"$f":"VLOOKUP(H499, LanguageData, MATCH(LanguageChosen, Language[Language],0), FALSE)","v":"Stocks - beginning of period"},null,5]
["STOCKEND",null,null,"HARDCOAL",1,null,null,"Stocks - end of period","Hard coal","2021M12",{"$f":"VLOOKUP(I500, LanguageData, MATCH(LanguageChosen, Language[Language],0), FALSE)","v":"Hard coal"},{"$f":"VLOOKUP(H500, LanguageData, MATCH(LanguageChosen, Language[Language],0), FALSE)","v":"Stocks - end of period"},null,5]
["STCHANAT",null,null,"HARDCOAL",1,null,null,"Stock changes","Hard coal","2021M12",{"$f":"VLOOKUP(I501, LanguageData, MATCH(LanguageChosen, Language[Language],0), FALSE)","v":"Hard coal"},{"$f":"VLOOKUP(H501, LanguageData, MATCH(LanguageChosen, Language[Language],0), FALSE)","v":"Stock changes"},null,5]
["INDCONC",null,null,"HARDCOAL",1,null,null,"Calculated inland deliveries","Hard coal","2021M12",{"$f":"VLOOKUP(I502, LanguageData, MATCH(LanguageChosen, Language[Language],0), FALSE)","v":"Hard coal"},{"$f":"VLOOKUP(H502, LanguageData, MATCH(LanguageChosen, Language[Language],0), FALSE)","v":"Calculated inland deliveries"},null,5]
["STATDIFF",null,null,"HARDCOAL",1,null,null,"Statistical differences","Hard coal","2021M12",{"$f":"VLOOKUP(I503, LanguageData, MATCH(LanguageChosen, Language[Language],0), FALSE)","v":"Hard coal"},{"$f":"VLOOKUP(H503, LanguageData, MATCH(LanguageChosen, Language[Language],0), FALSE)","v":"Statistical differences"},null,5]
["INTERNAD",null,null,"HARDCOAL",1,null,null,"Internal market deliveries (observed)","Hard coal","2021M12",{"$f":"VLOOKUP(I504, LanguageData, MATCH(LanguageChosen, Language[Language],0), FALSE)","v":"Hard coal"},{"$f":"VLOOKUP(H504, LanguageData, MATCH(LanguageChosen, Language[Language],0), FALSE)","v":"Internal market deliveries (observed)"},null,5]
["MAINPROD",null,null,"HARDCOAL",1,null,null,"Deliveries to main activity producers","Hard coal","2021M12",{"$f":"VLOOKUP(I505, LanguageData, MATCH(LanguageChosen, Language[Language],0), FALSE)","v":"Hard coal"},{"$f":"VLOOKUP(H505, LanguageData, MATCH(LanguageChosen, Language[Language],0), FALSE)","v":"Deliveries to main activity producers"},null,5]
["ECOKEOVS",null,null,"HARDCOAL",1,null,null,"Deliveries to coking plants","Hard coal","2021M12",{"$f":"VLOOKUP(I506, LanguageData, MATCH(LanguageChosen, Language[Language],0), FALSE)","v":"Hard coal"},{"$f":"VLOOKUP(H506, LanguageData, MATCH(LanguageChosen, Language[Language],0), FALSE)","v":"Deliveries to coking plants"},null,5]
["TOTIND",null,null,"HARDCOAL",1,null,null,"Deliveries to total industry","Hard coal","2021M12",{"$f":"VLOOKUP(I507, LanguageData, MATCH(LanguageChosen, Language[Language],0), FALSE)","v":"Hard coal"},{"$f":"VLOOKUP(H507, LanguageData, MATCH(LanguageChosen, Language[Language],0), FALSE)","v":"Deliveries to total industry"},null,5]
["IRONSTL",null,null,"HARDCOAL",1,null,null,"Deliveries to total industry of which to iron and steel industry","Hard coal","2021M12",{"$f":"VLOOKUP(I508, LanguageData, MATCH(LanguageChosen, Language[Language],0), FALSE)","v":"Hard coal"},{"$f":"VLOOKUP(H508, LanguageData, MATCH(LanguageChosen, Language[Language],0), FALSE)","v":"Deliveries to total industry of which to iron and steel industry"},null,5]
["OTHER",null,null,"HARDCOAL",1,null,null,"Other deliveries (services, households, …)","Hard coal","2021M12",{"$f":"VLOOKUP(I509, LanguageData, MATCH(LanguageChosen, Language[Language],0), FALSE)","v":"Hard coal"},{"$f":"VLOOKUP(H509, LanguageData, MATCH(LanguageChosen, Language[Language],0), FALSE)","v":"Other deliveries (services, households, …)"},null,5]
["INDPROD",null,null,"BROWN",1,null,null,"Production ","Brown coal","2021M12",{"$f":"VLOOKUP(I510, LanguageData, MATCH(LanguageChosen, Language[Language],0), FALSE)","v":"Brown coal"},{"$f":"VLOOKUP(H510, LanguageData, MATCH(LanguageChosen, Language[Language],0), FALSE)","v":"Production "},null,5]
["OSOURCES",null,null,"BROWN",1,null,null,"Recovered products","Brown coal","2021M12",{"$f":"VLOOKUP(I511, LanguageData, MATCH(LanguageChosen, Language[Language],0), FALSE)","v":"Brown coal"},{"$f":"VLOOKUP(H511, LanguageData, MATCH(LanguageChosen, Language[Language],0), FALSE)","v":"Recovered products"},null,5]
["TOTIMPSB",null,null,"BROWN",1,null,null,"Total imports","Brown coal","2021M12",{"$f":"VLOOKUP(I512, LanguageData, MATCH(LanguageChosen, Language[Language],0), FALSE)","v":"Brown coal"},{"$f":"VLOOKUP(H512, LanguageData, MATCH(LanguageChosen, Language[Language],0), FALSE)","v":"Total imports"},null,5]
["TOTIMPSBEU",null,null,"BROWN",1,null,null,"Imports: of which from outside EU","Brown coal","2021M12",{"$f":"VLOOKUP(I513, LanguageData, MATCH(LanguageChosen, Language[Language],0), FALSE)","v":"Brown coal"},{"$f":"VLOOKUP(H513, LanguageData, MATCH(LanguageChosen, Language[Language],0), FALSE)","v":"Imports: of which from outside EU"},null,5]
["TOTEXPSB",null,null,"BROWN",1,null,null,"Total exports","Brown coal","2021M12",{"$f":"VLOOKUP(I514, LanguageData, MATCH(LanguageChosen, Language[Language],0), FALSE)","v":"Brown coal"},{"$f":"VLOOKUP(H514, LanguageData, MATCH(LanguageChosen, Language[Language],0), FALSE)","v":"Total exports"},null,5]
["STOCKSTART",null,null,"BROWN",1,null,null,"Stocks - beginning of period","Brown coal","2021M12",{"$f":"VLOOKUP(I515, LanguageData, MATCH(LanguageChosen, Language[Language],0), FALSE)","v":"Brown coal"},{"$f":"VLOOKUP(H515, LanguageData, MATCH(LanguageChosen, Language[Language],0), FALSE)","v":"Stocks - beginning of period"},null,5]
["STOCKEND",null,null,"BROWN",1,null,null,"Stocks - end of period","Brown coal","2021M12",{"$f":"VLOOKUP(I516, LanguageData, MATCH(LanguageChosen, Language[Language],0), FALSE)","v":"Brown coal"},{"$f":"VLOOKUP(H516, LanguageData, MATCH(LanguageChosen, Language[Language],0), FALSE)","v":"Stocks - end of period"},null,5]
["STCHANAT",null,null,"BROWN",1,null,null,"Stock changes","Brown coal","2021M12",{"$f":"VLOOKUP(I517, LanguageData, MATCH(LanguageChosen, Language[Language],0), FALSE)","v":"Brown coal"},{"$f":"VLOOKUP(H517, LanguageData, MATCH(LanguageChosen, Language[Language],0), FALSE)","v":"Stock changes"},null,5]
["INDCONC",null,null,"BROWN",1,null,null,"Calculated inland deliveries","Brown coal","2021M12",{"$f":"VLOOKUP(I518, LanguageData, MATCH(LanguageChosen, Language[Language],0), FALSE)","v":"Brown coal"},{"$f":"VLOOKUP(H518, LanguageData, MATCH(LanguageChosen, Language[Language],0), FALSE)","v":"Calculated inland deliveries"},null,5]
["STATDIFF",null,null,"BROWN",1,null,null,"Statistical differences","Brown coal","2021M12",{"$f":"VLOOKUP(I519, LanguageData, MATCH(LanguageChosen, Language[Language],0), FALSE)","v":"Brown coal"},{"$f":"VLOOKUP(H519, LanguageData, MATCH(LanguageChosen, Language[Language],0), FALSE)","v":"Statistical differences"},null,5]
["INTERNAD",null,null,"BROWN",1,null,null,"Internal market deliveries (observed)","Brown coal","2021M12",{"$f":"VLOOKUP(I520, LanguageData, MATCH(LanguageChosen, Language[Language],0), FALSE)","v":"Brown coal"},{"$f":"VLOOKUP(H520, LanguageData, MATCH(LanguageChosen, Language[Language],0), FALSE)","v":"Internal market deliveries (observed)"},null,5]
["MAINPROD",null,null,"BROWN",1,null,null,"Deliveries to main activity producers","Brown coal","2021M12",{"$f":"VLOOKUP(I521, LanguageData, MATCH(LanguageChosen, Language[Language],0), FALSE)","v":"Brown coal"},{"$f":"VLOOKUP(H521, LanguageData, MATCH(LanguageChosen, Language[Language],0), FALSE)","v":"Deliveries to main activity producers"},null,5]
["ECOKEOVS",null,null,"BROWN",1,null,null,"Deliveries to coking plants","Brown coal","2021M12",{"$f":"VLOOKUP(I522, LanguageData, MATCH(LanguageChosen, Language[Language],0), FALSE)","v":"Brown coal"},{"$f":"VLOOKUP(H522, LanguageData, MATCH(LanguageChosen, Language[Language],0), FALSE)","v":"Deliveries to coking plants"},null,5]
["TOTIND",null,null,"BROWN",1,null,null,"Deliveries to total industry","Brown coal","2021M12",{"$f":"VLOOKUP(I523, LanguageData, MATCH(LanguageChosen, Language[Language],0), FALSE)","v":"Brown coal"},{"$f":"VLOOKUP(H523, LanguageData, MATCH(LanguageChosen, Language[Language],0), FALSE)","v":"Deliveries to total industry"},null,5]
["IRONSTL",null,null,"BROWN",1,null,null,"Deliveries to total industry of which to iron and steel industry","Brown coal","2021M12",{"$f":"VLOOKUP(I524, LanguageData, MATCH(LanguageChosen, Language[Language],0), FALSE)","v":"Brown coal"},{"$f":"VLOOKUP(H524, LanguageData, MATCH(LanguageChosen, Language[Language],0), FALSE)","v":"Deliveries to total industry of which to iron and steel industry"},null,5]
["OTHER",null,null,"BROWN",1,null,null,"Other deliveries (services, households, …)","Brown coal","2021M12",{"$f":"VLOOKUP(I525, LanguageData, MATCH(LanguageChosen, Language[Language],0), FALSE)","v":"Brown coal"},{"$f":"VLOOKUP(H525, LanguageData, MATCH(LanguageChosen, Language[Language],0), FALSE)","v":"Other deliveries (services, households, …)"},null,5]
["INDPROD",null,null,"PEAT",1,null,null,"Production ","Peat","2021M12",{"$f":"VLOOKUP(I526, LanguageData, MATCH(LanguageChosen, Language[Language],0), FALSE)","v":"Peat"},{"$f":"VLOOKUP(H526, LanguageData, MATCH(LanguageChosen, Language[Language],0), FALSE)","v":"Production "},null,5]
["OSOURCES",null,null,"PEAT",1,null,null,"Recovered products","Peat",{"$f":"YEAR(DATE(LEFT($B$1,4),RIGHT($B$1,2)-N527,1)) & \"M\" & TEXT(MONTH(DATE(LEFT($B$1,4),RIGHT($B$1,2)-N527,1)),\"00\")","v":"2021M12"},{"$f":"VLOOKUP(I527, LanguageData, MATCH(LanguageChosen, Language[Language],0), FALSE)","v":"Peat"},{"$f":"VLOOKUP(H527, LanguageData, MATCH(LanguageChosen, Language[Language],0), FALSE)","v":"Recovered products"},null,5]
["TOTIMPSB",null,null,"PEAT",1,null,null,"Total imports","Peat","2021M12",{"$f":"VLOOKUP(I528, LanguageData, MATCH(LanguageChosen, Language[Language],0), FALSE)","v":"Peat"},{"$f":"VLOOKUP(H528, LanguageData, MATCH(LanguageChosen, Language[Language],0), FALSE)","v":"Total imports"},null,5]
["TOTIMPSBEU",null,null,"PEAT",1,null,null,"Imports: of which from outside EU","Peat","2021M12",{"$f":"VLOOKUP(I529, LanguageData, MATCH(LanguageChosen, Language[Language],0), FALSE)","v":"Peat"},{"$f":"VLOOKUP(H529, LanguageData, MATCH(LanguageChosen, Language[Language],0), FALSE)","v":"Imports: of which from outside EU"},null,5]
["TOTEXPSB",null,null,"PEAT",1,null,null,"Total exports","Peat","2021M12",{"$f":"VLOOKUP(I530, LanguageData, MATCH(LanguageChosen, Language[Language],0), FALSE)","v":"Peat"},{"$f":"VLOOKUP(H530, LanguageData, MATCH(LanguageChosen, Language[Language],0), FALSE)","v":"Total exports"},null,5]
["STOCKSTART",null,null,"PEAT",1,null,null,"Stocks - beginning of period","Peat","2021M12",{"$f":"VLOOKUP(I531, LanguageData, MATCH(LanguageChosen, Language[Language],0), FALSE)","v":"Peat"},{"$f":"VLOOKUP(H531, LanguageData, MATCH(LanguageChosen, Language[Language],0), FALSE)","v":"Stocks - beginning of period"},null,5]
["STOCKEND",null,null,"PEAT",1,null,null,"Stocks - end of period","Peat","2021M12",{"$f":"VLOOKUP(I532, LanguageData, MATCH(LanguageChosen, Language[Language],0), FALSE)","v":"Peat"},{"$f":"VLOOKUP(H532, LanguageData, MATCH(LanguageChosen, Language[Language],0), FALSE)","v":"Stocks - end of period"},null,5]
["STCHANAT",null,null,"PEAT",1,null,null,"Stock changes","Peat","2021M12",{"$f":"VLOOKUP(I533, LanguageData, MATCH(LanguageChosen, Language[Language],0), FALSE)","v":"Peat"},{"$f":"VLOOKUP(H533, LanguageData, MATCH(LanguageChosen, Language[Language],0), FALSE)","v":"Stock changes"},null,5]
["INDCONC",null,null,"PEAT",1,null,null,"Calculated inland deliveries","Peat","2021M12",{"$f":"VLOOKUP(I534, LanguageData, MATCH(LanguageChosen, Language[Language],0), FALSE)","v":"Peat"},{"$f":"VLOOKUP(H534, LanguageData, MATCH(LanguageChosen, Language[Language],0), FALSE)","v":"Calculated inland deliveries"},null,5]
["STATDIFF",null,null,"PEAT",1,null,null,"Statistical differences","Peat","2021M12",{"$f":"VLOOKUP(I535, LanguageData, MATCH(LanguageChosen, Language[Language],0), FALSE)","v":"Peat"},{"$f":"VLOOKUP(H535, LanguageData, MATCH(LanguageChosen, Language[Language],0), FALSE)","v":"Statistical differences"},null,5]
["INTERNAD",null,null,"PEAT",1,null,null,"Internal market deliveries (observed)","Peat","2021M12",{"$f":"VLOOKUP(I536, LanguageData, MATCH(LanguageChosen, Language[Language],0), FALSE)","v":"Peat"},{"$f":"VLOOKUP(H536, LanguageData, MATCH(LanguageChosen, Language[Language],0), FALSE)","v":"Internal market deliveries (observed)"},null,5]
["MAINPROD",null,null,"PEAT",1,null,null,"Deliveries to main activity producers","Peat","2021M12",{"$f":"VLOOKUP(I537, LanguageData, MATCH(LanguageChosen, Language[Language],0), FALSE)","v":"Peat"},{"$f":"VLOOKUP(H537, LanguageData, MATCH(LanguageChosen, Language[Language],0), FALSE)","v":"Deliveries to main activity producers"},null,5]
["ECOKEOVS",null,null,"PEAT",1,null,null,"Deliveries to coking plants","Peat","2021M12",{"$f":"VLOOKUP(I538, LanguageData, MATCH(LanguageChosen, Language[Language],0), FALSE)","v":"Peat"},{"$f":"VLOOKUP(H538, LanguageData, MATCH(LanguageChosen, Language[Language],0), FALSE)","v":"Deliveries to coking plants"},null,5]
["TOTIND",null,null,"PEAT",1,null,null,"Deliveries to total industry","Peat","2021M12",{"$f":"VLOOKUP(I539, LanguageData, MATCH(LanguageChosen, Language[Language],0), FALSE)","v":"Peat"},{"$f":"VLOOKUP(H539, LanguageData, MATCH(LanguageChosen, Language[Language],0), FALSE)","v":"Deliveries to total industry"},null,5]
["IRONSTL",null,null,"PEAT",1,null,null,"Deliveries to total industry of which to iron and steel industry","Peat","2021M12",{"$f":"VLOOKUP(I540, LanguageData, MATCH(LanguageChosen, Language[Language],0), FALSE)","v":"Peat"},{"$f":"VLOOKUP(H540, LanguageData, MATCH(LanguageChosen, Language[Language],0), FALSE)","v":"Deliveries to total industry of which to iron and steel industry"},null,5]
["OTHER",null,null,"PEAT",1,null,null,"Other deliveries (services, households, …)","Peat","2021M12",{"$f":"VLOOKUP(I541, LanguageData, MATCH(LanguageChosen, Language[Language],0), FALSE)","v":"Peat"},{"$f":"VLOOKUP(H541, LanguageData, MATCH(LanguageChosen, Language[Language],0), FALSE)","v":"Other deliveries (services, households, …)"},null,5]
["INDPROD",null,null,"OILSHALE",1,null,null,"Production ","Oil shale and oil sands","2021M12",{"$f":"VLOOKUP(I542, LanguageData, MATCH(LanguageChosen, Language[Language],0), FALSE)","v":"Oil shale and oil sands"},{"$f":"VLOOKUP(H542, LanguageData, MATCH(LanguageChosen, Language[Language],0), FALSE)","v":"Production "},null,5]
["OSOURCES",null,null,"OILSHALE",1,null,null,"Recovered products","Oil shale and oil sands","2021M12",{"$f":"VLOOKUP(I543, LanguageData, MATCH(LanguageChosen, Language[Language],0), FALSE)","v":"Oil shale and oil sands"},{"$f":"VLOOKUP(H543, LanguageData, MATCH(LanguageChosen, Language[Language],0), FALSE)","v":"Recovered products"},null,5]
["TOTIMPSB",null,null,"OILSHALE",1,null,null,"Total imports","Oil shale and oil sands","2021M12",{"$f":"VLOOKUP(I544, LanguageData, MATCH(LanguageChosen, Language[Language],0), FALSE)","v":"Oil shale and oil sands"},{"$f":"VLOOKUP(H544, LanguageData, MATCH(LanguageChosen, Language[Language],0), FALSE)","v":"Total imports"},null,5]
["TOTIMPSBEU",null,null,"OILSHALE",1,null,null,"Imports: of which from outside EU","Oil shale and oil sands","2021M12",{"$f":"VLOOKUP(I545, LanguageData, MATCH(LanguageChosen, Language[Language],0), FALSE)","v":"Oil shale and oil sands"},{"$f":"VLOOKUP(H545, LanguageData, MATCH(LanguageChosen, Language[Language],0), FALSE)","v":"Imports: of which from outside EU"},null,5]
["TOTEXPSB",null,null,"OILSHALE",1,null,null,"Total exports","Oil shale and oil sands","2021M12",{"$f":"VLOOKUP(I546, LanguageData, MATCH(LanguageChosen, Language[Language],0), FALSE)","v":"Oil shale and oil sands"},{"$f":"VLOOKUP(H546, LanguageData, MATCH(LanguageChosen, Language[Language],0), FALSE)","v":"Total exports"},null,5]
["STOCKSTART",null,null,"OILSHALE",1,null,null,"Stocks - beginning of period","Oil shale and oil sands","2021M12",{"$f":"VLOOKUP(I547, LanguageData, MATCH(LanguageChosen, Language[Language],0), FALSE)","v":"Oil shale and oil sands"},{"$f":"VLOOKUP(H547, LanguageData, MATCH(LanguageChosen, Language[Language],0), FALSE)","v":"Stocks - beginning of period"},null,5]
["STOCKEND",null,null,"OILSHALE",1,null,null,"Stocks - end of period","Oil shale and oil sands","2021M12",{"$f":"VLOOKUP(I548, LanguageData, MATCH(LanguageChosen, Language[Language],0), FALSE)","v":"Oil shale and oil sands"},{"$f":"VLOOKUP(H548, LanguageData, MATCH(LanguageChosen, Language[Language],0), FALSE)","v":"Stocks - end of period"},null,5]
["STCHANAT",null,null,"OILSHALE",1,null,null,"Stock changes","Oil shale and oil sands","2021M12",{"$f":"VLOOKUP(I549, LanguageData, MATCH(LanguageChosen, Language[Language],0), FALSE)","v":"Oil shale and oil sands"},{"$f":"VLOOKUP(H549, LanguageData, MATCH(LanguageChosen, Language[Language],0), FALSE)","v":"Stock changes"},null,5]
["INDCONC",null,null,"OILSHALE",1,null,null,"Calculated inland deliveries","Oil shale and oil sands","2021M12",{"$f":"VLOOKUP(I550, LanguageData, MATCH(LanguageChosen, Language[Language],0), FALSE)","v":"Oil shale and oil sands"},{"$f":"VLOOKUP(H550, LanguageData, MATCH(LanguageChosen, Language[Language],0), FALSE)","v":"Calculated inland deliveries"},null,5]
["STATDIFF",null,null,"OILSHALE",1,null,null,"Statistical differences","Oil shale and oil sands","2021M12",{"$f":"VLOOKUP(I551, LanguageData, MATCH(LanguageChosen, Language[Language],0), FALSE)","v":"Oil shale and oil sands"},{"$f":"VLOOKUP(H551, LanguageData, MATCH(LanguageChosen, Language[Language],0), FALSE)","v":"Statistical differences"},null,5]
["INTERNAD",null,null,"OILSHALE",1,null,null,"Internal market deliveries (observed)","Oil shale and oil sands","2021M12",{"$f":"VLOOKUP(I552, LanguageData, MATCH(LanguageChosen, Language[Language],0), FALSE)","v":"Oil shale and oil sands"},{"$f":"VLOOKUP(H552, LanguageData, MATCH(LanguageChosen, Language[Language],0), FALSE)","v":"Internal market deliveries (observed)"},null,5]
["MAINPROD",null,null,"OILSHALE",1,null,null,"Deliveries to main activity producers","Oil shale and oil sands","2021M12",{"$f":"VLOOKUP(I553, LanguageData, MATCH(LanguageChosen, Language[Language],0), FALSE)","v":"Oil shale and oil sands"},{"$f":"VLOOKUP(H553, LanguageData, MATCH(LanguageChosen, Language[Language],0), FALSE)","v":"Deliveries to main activity producers"},null,5]
["ECOKEOVS",null,null,"OILSHALE",1,null,null,"Deliveries to coking plants","Oil shale and oil sands","2021M12",{"$f":"VLOOKUP(I554, LanguageData, MATCH(LanguageChosen, Language[Language],0), FALSE)","v":"Oil shale and oil sands"},{"$f":"VLOOKUP(H554, LanguageData, MATCH(LanguageChosen, Language[Language],0), FALSE)","v":"Deliveries to coking plants"},null,5]
["TOTIND",null,null,"OILSHALE",1,null,null,"Deliveries to total industry","Oil shale and oil sands","2021M12",{"$f":"VLOOKUP(I555, LanguageData, MATCH(LanguageChosen, Language[Language],0), FALSE)","v":"Oil shale and oil sands"},{"$f":"VLOOKUP(H555, LanguageData, MATCH(LanguageChosen, Language[Language],0), FALSE)","v":"Deliveries to total industry"},null,5]
["IRONSTL",null,null,"OILSHALE",1,null,null,"Deliveries to total industry of which to iron and steel industry","Oil shale and oil sands","2021M12",{"$f":"VLOOKUP(I556, LanguageData, MATCH(LanguageChosen, Language[Language],0), FALSE)","v":"Oil shale and oil sands"},{"$f":"VLOOKUP(H556, LanguageData, MATCH(LanguageChosen, Language[Language],0), FALSE)","v":"Deliveries to total industry of which to iron and steel industry"},null,5]
["OTHER",null,null,"OILSHALE",1,null,null,"Other deliveries (services, households, …)","Oil shale and oil sands","2021M12",{"$f":"VLOOKUP(I557, LanguageData, MATCH(LanguageChosen, Language[Language],0), FALSE)","v":"Oil shale and oil sands"},{"$f":"VLOOKUP(H557, LanguageData, MATCH(LanguageChosen, Language[Language],0), FALSE)","v":"Other deliveries (services, households, …)"},null,5]
["INDPROD",null,null,"COKEOVEN",1,null,null,"Production ","Coke oven coke","2021M12",{"$f":"VLOOKUP(I558, LanguageData, MATCH(LanguageChosen, Language[Language],0), FALSE)","v":"Coke oven coke"},{"$f":"VLOOKUP(H558, LanguageData, MATCH(LanguageChosen, Language[Language],0), FALSE)","v":"Production "},null,5]
["OSOURCES",null,null,"COKEOVEN",1,null,null,"Recovered products","Coke oven coke","2021M12",{"$f":"VLOOKUP(I559, LanguageData, MATCH(LanguageChosen, Language[Language],0), FALSE)","v":"Coke oven coke"},{"$f":"VLOOKUP(H559, LanguageData, MATCH(LanguageChosen, Language[Language],0), FALSE)","v":"Recovered products"},null,5]
["TOTIMPSB",null,null,"COKEOVEN",1,null,null,"Total imports","Coke oven coke","2021M12",{"$f":"VLOOKUP(I560, LanguageData, MATCH(LanguageChosen, Language[Language],0), FALSE)","v":"Coke oven coke"},{"$f":"VLOOKUP(H560, LanguageData, MATCH(LanguageChosen, Language[Language],0), FALSE)","v":"Total imports"},null,5]
["TOTIMPSBEU",null,null,"COKEOVEN",1,null,null,"Imports: of which from outside EU","Coke oven coke","2021M12",{"$f":"VLOOKUP(I561, LanguageData, MATCH(LanguageChosen, Language[Language],0), FALSE)","v":"Coke oven coke"},{"$f":"VLOOKUP(H561, LanguageData, MATCH(LanguageChosen, Language[Language],0), FALSE)","v":"Imports: of which from outside EU"},null,5]
["TOTEXPSB",null,null,"COKEOVEN",1,null,null,"Total exports","Coke oven coke","2021M12",{"$f":"VLOOKUP(I562, LanguageData, MATCH(LanguageChosen, Language[Language],0), FALSE)","v":"Coke oven coke"},{"$f":"VLOOKUP(H562, LanguageData, MATCH(LanguageChosen, Language[Language],0), FALSE)","v":"Total exports"},null,5]
["STOCKSTART",null,null,"COKEOVEN",1,null,null,"Stocks - beginning of period","Coke oven coke","2021M12",{"$f":"VLOOKUP(I563, LanguageData, MATCH(LanguageChosen, Language[Language],0), FALSE)","v":"Coke oven coke"},{"$f":"VLOOKUP(H563, LanguageData, MATCH(LanguageChosen, Language[Language],0), FALSE)","v":"Stocks - beginning of period"},null,5]
["STOCKEND",null,null,"COKEOVEN",1,null,null,"Stocks - end of period","Coke oven coke","2021M12",{"$f":"VLOOKUP(I564, LanguageData, MATCH(LanguageChosen, Language[Language],0), FALSE)","v":"Coke oven coke"},{"$f":"VLOOKUP(H564, LanguageData, MATCH(LanguageChosen, Language[Language],0), FALSE)","v":"Stocks - end of period"},null,5]
["STCHANAT",null,null,"COKEOVEN",1,null,null,"Stock changes","Coke oven coke","2021M12",{"$f":"VLOOKUP(I565, LanguageData, MATCH(LanguageChosen, Language[Language],0), FALSE)","v":"Coke oven coke"},{"$f":"VLOOKUP(H565, LanguageData, MATCH(LanguageChosen, Language[Language],0), FALSE)","v":"Stock changes"},null,5]
["INDCONC",null,null,"COKEOVEN",1,null,null,"Calculated inland deliveries","Coke oven coke","2021M12",{"$f":"VLOOKUP(I566, LanguageData, MATCH(LanguageChosen, Language[Language],0), FALSE)","v":"Coke oven coke"},{"$f":"VLOOKUP(H566, LanguageData, MATCH(LanguageChosen, Language[Language],0), FALSE)","v":"Calculated inland deliveries"},null,5]
["STATDIFF",null,null,"COKEOVEN",1,null,null,"Statistical differences","Coke oven coke","2021M12",{"$f":"VLOOKUP(I567, LanguageData, MATCH(LanguageChosen, Language[Language],0), FALSE)","v":"Coke oven coke"},{"$f":"VLOOKUP(H567, LanguageData, MATCH(LanguageChosen, Language[Language],0), FALSE)","v":"Statistical differences"},null,5]
["INTERNAD",null,null,"COKEOVEN",1,null,null,"Internal market deliveries (observed)","Coke oven coke","2021M12",{"$f":"VLOOKUP(I568, LanguageData, MATCH(LanguageChosen, Language[Language],0), FALSE)","v":"Coke oven coke"},{"$f":"VLOOKUP(H568, LanguageData, MATCH(LanguageChosen, Language[Language],0), FALSE)","v":"Internal market deliveries (observed)"},null,5]
["MAINPROD",null,null,"COKEOVEN",1,null,null,"Deliveries to main activity producers","Coke oven coke","2021M12",{"$f":"VLOOKUP(I569, LanguageData, MATCH(LanguageChosen, Language[Language],0), FALSE)","v":"Coke oven coke"},{"$f":"VLOOKUP(H569, LanguageData, MATCH(LanguageChosen, Language[Language],0), FALSE)","v":"Deliveries to main activity producers"},null,5]
["ECOKEOVS",null,null,"COKEOVEN",1,null,null,"Deliveries to coking plants","Coke oven coke","2021M12",{"$f":"VLOOKUP(I570, LanguageData, MATCH(LanguageChosen, Language[Language],0), FALSE)","v":"Coke oven coke"},{"$f":"VLOOKUP(H570, LanguageData, MATCH(LanguageChosen, Language[Language],0), FALSE)","v":"Deliveries to coking plants"},null,5]
["TOTIND",null,null,"COKEOVEN",1,null,null,"Deliveries to total industry","Coke oven coke","2021M12",{"$f":"VLOOKUP(I571, LanguageData, MATCH(LanguageChosen, Language[Language],0), FALSE)","v":"Coke oven coke"},{"$f":"VLOOKUP(H571, LanguageData, MATCH(LanguageChosen, Language[Language],0), FALSE)","v":"Deliveries to total industry"},null,5]
["IRONSTL",null,null,"COKEOVEN",1,null,null,"Deliveries to total industry of which to iron and steel industry","Coke oven coke","2021M12",{"$f":"VLOOKUP(I572, LanguageData, MATCH(LanguageChosen, Language[Language],0), FALSE)","v":"Coke oven coke"},{"$f":"VLOOKUP(H572, LanguageData, MATCH(LanguageChosen, Language[Language],0), FALSE)","v":"Deliveries to total industry of which to iron and steel industry"},null,5]
["OTHER",null,null,"COKEOVEN",1,null,null,"Other deliveries (services, households, …)","Coke oven coke","2021M12",{"$f":"VLOOKUP(I573, LanguageData, MATCH(LanguageChosen, Language[Language],0), FALSE)","v":"Coke oven coke"},{"$f":"VLOOKUP(H573, LanguageData, MATCH(LanguageChosen, Language[Language],0), FALSE)","v":"Other deliveries (services, households, …)"},null,5]
["INDPROD",null,null,"HARDCOAL",1,null,null,"Production ","Hard coal","2022M01",{"$f":"VLOOKUP(I574, LanguageData, MATCH(LanguageChosen, Language[Language],0), FALSE)","v":"Hard coal"},{"$f":"VLOOKUP(H574, LanguageData, MATCH(LanguageChosen, Language[Language],0), FALSE)","v":"Production "},null,4]
["OSOURCES",null,null,"HARDCOAL",1,null,null,"Recovered products","Hard coal","2022M01",{"$f":"VLOOKUP(I575, LanguageData, MATCH(LanguageChosen, Language[Language],0), FALSE)","v":"Hard coal"},{"$f":"VLOOKUP(H575, LanguageData, MATCH(LanguageChosen, Language[Language],0), FALSE)","v":"Recovered products"},null,4]
["TOTIMPSB",null,null,"HARDCOAL",1,null,null,"Total imports","Hard coal","2022M01",{"$f":"VLOOKUP(I576, LanguageData, MATCH(LanguageChosen, Language[Language],0), FALSE)","v":"Hard coal"},{"$f":"VLOOKUP(H576, LanguageData, MATCH(LanguageChosen, Language[Language],0), FALSE)","v":"Total imports"},null,4]
["TOTIMPSBEU",null,null,"HARDCOAL",1,null,null,"Imports: of which from outside EU","Hard coal","2022M01",{"$f":"VLOOKUP(I577, LanguageData, MATCH(LanguageChosen, Language[Language],0), FALSE)","v":"Hard coal"},{"$f":"VLOOKUP(H577, LanguageData, MATCH(LanguageChosen, Language[Language],0), FALSE)","v":"Imports: of which from outside EU"},null,4]
["TOTEXPSB",null,null,"HARDCOAL",1,null,null,"Total exports","Hard coal","2022M01",{"$f":"VLOOKUP(I578, LanguageData, MATCH(LanguageChosen, Language[Language],0), FALSE)","v":"Hard coal"},{"$f":"VLOOKUP(H578, LanguageData, MATCH(LanguageChosen, Language[Language],0), FALSE)","v":"Total exports"},null,4]
["STOCKSTART",null,null,"HARDCOAL",1,null,null,"Stocks - beginning of period","Hard coal","2022M01",{"$f":"VLOOKUP(I579, LanguageData, MATCH(LanguageChosen, Language[Language],0), FALSE)","v":"Hard coal"},{"$f":"VLOOKUP(H579, LanguageData, MATCH(LanguageChosen, Language[Language],0), FALSE)","v":"Stocks - beginning of period"},null,4]
["STOCKEND",null,null,"HARDCOAL",1,null,null,"Stocks - end of period","Hard coal","2022M01",{"$f":"VLOOKUP(I580, LanguageData, MATCH(LanguageChosen, Language[Language],0), FALSE)","v":"Hard coal"},{"$f":"VLOOKUP(H580, LanguageData, MATCH(LanguageChosen, Language[Language],0), FALSE)","v":"Stocks - end of period"},null,4]
["STCHANAT",null,null,"HARDCOAL",1,null,null,"Stock changes","Hard coal","2022M01",{"$f":"VLOOKUP(I581, LanguageData, MATCH(LanguageChosen, Language[Language],0), FALSE)","v":"Hard coal"},{"$f":"VLOOKUP(H581, LanguageData, MATCH(LanguageChosen, Language[Language],0), FALSE)","v":"Stock changes"},null,4]
["INDCONC",null,null,"HARDCOAL",1,null,null,"Calculated inland deliveries","Hard coal","2022M01",{"$f":"VLOOKUP(I582, LanguageData, MATCH(LanguageChosen, Language[Language],0), FALSE)","v":"Hard coal"},{"$f":"VLOOKUP(H582, LanguageData, MATCH(LanguageChosen, Language[Language],0), FALSE)","v":"Calculated inland deliveries"},null,4]
["STATDIFF",null,null,"HARDCOAL",1,null,null,"Statistical differences","Hard coal","2022M01",{"$f":"VLOOKUP(I583, LanguageData, MATCH(LanguageChosen, Language[Language],0), FALSE)","v":"Hard coal"},{"$f":"VLOOKUP(H583, LanguageData, MATCH(LanguageChosen, Language[Language],0), FALSE)","v":"Statistical differences"},null,4]
["INTERNAD",null,null,"HARDCOAL",1,null,null,"Internal market deliveries (observed)","Hard coal","2022M01",{"$f":"VLOOKUP(I584, LanguageData, MATCH(LanguageChosen, Language[Language],0), FALSE)","v":"Hard coal"},{"$f":"VLOOKUP(H584, LanguageData, MATCH(LanguageChosen, Language[Language],0), FALSE)","v":"Internal market deliveries (observed)"},null,4]
["MAINPROD",null,null,"HARDCOAL",1,null,null,"Deliveries to main activity producers","Hard coal","2022M01",{"$f":"VLOOKUP(I585, LanguageData, MATCH(LanguageChosen, Language[Language],0), FALSE)","v":"Hard coal"},{"$f":"VLOOKUP(H585, LanguageData, MATCH(LanguageChosen, Language[Language],0), FALSE)","v":"Deliveries to main activity producers"},null,4]
["ECOKEOVS",null,null,"HARDCOAL",1,null,null,"Deliveries to coking plants","Hard coal","2022M01",{"$f":"VLOOKUP(I586, LanguageData, MATCH(LanguageChosen, Language[Language],0), FALSE)","v":"Hard coal"},{"$f":"VLOOKUP(H586, LanguageData, MATCH(LanguageChosen, Language[Language],0), FALSE)","v":"Deliveries to coking plants"},null,4]
["TOTIND",null,null,"HARDCOAL",1,null,null,"Deliveries to total industry","Hard coal","2022M01",{"$f":"VLOOKUP(I587, LanguageData, MATCH(LanguageChosen, Language[Language],0), FALSE)","v":"Hard coal"},{"$f":"VLOOKUP(H587, LanguageData, MATCH(LanguageChosen, Language[Language],0), FALSE)","v":"Deliveries to total industry"},null,4]
["IRONSTL",null,null,"HARDCOAL",1,null,null,"Deliveries to total industry of which to iron and steel industry","Hard coal","2022M01",{"$f":"VLOOKUP(I588, LanguageData, MATCH(LanguageChosen, Language[Language],0), FALSE)","v":"Hard coal"},{"$f":"VLOOKUP(H588, LanguageData, MATCH(LanguageChosen, Language[Language],0), FALSE)","v":"Deliveries to total industry of which to iron and steel industry"},null,4]
["OTHER",null,null,"HARDCOAL",1,null,null,"Other deliveries (services, households, …)","Hard coal","2022M01",{"$f":"VLOOKUP(I589, LanguageData, MATCH(LanguageChosen, Language[Language],0), FALSE)","v":"Hard coal"},{"$f":"VLOOKUP(H589, LanguageData, MATCH(LanguageChosen, Language[Language],0), FALSE)","v":"Other deliveries (services, households, …)"},null,4]
["INDPROD",null,null,"BROWN",1,null,null,"Production ","Brown coal","2022M01",{"$f":"VLOOKUP(I590, LanguageData, MATCH(LanguageChosen, Language[Language],0), FALSE)","v":"Brown coal"},{"$f":"VLOOKUP(H590, LanguageData, MATCH(LanguageChosen, Language[Language],0), FALSE)","v":"Production "},null,4]
["OSOURCES",null,null,"BROWN",1,null,null,"Recovered products","Brown coal",{"$f":"YEAR(DATE(LEFT($B$1,4),RIGHT($B$1,2)-N591,1)) & \"M\" & TEXT(MONTH(DATE(LEFT($B$1,4),RIGHT($B$1,2)-N591,1)),\"00\")","v":"2022M01"},{"$f":"VLOOKUP(I591, LanguageData, MATCH(LanguageChosen, Language[Language],0), FALSE)","v":"Brown coal"},{"$f":"VLOOKUP(H591, LanguageData, MATCH(LanguageChosen, Language[Language],0), FALSE)","v":"Recovered products"},null,4]
["TOTIMPSB",null,null,"BROWN",1,null,null,"Total imports","Brown coal","2022M01",{"$f":"VLOOKUP(I592, LanguageData, MATCH(LanguageChosen, Language[Language],0), FALSE)","v":"Brown coal"},{"$f":"VLOOKUP(H592, LanguageData, MATCH(LanguageChosen, Language[Language],0), FALSE)","v":"Total imports"},null,4]
["TOTIMPSBEU",null,null,"BROWN",1,null,null,"Imports: of which from outside EU","Brown coal","2022M01",{"$f":"VLOOKUP(I593, LanguageData, MATCH(LanguageChosen, Language[Language],0), FALSE)","v":"Brown coal"},{"$f":"VLOOKUP(H593, LanguageData, MATCH(LanguageChosen, Language[Language],0), FALSE)","v":"Imports: of which from outside EU"},null,4]
["TOTEXPSB",null,null,"BROWN",1,null,null,"Total exports","Brown coal","2022M01",{"$f":"VLOOKUP(I594, LanguageData, MATCH(LanguageChosen, Language[Language],0), FALSE)","v":"Brown coal"},{"$f":"VLOOKUP(H594, LanguageData, MATCH(LanguageChosen, Language[Language],0), FALSE)","v":"Total exports"},null,4]
["STOCKSTART",null,null,"BROWN",1,null,null,"Stocks - beginning of period","Brown coal","2022M01",{"$f":"VLOOKUP(I595, LanguageData, MATCH(LanguageChosen, Language[Language],0), FALSE)","v":"Brown coal"},{"$f":"VLOOKUP(H595, LanguageData, MATCH(LanguageChosen, Language[Language],0), FALSE)","v":"Stocks - beginning of period"},null,4]
["STOCKEND",null,null,"BROWN",1,null,null,"Stocks - end of period","Brown coal","2022M01",{"$f":"VLOOKUP(I596, LanguageData, MATCH(LanguageChosen, Language[Language],0), FALSE)","v":"Brown coal"},{"$f":"VLOOKUP(H596, LanguageData, MATCH(LanguageChosen, Language[Language],0), FALSE)","v":"Stocks - end of period"},null,4]
["STCHANAT",null,null,"BROWN",1,null,null,"Stock changes","Brown coal","2022M01",{"$f":"VLOOKUP(I597, LanguageData, MATCH(LanguageChosen, Language[Language],0), FALSE)","v":"Brown coal"},{"$f":"VLOOKUP(H597, LanguageData, MATCH(LanguageChosen, Language[Language],0), FALSE)","v":"Stock changes"},null,4]
["INDCONC",null,null,"BROWN",1,null,null,"Calculated inland deliveries","Brown coal","2022M01",{"$f":"VLOOKUP(I598, LanguageData, MATCH(LanguageChosen, Language[Language],0), FALSE)","v":"Brown coal"},{"$f":"VLOOKUP(H598, LanguageData, MATCH(LanguageChosen, Language[Language],0), FALSE)","v":"Calculated inland deliveries"},null,4]
["STATDIFF",null,null,"BROWN",1,null,null,"Statistical differences","Brown coal","2022M01",{"$f":"VLOOKUP(I599, LanguageData, MATCH(LanguageChosen, Language[Language],0), FALSE)","v":"Brown coal"},{"$f":"VLOOKUP(H599, LanguageData, MATCH(LanguageChosen, Language[Language],0), FALSE)","v":"Statistical differences"},null,4]
["INTERNAD",null,null,"BROWN",1,null,null,"Internal market deliveries (observed)","Brown coal","2022M01",{"$f":"VLOOKUP(I600, LanguageData, MATCH(LanguageChosen, Language[Language],0), FALSE)","v":"Brown coal"},{"$f":"VLOOKUP(H600, LanguageData, MATCH(LanguageChosen, Language[Language],0), FALSE)","v":"Internal market deliveries (observed)"},null,4]
["MAINPROD",null,null,"BROWN",1,null,null,"Deliveries to main activity producers","Brown coal","2022M01",{"$f":"VLOOKUP(I601, LanguageData, MATCH(LanguageChosen, Language[Language],0), FALSE)","v":"Brown coal"},{"$f":"VLOOKUP(H601, LanguageData, MATCH(LanguageChosen, Language[Language],0), FALSE)","v":"Deliveries to main activity producers"},null,4]
["ECOKEOVS",null,null,"BROWN",1,null,null,"Deliveries to coking plants","Brown coal","2022M01",{"$f":"VLOOKUP(I602, LanguageData, MATCH(LanguageChosen, Language[Language],0), FALSE)","v":"Brown coal"},{"$f":"VLOOKUP(H602, LanguageData, MATCH(LanguageChosen, Language[Language],0), FALSE)","v":"Deliveries to coking plants"},null,4]
["TOTIND",null,null,"BROWN",1,null,null,"Deliveries to total industry","Brown coal","2022M01",{"$f":"VLOOKUP(I603, LanguageData, MATCH(LanguageChosen, Language[Language],0), FALSE)","v":"Brown coal"},{"$f":"VLOOKUP(H603, LanguageData, MATCH(LanguageChosen, Language[Language],0), FALSE)","v":"Deliveries to total industry"},null,4]
["IRONSTL",null,null,"BROWN",1,null,null,"Deliveries to total industry of which to iron and steel industry","Brown coal","2022M01",{"$f":"VLOOKUP(I604, LanguageData, MATCH(LanguageChosen, Language[Language],0), FALSE)","v":"Brown coal"},{"$f":"VLOOKUP(H604, LanguageData, MATCH(LanguageChosen, Language[Language],0), FALSE)","v":"Deliveries to total industry of which to iron and steel industry"},null,4]
["OTHER",null,null,"BROWN",1,null,null,"Other deliveries (services, households, …)","Brown coal","2022M01",{"$f":"VLOOKUP(I605, LanguageData, MATCH(LanguageChosen, Language[Language],0), FALSE)","v":"Brown coal"},{"$f":"VLOOKUP(H605, LanguageData, MATCH(LanguageChosen, Language[Language],0), FALSE)","v":"Other deliveries (services, households, …)"},null,4]
["INDPROD",null,null,"PEAT",1,null,null,"Production ","Peat","2022M01",{"$f":"VLOOKUP(I606, LanguageData, MATCH(LanguageChosen, Language[Language],0), FALSE)","v":"Peat"},{"$f":"VLOOKUP(H606, LanguageData, MATCH(LanguageChosen, Language[Language],0), FALSE)","v":"Production "},null,4]
["OSOURCES",null,null,"PEAT",1,null,null,"Recovered products","Peat","2022M01",{"$f":"VLOOKUP(I607, LanguageData, MATCH(LanguageChosen, Language[Language],0), FALSE)","v":"Peat"},{"$f":"VLOOKUP(H607, LanguageData, MATCH(LanguageChosen, Language[Language],0), FALSE)","v":"Recovered products"},null,4]
["TOTIMPSB",null,null,"PEAT",1,null,null,"Total imports","Peat","2022M01",{"$f":"VLOOKUP(I608, LanguageData, MATCH(LanguageChosen, Language[Language],0), FALSE)","v":"Peat"},{"$f":"VLOOKUP(H608, LanguageData, MATCH(LanguageChosen, Language[Language],0), FALSE)","v":"Total imports"},null,4]
["TOTIMPSBEU",null,null,"PEAT",1,null,null,"Imports: of which from outside EU","Peat","2022M01",{"$f":"VLOOKUP(I609, LanguageData, MATCH(LanguageChosen, Language[Language],0), FALSE)","v":"Peat"},{"$f":"VLOOKUP(H609, LanguageData, MATCH(LanguageChosen, Language[Language],0), FALSE)","v":"Imports: of which from outside EU"},null,4]
["TOTEXPSB",null,null,"PEAT",1,null,null,"Total exports","Peat","2022M01",{"$f":"VLOOKUP(I610, LanguageData, MATCH(LanguageChosen, Language[Language],0), FALSE)","v":"Peat"},{"$f":"VLOOKUP(H610, LanguageData, MATCH(LanguageChosen, Language[Language],0), FALSE)","v":"Total exports"},null,4]
["STOCKSTART",null,null,"PEAT",1,null,null,"Stocks - beginning of period","Peat","2022M01",{"$f":"VLOOKUP(I611, LanguageData, MATCH(LanguageChosen, Language[Language],0), FALSE)","v":"Peat"},{"$f":"VLOOKUP(H611, LanguageData, MATCH(LanguageChosen, Language[Language],0), FALSE)","v":"Stocks - beginning of period"},null,4]
["STOCKEND",null,null,"PEAT",1,null,null,"Stocks - end of period","Peat","2022M01",{"$f":"VLOOKUP(I612, LanguageData, MATCH(LanguageChosen, Language[Language],0), FALSE)","v":"Peat"},{"$f":"VLOOKUP(H612, LanguageData, MATCH(LanguageChosen, Language[Language],0), FALSE)","v":"Stocks - end of period"},null,4]
["STCHANAT",null,null,"PEAT",1,null,null,"Stock changes","Peat","2022M01",{"$f":"VLOOKUP(I613, LanguageData, MATCH(LanguageChosen, Language[Language],0), FALSE)","v":"Peat"},{"$f":"VLOOKUP(H613, LanguageData, MATCH(LanguageChosen, Language[Language],0), FALSE)","v":"Stock changes"},null,4]
["INDCONC",null,null,"PEAT",1,null,null,"Calculated inland deliveries","Peat","2022M01",{"$f":"VLOOKUP(I614, LanguageData, MATCH(LanguageChosen, Language[Language],0), FALSE)","v":"Peat"},{"$f":"VLOOKUP(H614, LanguageData, MATCH(LanguageChosen, Language[Language],0), FALSE)","v":"Calculated inland deliveries"},null,4]
["STATDIFF",null,null,"PEAT",1,null,null,"Statistical differences","Peat","2022M01",{"$f":"VLOOKUP(I615, LanguageData, MATCH(LanguageChosen, Language[Language],0), FALSE)","v":"Peat"},{"$f":"VLOOKUP(H615, LanguageData, MATCH(LanguageChosen, Language[Language],0), FALSE)","v":"Statistical differences"},null,4]
["INTERNAD",null,null,"PEAT",1,null,null,"Internal market deliveries (observed)","Peat","2022M01",{"$f":"VLOOKUP(I616, LanguageData, MATCH(LanguageChosen, Language[Language],0), FALSE)","v":"Peat"},{"$f":"VLOOKUP(H616, LanguageData, MATCH(LanguageChosen, Language[Language],0), FALSE)","v":"Internal market deliveries (observed)"},null,4]
["MAINPROD",null,null,"PEAT",1,null,null,"Deliveries to main activity producers","Peat","2022M01",{"$f":"VLOOKUP(I617, LanguageData, MATCH(LanguageChosen, Language[Language],0), FALSE)","v":"Peat"},{"$f":"VLOOKUP(H617, LanguageData, MATCH(LanguageChosen, Language[Language],0), FALSE)","v":"Deliveries to main activity producers"},null,4]
["ECOKEOVS",null,null,"PEAT",1,null,null,"Deliveries to coking plants","Peat","2022M01",{"$f":"VLOOKUP(I618, LanguageData, MATCH(LanguageChosen, Language[Language],0), FALSE)","v":"Peat"},{"$f":"VLOOKUP(H618, LanguageData, MATCH(LanguageChosen, Language[Language],0), FALSE)","v":"Deliveries to coking plants"},null,4]
["TOTIND",null,null,"PEAT",1,null,null,"Deliveries to total industry","Peat","2022M01",{"$f":"VLOOKUP(I619, LanguageData, MATCH(LanguageChosen, Language[Language],0), FALSE)","v":"Peat"},{"$f":"VLOOKUP(H619, LanguageData, MATCH(LanguageChosen, Language[Language],0), FALSE)","v":"Deliveries to total industry"},null,4]
["IRONSTL",null,null,"PEAT",1,null,null,"Deliveries to total industry of which to iron and steel industry","Peat","2022M01",{"$f":"VLOOKUP(I620, LanguageData, MATCH(LanguageChosen, Language[Language],0), FALSE)","v":"Peat"},{"$f":"VLOOKUP(H620, LanguageData, MATCH(LanguageChosen, Language[Language],0), FALSE)","v":"Deliveries to total industry of which to iron and steel industry"},null,4]
["OTHER",null,null,"PEAT",1,null,null,"Other deliveries (services, households, …)","Peat","2022M01",{"$f":"VLOOKUP(I621, LanguageData, MATCH(LanguageChosen, Language[Language],0), FALSE)","v":"Peat"},{"$f":"VLOOKUP(H621, LanguageData, MATCH(LanguageChosen, Language[Language],0), FALSE)","v":"Other deliveries (services, households, …)"},null,4]
["INDPROD",null,null,"OILSHALE",1,null,null,"Production ","Oil shale and oil sands","2022M01",{"$f":"VLOOKUP(I622, LanguageData, MATCH(LanguageChosen, Language[Language],0), FALSE)","v":"Oil shale and oil sands"},{"$f":"VLOOKUP(H622, LanguageData, MATCH(LanguageChosen, Language[Language],0), FALSE)","v":"Production "},null,4]
["OSOURCES",null,null,"OILSHALE",1,null,null,"Recovered products","Oil shale and oil sands","2022M01",{"$f":"VLOOKUP(I623, LanguageData, MATCH(LanguageChosen, Language[Language],0), FALSE)","v":"Oil shale and oil sands"},{"$f":"VLOOKUP(H623, LanguageData, MATCH(LanguageChosen, Language[Language],0), FALSE)","v":"Recovered products"},null,4]
["TOTIMPSB",null,null,"OILSHALE",1,null,null,"Total imports","Oil shale and oil sands","2022M01",{"$f":"VLOOKUP(I624, LanguageData, MATCH(LanguageChosen, Language[Language],0), FALSE)","v":"Oil shale and oil sands"},{"$f":"VLOOKUP(H624, LanguageData, MATCH(LanguageChosen, Language[Language],0), FALSE)","v":"Total imports"},null,4]
["TOTIMPSBEU",null,null,"OILSHALE",1,null,null,"Imports: of which from outside EU","Oil shale and oil sands","2022M01",{"$f":"VLOOKUP(I625, LanguageData, MATCH(LanguageChosen, Language[Language],0), FALSE)","v":"Oil shale and oil sands"},{"$f":"VLOOKUP(H625, LanguageData, MATCH(LanguageChosen, Language[Language],0), FALSE)","v":"Imports: of which from outside EU"},null,4]
["TOTEXPSB",null,null,"OILSHALE",1,null,null,"Total exports","Oil shale and oil sands","2022M01",{"$f":"VLOOKUP(I626, LanguageData, MATCH(LanguageChosen, Language[Language],0), FALSE)","v":"Oil shale and oil sands"},{"$f":"VLOOKUP(H626, LanguageData, MATCH(LanguageChosen, Language[Language],0), FALSE)","v":"Total exports"},null,4]
["STOCKSTART",null,null,"OILSHALE",1,null,null,"Stocks - beginning of period","Oil shale and oil sands","2022M01",{"$f":"VLOOKUP(I627, LanguageData, MATCH(LanguageChosen, Language[Language],0), FALSE)","v":"Oil shale and oil sands"},{"$f":"VLOOKUP(H627, LanguageData, MATCH(LanguageChosen, Language[Language],0), FALSE)","v":"Stocks - beginning of period"},null,4]
["STOCKEND",null,null,"OILSHALE",1,null,null,"Stocks - end of period","Oil shale and oil sands","2022M01",{"$f":"VLOOKUP(I628, LanguageData, MATCH(LanguageChosen, Language[Language],0), FALSE)","v":"Oil shale and oil sands"},{"$f":"VLOOKUP(H628, LanguageData, MATCH(LanguageChosen, Language[Language],0), FALSE)","v":"Stocks - end of period"},null,4]
["STCHANAT",null,null,"OILSHALE",1,null,null,"Stock changes","Oil shale and oil sands","2022M01",{"$f":"VLOOKUP(I629, LanguageData, MATCH(LanguageChosen, Language[Language],0), FALSE)","v":"Oil shale and oil sands"},{"$f":"VLOOKUP(H629, LanguageData, MATCH(LanguageChosen, Language[Language],0), FALSE)","v":"Stock changes"},null,4]
["INDCONC",null,null,"OILSHALE",1,null,null,"Calculated inland deliveries","Oil shale and oil sands","2022M01",{"$f":"VLOOKUP(I630, LanguageData, MATCH(LanguageChosen, Language[Language],0), FALSE)","v":"Oil shale and oil sands"},{"$f":"VLOOKUP(H630, LanguageData, MATCH(LanguageChosen, Language[Language],0), FALSE)","v":"Calculated inland deliveries"},null,4]
["STATDIFF",null,null,"OILSHALE",1,null,null,"Statistical differences","Oil shale and oil sands","2022M01",{"$f":"VLOOKUP(I631, LanguageData, MATCH(LanguageChosen, Language[Language],0), FALSE)","v":"Oil shale and oil sands"},{"$f":"VLOOKUP(H631, LanguageData, MATCH(LanguageChosen, Language[Language],0), FALSE)","v":"Statistical differences"},null,4]
["INTERNAD",null,null,"OILSHALE",1,null,null,"Internal market deliveries (observed)","Oil shale and oil sands","2022M01",{"$f":"VLOOKUP(I632, LanguageData, MATCH(LanguageChosen, Language[Language],0), FALSE)","v":"Oil shale and oil sands"},{"$f":"VLOOKUP(H632, LanguageData, MATCH(LanguageChosen, Language[Language],0), FALSE)","v":"Internal market deliveries (observed)"},null,4]
["MAINPROD",null,null,"OILSHALE",1,null,null,"Deliveries to main activity producers","Oil shale and oil sands","2022M01",{"$f":"VLOOKUP(I633, LanguageData, MATCH(LanguageChosen, Language[Language],0), FALSE)","v":"Oil shale and oil sands"},{"$f":"VLOOKUP(H633, LanguageData, MATCH(LanguageChosen, Language[Language],0), FALSE)","v":"Deliveries to main activity producers"},null,4]
["ECOKEOVS",null,null,"OILSHALE",1,null,null,"Deliveries to coking plants","Oil shale and oil sands","2022M01",{"$f":"VLOOKUP(I634, LanguageData, MATCH(LanguageChosen, Language[Language],0), FALSE)","v":"Oil shale and oil sands"},{"$f":"VLOOKUP(H634, LanguageData, MATCH(LanguageChosen, Language[Language],0), FALSE)","v":"Deliveries to coking plants"},null,4]
["TOTIND",null,null,"OILSHALE",1,null,null,"Deliveries to total industry","Oil shale and oil sands","2022M01",{"$f":"VLOOKUP(I635, LanguageData, MATCH(LanguageChosen, Language[Language],0), FALSE)","v":"Oil shale and oil sands"},{"$f":"VLOOKUP(H635, LanguageData, MATCH(LanguageChosen, Language[Language],0), FALSE)","v":"Deliveries to total industry"},null,4]
["IRONSTL",null,null,"OILSHALE",1,null,null,"Deliveries to total industry of which to iron and steel industry","Oil shale and oil sands","2022M01",{"$f":"VLOOKUP(I636, LanguageData, MATCH(LanguageChosen, Language[Language],0), FALSE)","v":"Oil shale and oil sands"},{"$f":"VLOOKUP(H636, LanguageData, MATCH(LanguageChosen, Language[Language],0), FALSE)","v":"Deliveries to total industry of which to iron and steel industry"},null,4]
["OTHER",null,null,"OILSHALE",1,null,null,"Other deliveries (services, households, …)","Oil shale and oil sands","2022M01",{"$f":"VLOOKUP(I637, LanguageData, MATCH(LanguageChosen, Language[Language],0), FALSE)","v":"Oil shale and oil sands"},{"$f":"VLOOKUP(H637, LanguageData, MATCH(LanguageChosen, Language[Language],0), FALSE)","v":"Other deliveries (services, households, …)"},null,4]
["INDPROD",null,null,"COKEOVEN",1,null,null,"Production ","Coke oven coke","2022M01",{"$f":"VLOOKUP(I638, LanguageData, MATCH(LanguageChosen, Language[Language],0), FALSE)","v":"Coke oven coke"},{"$f":"VLOOKUP(H638, LanguageData, MATCH(LanguageChosen, Language[Language],0), FALSE)","v":"Production "},null,4]
["OSOURCES",null,null,"COKEOVEN",1,null,null,"Recovered products","Coke oven coke","2022M01",{"$f":"VLOOKUP(I639, LanguageData, MATCH(LanguageChosen, Language[Language],0), FALSE)","v":"Coke oven coke"},{"$f":"VLOOKUP(H639, LanguageData, MATCH(LanguageChosen, Language[Language],0), FALSE)","v":"Recovered products"},null,4]
["TOTIMPSB",null,null,"COKEOVEN",1,null,null,"Total imports","Coke oven coke","2022M01",{"$f":"VLOOKUP(I640, LanguageData, MATCH(LanguageChosen, Language[Language],0), FALSE)","v":"Coke oven coke"},{"$f":"VLOOKUP(H640, LanguageData, MATCH(LanguageChosen, Language[Language],0), FALSE)","v":"Total imports"},null,4]
["TOTIMPSBEU",null,null,"COKEOVEN",1,null,null,"Imports: of which from outside EU","Coke oven coke","2022M01",{"$f":"VLOOKUP(I641, LanguageData, MATCH(LanguageChosen, Language[Language],0), FALSE)","v":"Coke oven coke"},{"$f":"VLOOKUP(H641, LanguageData, MATCH(LanguageChosen, Language[Language],0), FALSE)","v":"Imports: of which from outside EU"},null,4]
["TOTEXPSB",null,null,"COKEOVEN",1,null,null,"Total exports","Coke oven coke","2022M01",{"$f":"VLOOKUP(I642, LanguageData, MATCH(LanguageChosen, Language[Language],0), FALSE)","v":"Coke oven coke"},{"$f":"VLOOKUP(H642, LanguageData, MATCH(LanguageChosen, Language[Language],0), FALSE)","v":"Total exports"},null,4]
["STOCKSTART",null,null,"COKEOVEN",1,null,null,"Stocks - beginning of period","Coke oven coke","2022M01",{"$f":"VLOOKUP(I643, LanguageData, MATCH(LanguageChosen, Language[Language],0), FALSE)","v":"Coke oven coke"},{"$f":"VLOOKUP(H643, LanguageData, MATCH(LanguageChosen, Language[Language],0), FALSE)","v":"Stocks - beginning of period"},null,4]
["STOCKEND",null,null,"COKEOVEN",1,null,null,"Stocks - end of period","Coke oven coke","2022M01",{"$f":"VLOOKUP(I644, LanguageData, MATCH(LanguageChosen, Language[Language],0), FALSE)","v":"Coke oven coke"},{"$f":"VLOOKUP(H644, LanguageData, MATCH(LanguageChosen, Language[Language],0), FALSE)","v":"Stocks - end of period"},null,4]
["STCHANAT",null,null,"COKEOVEN",1,null,null,"Stock changes","Coke oven coke","2022M01",{"$f":"VLOOKUP(I645, LanguageData, MATCH(LanguageChosen, Language[Language],0), FALSE)","v":"Coke oven coke"},{"$f":"VLOOKUP(H645, LanguageData, MATCH(LanguageChosen, Language[Language],0), FALSE)","v":"Stock changes"},null,4]
["INDCONC",null,null,"COKEOVEN",1,null,null,"Calculated inland deliveries","Coke oven coke","2022M01",{"$f":"VLOOKUP(I646, LanguageData, MATCH(LanguageChosen, Language[Language],0), FALSE)","v":"Coke oven coke"},{"$f":"VLOOKUP(H646, LanguageData, MATCH(LanguageChosen, Language[Language],0), FALSE)","v":"Calculated inland deliveries"},null,4]
["STATDIFF",null,null,"COKEOVEN",1,null,null,"Statistical differences","Coke oven coke","2022M01",{"$f":"VLOOKUP(I647, LanguageData, MATCH(LanguageChosen, Language[Language],0), FALSE)","v":"Coke oven coke"},{"$f":"VLOOKUP(H647, LanguageData, MATCH(LanguageChosen, Language[Language],0), FALSE)","v":"Statistical differences"},null,4]
["INTERNAD",null,null,"COKEOVEN",1,null,null,"Internal market deliveries (observed)","Coke oven coke","2022M01",{"$f":"VLOOKUP(I648, LanguageData, MATCH(LanguageChosen, Language[Language],0), FALSE)","v":"Coke oven coke"},{"$f":"VLOOKUP(H648, LanguageData, MATCH(LanguageChosen, Language[Language],0), FALSE)","v":"Internal market deliveries (observed)"},null,4]
["MAINPROD",null,null,"COKEOVEN",1,null,null,"Deliveries to main activity producers","Coke oven coke","2022M01",{"$f":"VLOOKUP(I649, LanguageData, MATCH(LanguageChosen, Language[Language],0), FALSE)","v":"Coke oven coke"},{"$f":"VLOOKUP(H649, LanguageData, MATCH(LanguageChosen, Language[Language],0), FALSE)","v":"Deliveries to main activity producers"},null,4]
["ECOKEOVS",null,null,"COKEOVEN",1,null,null,"Deliveries to coking plants","Coke oven coke","2022M01",{"$f":"VLOOKUP(I650, LanguageData, MATCH(LanguageChosen, Language[Language],0), FALSE)","v":"Coke oven coke"},{"$f":"VLOOKUP(H650, LanguageData, MATCH(LanguageChosen, Language[Language],0), FALSE)","v":"Deliveries to coking plants"},null,4]
["TOTIND",null,null,"COKEOVEN",1,null,null,"Deliveries to total industry","Coke oven coke","2022M01",{"$f":"VLOOKUP(I651, LanguageData, MATCH(LanguageChosen, Language[Language],0), FALSE)","v":"Coke oven coke"},{"$f":"VLOOKUP(H651, LanguageData, MATCH(LanguageChosen, Language[Language],0), FALSE)","v":"Deliveries to total industry"},null,4]
["IRONSTL",null,null,"COKEOVEN",1,null,null,"Deliveries to total industry of which to iron and steel industry","Coke oven coke","2022M01",{"$f":"VLOOKUP(I652, LanguageData, MATCH(LanguageChosen, Language[Language],0), FALSE)","v":"Coke oven coke"},{"$f":"VLOOKUP(H652, LanguageData, MATCH(LanguageChosen, Language[Language],0), FALSE)","v":"Deliveries to total industry of which to iron and steel industry"},null,4]
["OTHER",null,null,"COKEOVEN",1,null,null,"Other deliveries (services, households, …)","Coke oven coke","2022M01",{"$f":"VLOOKUP(I653, LanguageData, MATCH(LanguageChosen, Language[Language],0), FALSE)","v":"Coke oven coke"},{"$f":"VLOOKUP(H653, LanguageData, MATCH(LanguageChosen, Language[Language],0), FALSE)","v":"Other deliveries (services, households, …)"},null,4]
["INDPROD",null,null,"HARDCOAL",1,null,null,"Production ","Hard coal","2022M02",{"$f":"VLOOKUP(I654, LanguageData, MATCH(LanguageChosen, Language[Language],0), FALSE)","v":"Hard coal"},{"$f":"VLOOKUP(H654, LanguageData, MATCH(LanguageChosen, Language[Language],0), FALSE)","v":"Production "},null,3]
["OSOURCES",null,null,"HARDCOAL",1,null,null,"Recovered products","Hard coal",{"$f":"YEAR(DATE(LEFT($B$1,4),RIGHT($B$1,2)-N655,1)) & \"M\" & TEXT(MONTH(DATE(LEFT($B$1,4),RIGHT($B$1,2)-N655,1)),\"00\")","v":"2022M02"},{"$f":"VLOOKUP(I655, LanguageData, MATCH(LanguageChosen, Language[Language],0), FALSE)","v":"Hard coal"},{"$f":"VLOOKUP(H655, LanguageData, MATCH(LanguageChosen, Language[Language],0), FALSE)","v":"Recovered products"},null,3]
["TOTIMPSB",null,null,"HARDCOAL",1,null,null,"Total imports","Hard coal","2022M02",{"$f":"VLOOKUP(I656, LanguageData, MATCH(LanguageChosen, Language[Language],0), FALSE)","v":"Hard coal"},{"$f":"VLOOKUP(H656, LanguageData, MATCH(LanguageChosen, Language[Language],0), FALSE)","v":"Total imports"},null,3]
["TOTIMPSBEU",null,null,"HARDCOAL",1,null,null,"Imports: of which from outside EU","Hard coal","2022M02",{"$f":"VLOOKUP(I657, LanguageData, MATCH(LanguageChosen, Language[Language],0), FALSE)","v":"Hard coal"},{"$f":"VLOOKUP(H657, LanguageData, MATCH(LanguageChosen, Language[Language],0), FALSE)","v":"Imports: of which from outside EU"},null,3]
["TOTEXPSB",null,null,"HARDCOAL",1,null,null,"Total exports","Hard coal","2022M02",{"$f":"VLOOKUP(I658, LanguageData, MATCH(LanguageChosen, Language[Language],0), FALSE)","v":"Hard coal"},{"$f":"VLOOKUP(H658, LanguageData, MATCH(LanguageChosen, Language[Language],0), FALSE)","v":"Total exports"},null,3]
["STOCKSTART",null,null,"HARDCOAL",1,null,null,"Stocks - beginning of period","Hard coal","2022M02",{"$f":"VLOOKUP(I659, LanguageData, MATCH(LanguageChosen, Language[Language],0), FALSE)","v":"Hard coal"},{"$f":"VLOOKUP(H659, LanguageData, MATCH(LanguageChosen, Language[Language],0), FALSE)","v":"Stocks - beginning of period"},null,3]
["STOCKEND",null,null,"HARDCOAL",1,null,null,"Stocks - end of period","Hard coal","2022M02",{"$f":"VLOOKUP(I660, LanguageData, MATCH(LanguageChosen, Language[Language],0), FALSE)","v":"Hard coal"},{"$f":"VLOOKUP(H660, LanguageData, MATCH(LanguageChosen, Language[Language],0), FALSE)","v":"Stocks - end of period"},null,3]
["STCHANAT",null,null,"HARDCOAL",1,null,null,"Stock changes","Hard coal","2022M02",{"$f":"VLOOKUP(I661, LanguageData, MATCH(LanguageChosen, Language[Language],0), FALSE)","v":"Hard coal"},{"$f":"VLOOKUP(H661, LanguageData, MATCH(LanguageChosen, Language[Language],0), FALSE)","v":"Stock changes"},null,3]
["INDCONC",null,null,"HARDCOAL",1,null,null,"Calculated inland deliveries","Hard coal","2022M02",{"$f":"VLOOKUP(I662, LanguageData, MATCH(LanguageChosen, Language[Language],0), FALSE)","v":"Hard coal"},{"$f":"VLOOKUP(H662, LanguageData, MATCH(LanguageChosen, Language[Language],0), FALSE)","v":"Calculated inland deliveries"},null,3]
["STATDIFF",null,null,"HARDCOAL",1,null,null,"Statistical differences","Hard coal","2022M02",{"$f":"VLOOKUP(I663, LanguageData, MATCH(LanguageChosen, Language[Language],0), FALSE)","v":"Hard coal"},{"$f":"VLOOKUP(H663, LanguageData, MATCH(LanguageChosen, Language[Language],0), FALSE)","v":"Statistical differences"},null,3]
["INTERNAD",null,null,"HARDCOAL",1,null,null,"Internal market deliveries (observed)","Hard coal","2022M02",{"$f":"VLOOKUP(I664, LanguageData, MATCH(LanguageChosen, Language[Language],0), FALSE)","v":"Hard coal"},{"$f":"VLOOKUP(H664, LanguageData, MATCH(LanguageChosen, Language[Language],0), FALSE)","v":"Internal market deliveries (observed)"},null,3]
["MAINPROD",null,null,"HARDCOAL",1,null,null,"Deliveries to main activity producers","Hard coal","2022M02",{"$f":"VLOOKUP(I665, LanguageData, MATCH(LanguageChosen, Language[Language],0), FALSE)","v":"Hard coal"},{"$f":"VLOOKUP(H665, LanguageData, MATCH(LanguageChosen, Language[Language],0), FALSE)","v":"Deliveries to main activity producers"},null,3]
["ECOKEOVS",null,null,"HARDCOAL",1,null,null,"Deliveries to coking plants","Hard coal","2022M02",{"$f":"VLOOKUP(I666, LanguageData, MATCH(LanguageChosen, Language[Language],0), FALSE)","v":"Hard coal"},{"$f":"VLOOKUP(H666, LanguageData, MATCH(LanguageChosen, Language[Language],0), FALSE)","v":"Deliveries to coking plants"},null,3]
["TOTIND",null,null,"HARDCOAL",1,null,null,"Deliveries to total industry","Hard coal","2022M02",{"$f":"VLOOKUP(I667, LanguageData, MATCH(LanguageChosen, Language[Language],0), FALSE)","v":"Hard coal"},{"$f":"VLOOKUP(H667, LanguageData, MATCH(LanguageChosen, Language[Language],0), FALSE)","v":"Deliveries to total industry"},null,3]
["IRONSTL",null,null,"HARDCOAL",1,null,null,"Deliveries to total industry of which to iron and steel industry","Hard coal","2022M02",{"$f":"VLOOKUP(I668, LanguageData, MATCH(LanguageChosen, Language[Language],0), FALSE)","v":"Hard coal"},{"$f":"VLOOKUP(H668, LanguageData, MATCH(LanguageChosen, Language[Language],0), FALSE)","v":"Deliveries to total industry of which to iron and steel industry"},null,3]
["OTHER",null,null,"HARDCOAL",1,null,null,"Other deliveries (services, households, …)","Hard coal","2022M02",{"$f":"VLOOKUP(I669, LanguageData, MATCH(LanguageChosen, Language[Language],0), FALSE)","v":"Hard coal"},{"$f":"VLOOKUP(H669, LanguageData, MATCH(LanguageChosen, Language[Language],0), FALSE)","v":"Other deliveries (services, households, …)"},null,3]
["INDPROD",null,null,"BROWN",1,null,null,"Production ","Brown coal","2022M02",{"$f":"VLOOKUP(I670, LanguageData, MATCH(LanguageChosen, Language[Language],0), FALSE)","v":"Brown coal"},{"$f":"VLOOKUP(H670, LanguageData, MATCH(LanguageChosen, Language[Language],0), FALSE)","v":"Production "},null,3]
["OSOURCES",null,null,"BROWN",1,null,null,"Recovered products","Brown coal","2022M02",{"$f":"VLOOKUP(I671, LanguageData, MATCH(LanguageChosen, Language[Language],0), FALSE)","v":"Brown coal"},{"$f":"VLOOKUP(H671, LanguageData, MATCH(LanguageChosen, Language[Language],0), FALSE)","v":"Recovered products"},null,3]
["TOTIMPSB",null,null,"BROWN",1,null,null,"Total imports","Brown coal","2022M02",{"$f":"VLOOKUP(I672, LanguageData, MATCH(LanguageChosen, Language[Language],0), FALSE)","v":"Brown coal"},{"$f":"VLOOKUP(H672, LanguageData, MATCH(LanguageChosen, Language[Language],0), FALSE)","v":"Total imports"},null,3]
["TOTIMPSBEU",null,null,"BROWN",1,null,null,"Imports: of which from outside EU","Brown coal","2022M02",{"$f":"VLOOKUP(I673, LanguageData, MATCH(LanguageChosen, Language[Language],0), FALSE)","v":"Brown coal"},{"$f":"VLOOKUP(H673, LanguageData, MATCH(LanguageChosen, Language[Language],0), FALSE)","v":"Imports: of which from outside EU"},null,3]
["TOTEXPSB",null,null,"BROWN",1,null,null,"Total exports","Brown coal","2022M02",{"$f":"VLOOKUP(I674, LanguageData, MATCH(LanguageChosen, Language[Language],0), FALSE)","v":"Brown coal"},{"$f":"VLOOKUP(H674, LanguageData, MATCH(LanguageChosen, Language[Language],0), FALSE)","v":"Total exports"},null,3]
["STOCKSTART",null,null,"BROWN",1,null,null,"Stocks - beginning of period","Brown coal","2022M02",{"$f":"VLOOKUP(I675, LanguageData, MATCH(LanguageChosen, Language[Language],0), FALSE)","v":"Brown coal"},{"$f":"VLOOKUP(H675, LanguageData, MATCH(LanguageChosen, Language[Language],0), FALSE)","v":"Stocks - beginning of period"},null,3]
["STOCKEND",null,null,"BROWN",1,null,null,"Stocks - end of period","Brown coal","2022M02",{"$f":"VLOOKUP(I676, LanguageData, MATCH(LanguageChosen, Language[Language],0), FALSE)","v":"Brown coal"},{"$f":"VLOOKUP(H676, LanguageData, MATCH(LanguageChosen, Language[Language],0), FALSE)","v":"Stocks - end of period"},null,3]
["STCHANAT",null,null,"BROWN",1,null,null,"Stock changes","Brown coal","2022M02",{"$f":"VLOOKUP(I677, LanguageData, MATCH(LanguageChosen, Language[Language],0), FALSE)","v":"Brown coal"},{"$f":"VLOOKUP(H677, LanguageData, MATCH(LanguageChosen, Language[Language],0), FALSE)","v":"Stock changes"},null,3]
["INDCONC",null,null,"BROWN",1,null,null,"Calculated inland deliveries","Brown coal","2022M02",{"$f":"VLOOKUP(I678, LanguageData, MATCH(LanguageChosen, Language[Language],0), FALSE)","v":"Brown coal"},{"$f":"VLOOKUP(H678, LanguageData, MATCH(LanguageChosen, Language[Language],0), FALSE)","v":"Calculated inland deliveries"},null,3]
["STATDIFF",null,null,"BROWN",1,null,null,"Statistical differences","Brown coal","2022M02",{"$f":"VLOOKUP(I679, LanguageData, MATCH(LanguageChosen, Language[Language],0), FALSE)","v":"Brown coal"},{"$f":"VLOOKUP(H679, LanguageData, MATCH(LanguageChosen, Language[Language],0), FALSE)","v":"Statistical differences"},null,3]
["INTERNAD",null,null,"BROWN",1,null,null,"Internal market deliveries (observed)","Brown coal","2022M02",{"$f":"VLOOKUP(I680, LanguageData, MATCH(LanguageChosen, Language[Language],0), FALSE)","v":"Brown coal"},{"$f":"VLOOKUP(H680, LanguageData, MATCH(LanguageChosen, Language[Language],0), FALSE)","v":"Internal market deliveries (observed)"},null,3]
["MAINPROD",null,null,"BROWN",1,null,null,"Deliveries to main activity producers","Brown coal","2022M02",{"$f":"VLOOKUP(I681, LanguageData, MATCH(LanguageChosen, Language[Language],0), FALSE)","v":"Brown coal"},{"$f":"VLOOKUP(H681, LanguageData, MATCH(LanguageChosen, Language[Language],0), FALSE)","v":"Deliveries to main activity producers"},null,3]
["ECOKEOVS",null,null,"BROWN",1,null,null,"Deliveries to coking plants","Brown coal","2022M02",{"$f":"VLOOKUP(I682, LanguageData, MATCH(LanguageChosen, Language[Language],0), FALSE)","v":"Brown coal"},{"$f":"VLOOKUP(H682, LanguageData, MATCH(LanguageChosen, Language[Language],0), FALSE)","v":"Deliveries to coking plants"},null,3]
["TOTIND",null,null,"BROWN",1,null,null,"Deliveries to total industry","Brown coal","2022M02",{"$f":"VLOOKUP(I683, LanguageData, MATCH(LanguageChosen, Language[Language],0), FALSE)","v":"Brown coal"},{"$f":"VLOOKUP(H683, LanguageData, MATCH(LanguageChosen, Language[Language],0), FALSE)","v":"Deliveries to total industry"},null,3]
["IRONSTL",null,null,"BROWN",1,null,null,"Deliveries to total industry of which to iron and steel industry","Brown coal","2022M02",{"$f":"VLOOKUP(I684, LanguageData, MATCH(LanguageChosen, Language[Language],0), FALSE)","v":"Brown coal"},{"$f":"VLOOKUP(H684, LanguageData, MATCH(LanguageChosen, Language[Language],0), FALSE)","v":"Deliveries to total industry of which to iron and steel industry"},null,3]
["OTHER",null,null,"BROWN",1,null,null,"Other deliveries (services, households, …)","Brown coal","2022M02",{"$f":"VLOOKUP(I685, LanguageData, MATCH(LanguageChosen, Language[Language],0), FALSE)","v":"Brown coal"},{"$f":"VLOOKUP(H685, LanguageData, MATCH(LanguageChosen, Language[Language],0), FALSE)","v":"Other deliveries (services, households, …)"},null,3]
["INDPROD",null,null,"PEAT",1,null,null,"Production ","Peat","2022M02",{"$f":"VLOOKUP(I686, LanguageData, MATCH(LanguageChosen, Language[Language],0), FALSE)","v":"Peat"},{"$f":"VLOOKUP(H686, LanguageData, MATCH(LanguageChosen, Language[Language],0), FALSE)","v":"Production "},null,3]
["OSOURCES",null,null,"PEAT",1,null,null,"Recovered products","Peat","2022M02",{"$f":"VLOOKUP(I687, LanguageData, MATCH(LanguageChosen, Language[Language],0), FALSE)","v":"Peat"},{"$f":"VLOOKUP(H687, LanguageData, MATCH(LanguageChosen, Language[Language],0), FALSE)","v":"Recovered products"},null,3]
["TOTIMPSB",null,null,"PEAT",1,null,null,"Total imports","Peat","2022M02",{"$f":"VLOOKUP(I688, LanguageData, MATCH(LanguageChosen, Language[Language],0), FALSE)","v":"Peat"},{"$f":"VLOOKUP(H688, LanguageData, MATCH(LanguageChosen, Language[Language],0), FALSE)","v":"Total imports"},null,3]
["TOTIMPSBEU",null,null,"PEAT",1,null,null,"Imports: of which from outside EU","Peat","2022M02",{"$f":"VLOOKUP(I689, LanguageData, MATCH(LanguageChosen, Language[Language],0), FALSE)","v":"Peat"},{"$f":"VLOOKUP(H689, LanguageData, MATCH(LanguageChosen, Language[Language],0), FALSE)","v":"Imports: of which from outside EU"},null,3]
["TOTEXPSB",null,null,"PEAT",1,null,null,"Total exports","Peat","2022M02",{"$f":"VLOOKUP(I690, LanguageData, MATCH(LanguageChosen, Language[Language],0), FALSE)","v":"Peat"},{"$f":"VLOOKUP(H690, LanguageData, MATCH(LanguageChosen, Language[Language],0), FALSE)","v":"Total exports"},null,3]
["STOCKSTART",null,null,"PEAT",1,null,null,"Stocks - beginning of period","Peat","2022M02",{"$f":"VLOOKUP(I691, LanguageData, MATCH(LanguageChosen, Language[Language],0), FALSE)","v":"Peat"},{"$f":"VLOOKUP(H691, LanguageData, MATCH(LanguageChosen, Language[Language],0), FALSE)","v":"Stocks - beginning of period"},null,3]
["STOCKEND",null,null,"PEAT",1,null,null,"Stocks - end of period","Peat","2022M02",{"$f":"VLOOKUP(I692, LanguageData, MATCH(LanguageChosen, Language[Language],0), FALSE)","v":"Peat"},{"$f":"VLOOKUP(H692, LanguageData, MATCH(LanguageChosen, Language[Language],0), FALSE)","v":"Stocks - end of period"},null,3]
["STCHANAT",null,null,"PEAT",1,null,null,"Stock changes","Peat","2022M02",{"$f":"VLOOKUP(I693, LanguageData, MATCH(LanguageChosen, Language[Language],0), FALSE)","v":"Peat"},{"$f":"VLOOKUP(H693, LanguageData, MATCH(LanguageChosen, Language[Language],0), FALSE)","v":"Stock changes"},null,3]
["INDCONC",null,null,"PEAT",1,null,null,"Calculated inland deliveries","Peat","2022M02",{"$f":"VLOOKUP(I694, LanguageData, MATCH(LanguageChosen, Language[Language],0), FALSE)","v":"Peat"},{"$f":"VLOOKUP(H694, LanguageData, MATCH(LanguageChosen, Language[Language],0), FALSE)","v":"Calculated inland deliveries"},null,3]
["STATDIFF",null,null,"PEAT",1,null,null,"Statistical differences","Peat","2022M02",{"$f":"VLOOKUP(I695, LanguageData, MATCH(LanguageChosen, Language[Language],0), FALSE)","v":"Peat"},{"$f":"VLOOKUP(H695, LanguageData, MATCH(LanguageChosen, Language[Language],0), FALSE)","v":"Statistical differences"},null,3]
["INTERNAD",null,null,"PEAT",1,null,null,"Internal market deliveries (observed)","Peat","2022M02",{"$f":"VLOOKUP(I696, LanguageData, MATCH(LanguageChosen, Language[Language],0), FALSE)","v":"Peat"},{"$f":"VLOOKUP(H696, LanguageData, MATCH(LanguageChosen, Language[Language],0), FALSE)","v":"Internal market deliveries (observed)"},null,3]
["MAINPROD",null,null,"PEAT",1,null,null,"Deliveries to main activity producers","Peat","2022M02",{"$f":"VLOOKUP(I697, LanguageData, MATCH(LanguageChosen, Language[Language],0), FALSE)","v":"Peat"},{"$f":"VLOOKUP(H697, LanguageData, MATCH(LanguageChosen, Language[Language],0), FALSE)","v":"Deliveries to main activity producers"},null,3]
["ECOKEOVS",null,null,"PEAT",1,null,null,"Deliveries to coking plants","Peat","2022M02",{"$f":"VLOOKUP(I698, LanguageData, MATCH(LanguageChosen, Language[Language],0), FALSE)","v":"Peat"},{"$f":"VLOOKUP(H698, LanguageData, MATCH(LanguageChosen, Language[Language],0), FALSE)","v":"Deliveries to coking plants"},null,3]
["TOTIND",null,null,"PEAT",1,null,null,"Deliveries to total industry","Peat","2022M02",{"$f":"VLOOKUP(I699, LanguageData, MATCH(LanguageChosen, Language[Language],0), FALSE)","v":"Peat"},{"$f":"VLOOKUP(H699, LanguageData, MATCH(LanguageChosen, Language[Language],0), FALSE)","v":"Deliveries to total industry"},null,3]
["IRONSTL",null,null,"PEAT",1,null,null,"Deliveries to total industry of which to iron and steel industry","Peat","2022M02",{"$f":"VLOOKUP(I700, LanguageData, MATCH(LanguageChosen, Language[Language],0), FALSE)","v":"Peat"},{"$f":"VLOOKUP(H700, LanguageData, MATCH(LanguageChosen, Language[Language],0), FALSE)","v":"Deliveries to total industry of which to iron and steel industry"},null,3]
["OTHER",null,null,"PEAT",1,null,null,"Other deliveries (services, households, …)","Peat","2022M02",{"$f":"VLOOKUP(I701, LanguageData, MATCH(LanguageChosen, Language[Language],0), FALSE)","v":"Peat"},{"$f":"VLOOKUP(H701, LanguageData, MATCH(LanguageChosen, Language[Language],0), FALSE)","v":"Other deliveries (services, households, …)"},null,3]
["INDPROD",null,null,"OILSHALE",1,null,null,"Production ","Oil shale and oil sands","2022M02",{"$f":"VLOOKUP(I702, LanguageData, MATCH(LanguageChosen, Language[Language],0), FALSE)","v":"Oil shale and oil sands"},{"$f":"VLOOKUP(H702, LanguageData, MATCH(LanguageChosen, Language[Language],0), FALSE)","v":"Production "},null,3]
["OSOURCES",null,null,"OILSHALE",1,null,null,"Recovered products","Oil shale and oil sands","2022M02",{"$f":"VLOOKUP(I703, LanguageData, MATCH(LanguageChosen, Language[Language],0), FALSE)","v":"Oil shale and oil sands"},{"$f":"VLOOKUP(H703, LanguageData, MATCH(LanguageChosen, Language[Language],0), FALSE)","v":"Recovered products"},null,3]
["TOTIMPSB",null,null,"OILSHALE",1,null,null,"Total imports","Oil shale and oil sands","2022M02",{"$f":"VLOOKUP(I704, LanguageData, MATCH(LanguageChosen, Language[Language],0), FALSE)","v":"Oil shale and oil sands"},{"$f":"VLOOKUP(H704, LanguageData, MATCH(LanguageChosen, Language[Language],0), FALSE)","v":"Total imports"},null,3]
["TOTIMPSBEU",null,null,"OILSHALE",1,null,null,"Imports: of which from outside EU","Oil shale and oil sands","2022M02",{"$f":"VLOOKUP(I705, LanguageData, MATCH(LanguageChosen, Language[Language],0), FALSE)","v":"Oil shale and oil sands"},{"$f":"VLOOKUP(H705, LanguageData, MATCH(LanguageChosen, Language[Language],0), FALSE)","v":"Imports: of which from outside EU"},null,3]
["TOTEXPSB",null,null,"OILSHALE",1,null,null,"Total exports","Oil shale and oil sands","2022M02",{"$f":"VLOOKUP(I706, LanguageData, MATCH(LanguageChosen, Language[Language],0), FALSE)","v":"Oil shale and oil sands"},{"$f":"VLOOKUP(H706, LanguageData, MATCH(LanguageChosen, Language[Language],0), FALSE)","v":"Total exports"},null,3]
["STOCKSTART",null,null,"OILSHALE",1,null,null,"Stocks - beginning of period","Oil shale and oil sands","2022M02",{"$f":"VLOOKUP(I707, LanguageData, MATCH(LanguageChosen, Language[Language],0), FALSE)","v":"Oil shale and oil sands"},{"$f":"VLOOKUP(H707, LanguageData, MATCH(LanguageChosen, Language[Language],0), FALSE)","v":"Stocks - beginning of period"},null,3]
["STOCKEND",null,null,"OILSHALE",1,null,null,"Stocks - end of period","Oil shale and oil sands","2022M02",{"$f":"VLOOKUP(I708, LanguageData, MATCH(LanguageChosen, Language[Language],0), FALSE)","v":"Oil shale and oil sands"},{"$f":"VLOOKUP(H708, LanguageData, MATCH(LanguageChosen, Language[Language],0), FALSE)","v":"Stocks - end of period"},null,3]
["STCHANAT",null,null,"OILSHALE",1,null,null,"Stock changes","Oil shale and oil sands","2022M02",{"$f":"VLOOKUP(I709, LanguageData, MATCH(LanguageChosen, Language[Language],0), FALSE)","v":"Oil shale and oil sands"},{"$f":"VLOOKUP(H709, LanguageData, MATCH(LanguageChosen, Language[Language],0), FALSE)","v":"Stock changes"},null,3]
["INDCONC",null,null,"OILSHALE",1,null,null,"Calculated inland deliveries","Oil shale and oil sands","2022M02",{"$f":"VLOOKUP(I710, LanguageData, MATCH(LanguageChosen, Language[Language],0), FALSE)","v":"Oil shale and oil sands"},{"$f":"VLOOKUP(H710, LanguageData, MATCH(LanguageChosen, Language[Language],0), FALSE)","v":"Calculated inland deliveries"},null,3]
["STATDIFF",null,null,"OILSHALE",1,null,null,"Statistical differences","Oil shale and oil sands","2022M02",{"$f":"VLOOKUP(I711, LanguageData, MATCH(LanguageChosen, Language[Language],0), FALSE)","v":"Oil shale and oil sands"},{"$f":"VLOOKUP(H711, LanguageData, MATCH(LanguageChosen, Language[Language],0), FALSE)","v":"Statistical differences"},null,3]
["INTERNAD",null,null,"OILSHALE",1,null,null,"Internal market deliveries (observed)","Oil shale and oil sands","2022M02",{"$f":"VLOOKUP(I712, LanguageData, MATCH(LanguageChosen, Language[Language],0), FALSE)","v":"Oil shale and oil sands"},{"$f":"VLOOKUP(H712, LanguageData, MATCH(LanguageChosen, Language[Language],0), FALSE)","v":"Internal market deliveries (observed)"},null,3]
["MAINPROD",null,null,"OILSHALE",1,null,null,"Deliveries to main activity producers","Oil shale and oil sands","2022M02",{"$f":"VLOOKUP(I713, LanguageData, MATCH(LanguageChosen, Language[Language],0), FALSE)","v":"Oil shale and oil sands"},{"$f":"VLOOKUP(H713, LanguageData, MATCH(LanguageChosen, Language[Language],0), FALSE)","v":"Deliveries to main activity producers"},null,3]
["ECOKEOVS",null,null,"OILSHALE",1,null,null,"Deliveries to coking plants","Oil shale and oil sands","2022M02",{"$f":"VLOOKUP(I714, LanguageData, MATCH(LanguageChosen, Language[Language],0), FALSE)","v":"Oil shale and oil sands"},{"$f":"VLOOKUP(H714, LanguageData, MATCH(LanguageChosen, Language[Language],0), FALSE)","v":"Deliveries to coking plants"},null,3]
["TOTIND",null,null,"OILSHALE",1,null,null,"Deliveries to total industry","Oil shale and oil sands","2022M02",{"$f":"VLOOKUP(I715, LanguageData, MATCH(LanguageChosen, Language[Language],0), FALSE)","v":"Oil shale and oil sands"},{"$f":"VLOOKUP(H715, LanguageData, MATCH(LanguageChosen, Language[Language],0), FALSE)","v":"Deliveries to total industry"},null,3]
["IRONSTL",null,null,"OILSHALE",1,null,null,"Deliveries to total industry of which to iron and steel industry","Oil shale and oil sands","2022M02",{"$f":"VLOOKUP(I716, LanguageData, MATCH(LanguageChosen, Language[Language],0), FALSE)","v":"Oil shale and oil sands"},{"$f":"VLOOKUP(H716, LanguageData, MATCH(LanguageChosen, Language[Language],0), FALSE)","v":"Deliveries to total industry of which to iron and steel industry"},null,3]
["OTHER",null,null,"OILSHALE",1,null,null,"Other deliveries (services, households, …)","Oil shale and oil sands","2022M02",{"$f":"VLOOKUP(I717, LanguageData, MATCH(LanguageChosen, Language[Language],0), FALSE)","v":"Oil shale and oil sands"},{"$f":"VLOOKUP(H717, LanguageData, MATCH(LanguageChosen, Language[Language],0), FALSE)","v":"Other deliveries (services, households, …)"},null,3]
["INDPROD",null,null,"COKEOVEN",1,null,null,"Production ","Coke oven coke","2022M02",{"$f":"VLOOKUP(I718, LanguageData, MATCH(LanguageChosen, Language[Language],0), FALSE)","v":"Coke oven coke"},{"$f":"VLOOKUP(H718, LanguageData, MATCH(LanguageChosen, Language[Language],0), FALSE)","v":"Production "},null,3]
["OSOURCES",null,null,"COKEOVEN",1,null,null,"Recovered products","Coke oven coke",{"$f":"YEAR(DATE(LEFT($B$1,4),RIGHT($B$1,2)-N719,1)) & \"M\" & TEXT(MONTH(DATE(LEFT($B$1,4),RIGHT($B$1,2)-N719,1)),\"00\")","v":"2022M02"},{"$f":"VLOOKUP(I719, LanguageData, MATCH(LanguageChosen, Language[Language],0), FALSE)","v":"Coke oven coke"},{"$f":"VLOOKUP(H719, LanguageData, MATCH(LanguageChosen, Language[Language],0), FALSE)","v":"Recovered products"},null,3]
["TOTIMPSB",null,null,"COKEOVEN",1,null,null,"Total imports","Coke oven coke","2022M02",{"$f":"VLOOKUP(I720, LanguageData, MATCH(LanguageChosen, Language[Language],0), FALSE)","v":"Coke oven coke"},{"$f":"VLOOKUP(H720, LanguageData, MATCH(LanguageChosen, Language[Language],0), FALSE)","v":"Total imports"},null,3]
["TOTIMPSBEU",null,null,"COKEOVEN",1,null,null,"Imports: of which from outside EU","Coke oven coke","2022M02",{"$f":"VLOOKUP(I721, LanguageData, MATCH(LanguageChosen, Language[Language],0), FALSE)","v":"Coke oven coke"},{"$f":"VLOOKUP(H721, LanguageData, MATCH(LanguageChosen, Language[Language],0), FALSE)","v":"Imports: of which from outside EU"},null,3]
["TOTEXPSB",null,null,"COKEOVEN",1,null,null,"Total exports","Coke oven coke","2022M02",{"$f":"VLOOKUP(I722, LanguageData, MATCH(LanguageChosen, Language[Language],0), FALSE)","v":"Coke oven coke"},{"$f":"VLOOKUP(H722, LanguageData, MATCH(LanguageChosen, Language[Language],0), FALSE)","v":"Total exports"},null,3]
["STOCKSTART",null,null,"COKEOVEN",1,null,null,"Stocks - beginning of period","Coke oven coke","2022M02",{"$f":"VLOOKUP(I723, LanguageData, MATCH(LanguageChosen, Language[Language],0), FALSE)","v":"Coke oven coke"},{"$f":"VLOOKUP(H723, LanguageData, MATCH(LanguageChosen, Language[Language],0), FALSE)","v":"Stocks - beginning of period"},null,3]
["STOCKEND",null,null,"COKEOVEN",1,null,null,"Stocks - end of period","Coke oven coke","2022M02",{"$f":"VLOOKUP(I724, LanguageData, MATCH(LanguageChosen, Language[Language],0), FALSE)","v":"Coke oven coke"},{"$f":"VLOOKUP(H724, LanguageData, MATCH(LanguageChosen, Language[Language],0), FALSE)","v":"Stocks - end of period"},null,3]
["STCHANAT",null,null,"COKEOVEN",1,null,null,"Stock changes","Coke oven coke","2022M02",{"$f":"VLOOKUP(I725, LanguageData, MATCH(LanguageChosen, Language[Language],0), FALSE)","v":"Coke oven coke"},{"$f":"VLOOKUP(H725, LanguageData, MATCH(LanguageChosen, Language[Language],0), FALSE)","v":"Stock changes"},null,3]
["INDCONC",null,null,"COKEOVEN",1,null,null,"Calculated inland deliveries","Coke oven coke","2022M02",{"$f":"VLOOKUP(I726, LanguageData, MATCH(LanguageChosen, Language[Language],0), FALSE)","v":"Coke oven coke"},{"$f":"VLOOKUP(H726, LanguageData, MATCH(LanguageChosen, Language[Language],0), FALSE)","v":"Calculated inland deliveries"},null,3]
["STATDIFF",null,null,"COKEOVEN",1,null,null,"Statistical differences","Coke oven coke","2022M02",{"$f":"VLOOKUP(I727, LanguageData, MATCH(LanguageChosen, Language[Language],0), FALSE)","v":"Coke oven coke"},{"$f":"VLOOKUP(H727, LanguageData, MATCH(LanguageChosen, Language[Language],0), FALSE)","v":"Statistical differences"},null,3]
["INTERNAD",null,null,"COKEOVEN",1,null,null,"Internal market deliveries (observed)","Coke oven coke","2022M02",{"$f":"VLOOKUP(I728, LanguageData, MATCH(LanguageChosen, Language[Language],0), FALSE)","v":"Coke oven coke"},{"$f":"VLOOKUP(H728, LanguageData, MATCH(LanguageChosen, Language[Language],0), FALSE)","v":"Internal market deliveries (observed)"},null,3]
["MAINPROD",null,null,"COKEOVEN",1,null,null,"Deliveries to main activity producers","Coke oven coke","2022M02",{"$f":"VLOOKUP(I729, LanguageData, MATCH(LanguageChosen, Language[Language],0), FALSE)","v":"Coke oven coke"},{"$f":"VLOOKUP(H729, LanguageData, MATCH(LanguageChosen, Language[Language],0), FALSE)","v":"Deliveries to main activity producers"},null,3]
["ECOKEOVS",null,null,"COKEOVEN",1,null,null,"Deliveries to coking plants","Coke oven coke","2022M02",{"$f":"VLOOKUP(I730, LanguageData, MATCH(LanguageChosen, Language[Language],0), FALSE)","v":"Coke oven coke"},{"$f":"VLOOKUP(H730, LanguageData, MATCH(LanguageChosen, Language[Language],0), FALSE)","v":"Deliveries to coking plants"},null,3]
["TOTIND",null,null,"COKEOVEN",1,null,null,"Deliveries to total industry","Coke oven coke","2022M02",{"$f":"VLOOKUP(I731, LanguageData, MATCH(LanguageChosen, Language[Language],0), FALSE)","v":"Coke oven coke"},{"$f":"VLOOKUP(H731, LanguageData, MATCH(LanguageChosen, Language[Language],0), FALSE)","v":"Deliveries to total industry"},null,3]
["IRONSTL",null,null,"COKEOVEN",1,null,null,"Deliveries to total industry of which to iron and steel industry","Coke oven coke","2022M02",{"$f":"VLOOKUP(I732, LanguageData, MATCH(LanguageChosen, Language[Language],0), FALSE)","v":"Coke oven coke"},{"$f":"VLOOKUP(H732, LanguageData, MATCH(LanguageChosen, Language[Language],0), FALSE)","v":"Deliveries to total industry of which to iron and steel industry"},null,3]
["OTHER",null,null,"COKEOVEN",1,null,null,"Other deliveries (services, households, …)","Coke oven coke","2022M02",{"$f":"VLOOKUP(I733, LanguageData, MATCH(LanguageChosen, Language[Language],0), FALSE)","v":"Coke oven coke"},{"$f":"VLOOKUP(H733, LanguageData, MATCH(LanguageChosen, Language[Language],0), FALSE)","v":"Other deliveries (services, households, …)"},null,3]
["INDPROD",null,null,"HARDCOAL",1,null,null,"Production ","Hard coal","2022M03",{"$f":"VLOOKUP(I734, LanguageData, MATCH(LanguageChosen, Language[Language],0), FALSE)","v":"Hard coal"},{"$f":"VLOOKUP(H734, LanguageData, MATCH(LanguageChosen, Language[Language],0), FALSE)","v":"Production "},null,2]
["OSOURCES",null,null,"HARDCOAL",1,null,null,"Recovered products","Hard coal","2022M03",{"$f":"VLOOKUP(I735, LanguageData, MATCH(LanguageChosen, Language[Language],0), FALSE)","v":"Hard coal"},{"$f":"VLOOKUP(H735, LanguageData, MATCH(LanguageChosen, Language[Language],0), FALSE)","v":"Recovered products"},null,2]
["TOTIMPSB",null,null,"HARDCOAL",1,null,null,"Total imports","Hard coal","2022M03",{"$f":"VLOOKUP(I736, LanguageData, MATCH(LanguageChosen, Language[Language],0), FALSE)","v":"Hard coal"},{"$f":"VLOOKUP(H736, LanguageData, MATCH(LanguageChosen, Language[Language],0), FALSE)","v":"Total imports"},null,2]
["TOTIMPSBEU",null,null,"HARDCOAL",1,null,null,"Imports: of which from outside EU","Hard coal","2022M03",{"$f":"VLOOKUP(I737, LanguageData, MATCH(LanguageChosen, Language[Language],0), FALSE)","v":"Hard coal"},{"$f":"VLOOKUP(H737, LanguageData, MATCH(LanguageChosen, Language[Language],0), FALSE)","v":"Imports: of which from outside EU"},null,2]
["TOTEXPSB",null,null,"HARDCOAL",1,null,null,"Total exports","Hard coal","2022M03",{"$f":"VLOOKUP(I738, LanguageData, MATCH(LanguageChosen, Language[Language],0), FALSE)","v":"Hard coal"},{"$f":"VLOOKUP(H738, LanguageData, MATCH(LanguageChosen, Language[Language],0), FALSE)","v":"Total exports"},null,2]
["STOCKSTART",null,null,"HARDCOAL",1,null,null,"Stocks - beginning of period","Hard coal","2022M03",{"$f":"VLOOKUP(I739, LanguageData, MATCH(LanguageChosen, Language[Language],0), FALSE)","v":"Hard coal"},{"$f":"VLOOKUP(H739, LanguageData, MATCH(LanguageChosen, Language[Language],0), FALSE)","v":"Stocks - beginning of period"},null,2]
["STOCKEND",null,null,"HARDCOAL",1,null,null,"Stocks - end of period","Hard coal","2022M03",{"$f":"VLOOKUP(I740, LanguageData, MATCH(LanguageChosen, Language[Language],0), FALSE)","v":"Hard coal"},{"$f":"VLOOKUP(H740, LanguageData, MATCH(LanguageChosen, Language[Language],0), FALSE)","v":"Stocks - end of period"},null,2]
["STCHANAT",null,null,"HARDCOAL",1,null,null,"Stock changes","Hard coal","2022M03",{"$f":"VLOOKUP(I741, LanguageData, MATCH(LanguageChosen, Language[Language],0), FALSE)","v":"Hard coal"},{"$f":"VLOOKUP(H741, LanguageData, MATCH(LanguageChosen, Language[Language],0), FALSE)","v":"Stock changes"},null,2]
["INDCONC",null,null,"HARDCOAL",1,null,null,"Calculated inland deliveries","Hard coal","2022M03",{"$f":"VLOOKUP(I742, LanguageData, MATCH(LanguageChosen, Language[Language],0), FALSE)","v":"Hard coal"},{"$f":"VLOOKUP(H742, LanguageData, MATCH(LanguageChosen, Language[Language],0), FALSE)","v":"Calculated inland deliveries"},null,2]
["STATDIFF",null,null,"HARDCOAL",1,null,null,"Statistical differences","Hard coal","2022M03",{"$f":"VLOOKUP(I743, LanguageData, MATCH(LanguageChosen, Language[Language],0), FALSE)","v":"Hard coal"},{"$f":"VLOOKUP(H743, LanguageData, MATCH(LanguageChosen, Language[Language],0), FALSE)","v":"Statistical differences"},null,2]
["INTERNAD",null,null,"HARDCOAL",1,null,null,"Internal market deliveries (observed)","Hard coal","2022M03",{"$f":"VLOOKUP(I744, LanguageData, MATCH(LanguageChosen, Language[Language],0), FALSE)","v":"Hard coal"},{"$f":"VLOOKUP(H744, LanguageData, MATCH(LanguageChosen, Language[Language],0), FALSE)","v":"Internal market deliveries (observed)"},null,2]
["MAINPROD",null,null,"HARDCOAL",1,null,null,"Deliveries to main activity producers","Hard coal","2022M03",{"$f":"VLOOKUP(I745, LanguageData, MATCH(LanguageChosen, Language[Language],0), FALSE)","v":"Hard coal"},{"$f":"VLOOKUP(H745, LanguageData, MATCH(LanguageChosen, Language[Language],0), FALSE)","v":"Deliveries to main activity producers"},null,2]
["ECOKEOVS",null,null,"HARDCOAL",1,null,null,"Deliveries to coking plants","Hard coal","2022M03",{"$f":"VLOOKUP(I746, LanguageData, MATCH(LanguageChosen, Language[Language],0), FALSE)","v":"Hard coal"},{"$f":"VLOOKUP(H746, LanguageData, MATCH(LanguageChosen, Language[Language],0), FALSE)","v":"Deliveries to coking plants"},null,2]
["TOTIND",null,null,"HARDCOAL",1,null,null,"Deliveries to total industry","Hard coal","2022M03",{"$f":"VLOOKUP(I747, LanguageData, MATCH(LanguageChosen, Language[Language],0), FALSE)","v":"Hard coal"},{"$f":"VLOOKUP(H747, LanguageData, MATCH(LanguageChosen, Language[Language],0), FALSE)","v":"Deliveries to total industry"},null,2]
["IRONSTL",null,null,"HARDCOAL",1,null,null,"Deliveries to total industry of which to iron and steel industry","Hard coal","2022M03",{"$f":"VLOOKUP(I748, LanguageData, MATCH(LanguageChosen, Language[Language],0), FALSE)","v":"Hard coal"},{"$f":"VLOOKUP(H748, LanguageData, MATCH(LanguageChosen, Language[Language],0), FALSE)","v":"Deliveries to total industry of which to iron and steel industry"},null,2]
["OTHER",null,null,"HARDCOAL",1,null,null,"Other deliveries (services, households, …)","Hard coal","2022M03",{"$f":"VLOOKUP(I749, LanguageData, MATCH(LanguageChosen, Language[Language],0), FALSE)","v":"Hard coal"},{"$f":"VLOOKUP(H749, LanguageData, MATCH(LanguageChosen, Language[Language],0), FALSE)","v":"Other deliveries (services, households, …)"},null,2]
["INDPROD",null,null,"BROWN",1,null,null,"Production ","Brown coal","2022M03",{"$f":"VLOOKUP(I750, LanguageData, MATCH(LanguageChosen, Language[Language],0), FALSE)","v":"Brown coal"},{"$f":"VLOOKUP(H750, LanguageData, MATCH(LanguageChosen, Language[Language],0), FALSE)","v":"Production "},null,2]
["OSOURCES",null,null,"BROWN",1,null,null,"Recovered products","Brown coal","2022M03",{"$f":"VLOOKUP(I751, LanguageData, MATCH(LanguageChosen, Language[Language],0), FALSE)","v":"Brown coal"},{"$f":"VLOOKUP(H751, LanguageData, MATCH(LanguageChosen, Language[Language],0), FALSE)","v":"Recovered products"},null,2]
["TOTIMPSB",null,null,"BROWN",1,null,null,"Total imports","Brown coal","2022M03",{"$f":"VLOOKUP(I752, LanguageData, MATCH(LanguageChosen, Language[Language],0), FALSE)","v":"Brown coal"},{"$f":"VLOOKUP(H752, LanguageData, MATCH(LanguageChosen, Language[Language],0), FALSE)","v":"Total imports"},null,2]
["TOTIMPSBEU",null,null,"BROWN",1,null,null,"Imports: of which from outside EU","Brown coal","2022M03",{"$f":"VLOOKUP(I753, LanguageData, MATCH(LanguageChosen, Language[Language],0), FALSE)","v":"Brown coal"},{"$f":"VLOOKUP(H753, LanguageData, MATCH(LanguageChosen, Language[Language],0), FALSE)","v":"Imports: of which from outside EU"},null,2]
["TOTEXPSB",null,null,"BROWN",1,null,null,"Total exports","Brown coal","2022M03",{"$f":"VLOOKUP(I754, LanguageData, MATCH(LanguageChosen, Language[Language],0), FALSE)","v":"Brown coal"},{"$f":"VLOOKUP(H754, LanguageData, MATCH(LanguageChosen, Language[Language],0), FALSE)","v":"Total exports"},null,2]
["STOCKSTART",null,null,"BROWN",1,null,null,"Stocks - beginning of period","Brown coal","2022M03",{"$f":"VLOOKUP(I755, LanguageData, MATCH(LanguageChosen, Language[Language],0), FALSE)","v":"Brown coal"},{"$f":"VLOOKUP(H755, LanguageData, MATCH(LanguageChosen, Language[Language],0), FALSE)","v":"Stocks - beginning of period"},null,2]
["STOCKEND",null,null,"BROWN",1,null,null,"Stocks - end of period","Brown coal","2022M03",{"$f":"VLOOKUP(I756, LanguageData, MATCH(LanguageChosen, Language[Language],0), FALSE)","v":"Brown coal"},{"$f":"VLOOKUP(H756, LanguageData, MATCH(LanguageChosen, Language[Language],0), FALSE)","v":"Stocks - end of period"},null,2]
["STCHANAT",null,null,"BROWN",1,null,null,"Stock changes","Brown coal","2022M03",{"$f":"VLOOKUP(I757, LanguageData, MATCH(LanguageChosen, Language[Language],0), FALSE)","v":"Brown coal"},{"$f":"VLOOKUP(H757, LanguageData, MATCH(LanguageChosen, Language[Language],0), FALSE)","v":"Stock changes"},null,2]
["INDCONC",null,null,"BROWN",1,null,null,"Calculated inland deliveries","Brown coal","2022M03",{"$f":"VLOOKUP(I758, LanguageData, MATCH(LanguageChosen, Language[Language],0), FALSE)","v":"Brown coal"},{"$f":"VLOOKUP(H758, LanguageData, MATCH(LanguageChosen, Language[Language],0), FALSE)","v":"Calculated inland deliveries"},null,2]
["STATDIFF",null,null,"BROWN",1,null,null,"Statistical differences","Brown coal","2022M03",{"$f":"VLOOKUP(I759, LanguageData, MATCH(LanguageChosen, Language[Language],0), FALSE)","v":"Brown coal"},{"$f":"VLOOKUP(H759, LanguageData, MATCH(LanguageChosen, Language[Language],0), FALSE)","v":"Statistical differences"},null,2]
["INTERNAD",null,null,"BROWN",1,null,null,"Internal market deliveries (observed)","Brown coal","2022M03",{"$f":"VLOOKUP(I760, LanguageData, MATCH(LanguageChosen, Language[Language],0), FALSE)","v":"Brown coal"},{"$f":"VLOOKUP(H760, LanguageData, MATCH(LanguageChosen, Language[Language],0), FALSE)","v":"Internal market deliveries (observed)"},null,2]
["MAINPROD",null,null,"BROWN",1,null,null,"Deliveries to main activity producers","Brown coal","2022M03",{"$f":"VLOOKUP(I761, LanguageData, MATCH(LanguageChosen, Language[Language],0), FALSE)","v":"Brown coal"},{"$f":"VLOOKUP(H761, LanguageData, MATCH(LanguageChosen, Language[Language],0), FALSE)","v":"Deliveries to main activity producers"},null,2]
["ECOKEOVS",null,null,"BROWN",1,null,null,"Deliveries to coking plants","Brown coal","2022M03",{"$f":"VLOOKUP(I762, LanguageData, MATCH(LanguageChosen, Language[Language],0), FALSE)","v":"Brown coal"},{"$f":"VLOOKUP(H762, LanguageData, MATCH(LanguageChosen, Language[Language],0), FALSE)","v":"Deliveries to coking plants"},null,2]
["TOTIND",null,null,"BROWN",1,null,null,"Deliveries to total industry","Brown coal","2022M03",{"$f":"VLOOKUP(I763, LanguageData, MATCH(LanguageChosen, Language[Language],0), FALSE)","v":"Brown coal"},{"$f":"VLOOKUP(H763, LanguageData, MATCH(LanguageChosen, Language[Language],0), FALSE)","v":"Deliveries to total industry"},null,2]
["IRONSTL",null,null,"BROWN",1,null,null,"Deliveries to total industry of which to iron and steel industry","Brown coal","2022M03",{"$f":"VLOOKUP(I764, LanguageData, MATCH(LanguageChosen, Language[Language],0), FALSE)","v":"Brown coal"},{"$f":"VLOOKUP(H764, LanguageData, MATCH(LanguageChosen, Language[Language],0), FALSE)","v":"Deliveries to total industry of which to iron and steel industry"},null,2]
["OTHER",null,null,"BROWN",1,null,null,"Other deliveries (services, households, …)","Brown coal","2022M03",{"$f":"VLOOKUP(I765, LanguageData, MATCH(LanguageChosen, Language[Language],0), FALSE)","v":"Brown coal"},{"$f":"VLOOKUP(H765, LanguageData, MATCH(LanguageChosen, Language[Language],0), FALSE)","v":"Other deliveries (services, households, …)"},null,2]
["INDPROD",null,null,"PEAT",1,null,null,"Production ","Peat","2022M03",{"$f":"VLOOKUP(I766, LanguageData, MATCH(LanguageChosen, Language[Language],0), FALSE)","v":"Peat"},{"$f":"VLOOKUP(H766, LanguageData, MATCH(LanguageChosen, Language[Language],0), FALSE)","v":"Production "},null,2]
["OSOURCES",null,null,"PEAT",1,null,null,"Recovered products","Peat","2022M03",{"$f":"VLOOKUP(I767, LanguageData, MATCH(LanguageChosen, Language[Language],0), FALSE)","v":"Peat"},{"$f":"VLOOKUP(H767, LanguageData, MATCH(LanguageChosen, Language[Language],0), FALSE)","v":"Recovered products"},null,2]
["TOTIMPSB",null,null,"PEAT",1,null,null,"Total imports","Peat","2022M03",{"$f":"VLOOKUP(I768, LanguageData, MATCH(LanguageChosen, Language[Language],0), FALSE)","v":"Peat"},{"$f":"VLOOKUP(H768, LanguageData, MATCH(LanguageChosen, Language[Language],0), FALSE)","v":"Total imports"},null,2]
["TOTIMPSBEU",null,null,"PEAT",1,null,null,"Imports: of which from outside EU","Peat","2022M03",{"$f":"VLOOKUP(I769, LanguageData, MATCH(LanguageChosen, Language[Language],0), FALSE)","v":"Peat"},{"$f":"VLOOKUP(H769, LanguageData, MATCH(LanguageChosen, Language[Language],0), FALSE)","v":"Imports: of which from outside EU"},null,2]
["TOTEXPSB",null,null,"PEAT",1,null,null,"Total exports","Peat","2022M03",{"$f":"VLOOKUP(I770, LanguageData, MATCH(LanguageChosen, Language[Language],0), FALSE)","v":"Peat"},{"$f":"VLOOKUP(H770, LanguageData, MATCH(LanguageChosen, Language[Language],0), FALSE)","v":"Total exports"},null,2]
["STOCKSTART",null,null,"PEAT",1,null,null,"Stocks - beginning of period","Peat","2022M03",{"$f":"VLOOKUP(I771, LanguageData, MATCH(LanguageChosen, Language[Language],0), FALSE)","v":"Peat"},{"$f":"VLOOKUP(H771, LanguageData, MATCH(LanguageChosen, Language[Language],0), FALSE)","v":"Stocks - beginning of period"},null,2]
["STOCKEND",null,null,"PEAT",1,null,null,"Stocks - end of period","Peat","2022M03",{"$f":"VLOOKUP(I772, LanguageData, MATCH(LanguageChosen, Language[Language],0), FALSE)","v":"Peat"},{"$f":"VLOOKUP(H772, LanguageData, MATCH(LanguageChosen, Language[Language],0), FALSE)","v":"Stocks - end of period"},null,2]
["STCHANAT",null,null,"PEAT",1,null,null,"Stock changes","Peat","2022M03",{"$f":"VLOOKUP(I773, LanguageData, MATCH(LanguageChosen, Language[Language],0), FALSE)","v":"Peat"},{"$f":"VLOOKUP(H773, LanguageData, MATCH(LanguageChosen, Language[Language],0), FALSE)","v":"Stock changes"},null,2]
["INDCONC",null,null,"PEAT",1,null,null,"Calculated inland deliveries","Peat","2022M03",{"$f":"VLOOKUP(I774, LanguageData, MATCH(LanguageChosen, Language[Language],0), FALSE)","v":"Peat"},{"$f":"VLOOKUP(H774, LanguageData, MATCH(LanguageChosen, Language[Language],0), FALSE)","v":"Calculated inland deliveries"},null,2]
["STATDIFF",null,null,"PEAT",1,null,null,"Statistical differences","Peat","2022M03",{"$f":"VLOOKUP(I775, LanguageData, MATCH(LanguageChosen, Language[Language],0), FALSE)","v":"Peat"},{"$f":"VLOOKUP(H775, LanguageData, MATCH(LanguageChosen, Language[Language],0), FALSE)","v":"Statistical differences"},null,2]
["INTERNAD",null,null,"PEAT",1,null,null,"Internal market deliveries (observed)","Peat","2022M03",{"$f":"VLOOKUP(I776, LanguageData, MATCH(LanguageChosen, Language[Language],0), FALSE)","v":"Peat"},{"$f":"VLOOKUP(H776, LanguageData, MATCH(LanguageChosen, Language[Language],0), FALSE)","v":"Internal market deliveries (observed)"},null,2]
["MAINPROD",null,null,"PEAT",1,null,null,"Deliveries to main activity producers","Peat","2022M03",{"$f":"VLOOKUP(I777, LanguageData, MATCH(LanguageChosen, Language[Language],0), FALSE)","v":"Peat"},{"$f":"VLOOKUP(H777, LanguageData, MATCH(LanguageChosen, Language[Language],0), FALSE)","v":"Deliveries to main activity producers"},null,2]
["ECOKEOVS",null,null,"PEAT",1,null,null,"Deliveries to coking plants","Peat","2022M03",{"$f":"VLOOKUP(I778, LanguageData, MATCH(LanguageChosen, Language[Language],0), FALSE)","v":"Peat"},{"$f":"VLOOKUP(H778, LanguageData, MATCH(LanguageChosen, Language[Language],0), FALSE)","v":"Deliveries to coking plants"},null,2]
["TOTIND",null,null,"PEAT",1,null,null,"Deliveries to total industry","Peat","2022M03",{"$f":"VLOOKUP(I779, LanguageData, MATCH(LanguageChosen, Language[Language],0), FALSE)","v":"Peat"},{"$f":"VLOOKUP(H779, LanguageData, MATCH(LanguageChosen, Language[Language],0), FALSE)","v":"Deliveries to total industry"},null,2]
["IRONSTL",null,null,"PEAT",1,null,null,"Deliveries to total industry of which to iron and steel industry","Peat","2022M03",{"$f":"VLOOKUP(I780, LanguageData, MATCH(LanguageChosen, Language[Language],0), FALSE)","v":"Peat"},{"$f":"VLOOKUP(H780, LanguageData, MATCH(LanguageChosen, Language[Language],0), FALSE)","v":"Deliveries to total industry of which to iron and steel industry"},null,2]
["OTHER",null,null,"PEAT",1,null,null,"Other deliveries (services, households, …)","Peat","2022M03",{"$f":"VLOOKUP(I781, LanguageData, MATCH(LanguageChosen, Language[Language],0), FALSE)","v":"Peat"},{"$f":"VLOOKUP(H781, LanguageData, MATCH(LanguageChosen, Language[Language],0), FALSE)","v":"Other deliveries (services, households, …)"},null,2]
["INDPROD",null,null,"OILSHALE",1,null,null,"Production ","Oil shale and oil sands","2022M03",{"$f":"VLOOKUP(I782, LanguageData, MATCH(LanguageChosen, Language[Language],0), FALSE)","v":"Oil shale and oil sands"},{"$f":"VLOOKUP(H782, LanguageData, MATCH(LanguageChosen, Language[Language],0), FALSE)","v":"Production "},null,2]
["OSOURCES",null,null,"OILSHALE",1,null,null,"Recovered products","Oil shale and oil sands",{"$f":"YEAR(DATE(LEFT($B$1,4),RIGHT($B$1,2)-N783,1)) & \"M\" & TEXT(MONTH(DATE(LEFT($B$1,4),RIGHT($B$1,2)-N783,1)),\"00\")","v":"2022M03"},{"$f":"VLOOKUP(I783, LanguageData, MATCH(LanguageChosen, Language[Language],0), FALSE)","v":"Oil shale and oil sands"},{"$f":"VLOOKUP(H783, LanguageData, MATCH(LanguageChosen, Language[Language],0), FALSE)","v":"Recovered products"},null,2]
["TOTIMPSB",null,null,"OILSHALE",1,null,null,"Total imports","Oil shale and oil sands","2022M03",{"$f":"VLOOKUP(I784, LanguageData, MATCH(LanguageChosen, Language[Language],0), FALSE)","v":"Oil shale and oil sands"},{"$f":"VLOOKUP(H784, LanguageData, MATCH(LanguageChosen, Language[Language],0), FALSE)","v":"Total imports"},null,2]
["TOTIMPSBEU",null,null,"OILSHALE",1,null,null,"Imports: of which from outside EU","Oil shale and oil sands","2022M03",{"$f":"VLOOKUP(I785, LanguageData, MATCH(LanguageChosen, Language[Language],0), FALSE)","v":"Oil shale and oil sands"},{"$f":"VLOOKUP(H785, LanguageData, MATCH(LanguageChosen, Language[Language],0), FALSE)","v":"Imports: of which from outside EU"},null,2]
["TOTEXPSB",null,null,"OILSHALE",1,null,null,"Total exports","Oil shale and oil sands","2022M03",{"$f":"VLOOKUP(I786, LanguageData, MATCH(LanguageChosen, Language[Language],0), FALSE)","v":"Oil shale and oil sands"},{"$f":"VLOOKUP(H786, LanguageData, MATCH(LanguageChosen, Language[Language],0), FALSE)","v":"Total exports"},null,2]
["STOCKSTART",null,null,"OILSHALE",1,null,null,"Stocks - beginning of period","Oil shale and oil sands","2022M03",{"$f":"VLOOKUP(I787, LanguageData, MATCH(LanguageChosen, Language[Language],0), FALSE)","v":"Oil shale and oil sands"},{"$f":"VLOOKUP(H787, LanguageData, MATCH(LanguageChosen, Language[Language],0), FALSE)","v":"Stocks - beginning of period"},null,2]
["STOCKEND",null,null,"OILSHALE",1,null,null,"Stocks - end of period","Oil shale and oil sands","2022M03",{"$f":"VLOOKUP(I788, LanguageData, MATCH(LanguageChosen, Language[Language],0), FALSE)","v":"Oil shale and oil sands"},{"$f":"VLOOKUP(H788, LanguageData, MATCH(LanguageChosen, Language[Language],0), FALSE)","v":"Stocks - end of period"},null,2]
["STCHANAT",null,null,"OILSHALE",1,null,null,"Stock changes","Oil shale and oil sands","2022M03",{"$f":"VLOOKUP(I789, LanguageData, MATCH(LanguageChosen, Language[Language],0), FALSE)","v":"Oil shale and oil sands"},{"$f":"VLOOKUP(H789, LanguageData, MATCH(LanguageChosen, Language[Language],0), FALSE)","v":"Stock changes"},null,2]
["INDCONC",null,null,"OILSHALE",1,null,null,"Calculated inland deliveries","Oil shale and oil sands","2022M03",{"$f":"VLOOKUP(I790, LanguageData, MATCH(LanguageChosen, Language[Language],0), FALSE)","v":"Oil shale and oil sands"},{"$f":"VLOOKUP(H790, LanguageData, MATCH(LanguageChosen, Language[Language],0), FALSE)","v":"Calculated inland deliveries"},null,2]
["STATDIFF",null,null,"OILSHALE",1,null,null,"Statistical differences","Oil shale and oil sands","2022M03",{"$f":"VLOOKUP(I791, LanguageData, MATCH(LanguageChosen, Language[Language],0), FALSE)","v":"Oil shale and oil sands"},{"$f":"VLOOKUP(H791, LanguageData, MATCH(LanguageChosen, Language[Language],0), FALSE)","v":"Statistical differences"},null,2]
["INTERNAD",null,null,"OILSHALE",1,null,null,"Internal market deliveries (observed)","Oil shale and oil sands","2022M03",{"$f":"VLOOKUP(I792, LanguageData, MATCH(LanguageChosen, Language[Language],0), FALSE)","v":"Oil shale and oil sands"},{"$f":"VLOOKUP(H792, LanguageData, MATCH(LanguageChosen, Language[Language],0), FALSE)","v":"Internal market deliveries (observed)"},null,2]
["MAINPROD",null,null,"OILSHALE",1,null,null,"Deliveries to main activity producers","Oil shale and oil sands","2022M03",{"$f":"VLOOKUP(I793, LanguageData, MATCH(LanguageChosen, Language[Language],0), FALSE)","v":"Oil shale and oil sands"},{"$f":"VLOOKUP(H793, LanguageData, MATCH(LanguageChosen, Language[Language],0), FALSE)","v":"Deliveries to main activity producers"},null,2]
["ECOKEOVS",null,null,"OILSHALE",1,null,null,"Deliveries to coking plants","Oil shale and oil sands","2022M03",{"$f":"VLOOKUP(I794, LanguageData, MATCH(LanguageChosen, Language[Language],0), FALSE)","v":"Oil shale and oil sands"},{"$f":"VLOOKUP(H794, LanguageData, MATCH(LanguageChosen, Language[Language],0), FALSE)","v":"Deliveries to coking plants"},null,2]
["TOTIND",null,null,"OILSHALE",1,null,null,"Deliveries to total industry","Oil shale and oil sands","2022M03",{"$f":"VLOOKUP(I795, LanguageData, MATCH(LanguageChosen, Language[Language],0), FALSE)","v":"Oil shale and oil sands"},{"$f":"VLOOKUP(H795, LanguageData, MATCH(LanguageChosen, Language[Language],0), FALSE)","v":"Deliveries to total industry"},null,2]
["IRONSTL",null,null,"OILSHALE",1,null,null,"Deliveries to total industry of which to iron and steel industry","Oil shale and oil sands","2022M03",{"$f":"VLOOKUP(I796, LanguageData, MATCH(LanguageChosen, Language[Language],0), FALSE)","v":"Oil shale and oil sands"},{"$f":"VLOOKUP(H796, LanguageData, MATCH(LanguageChosen, Language[Language],0), FALSE)","v":"Deliveries to total industry of which to iron and steel industry"},null,2]
["OTHER",null,null,"OILSHALE",1,null,null,"Other deliveries (services, households, …)","Oil shale and oil sands","2022M03",{"$f":"VLOOKUP(I797, LanguageData, MATCH(LanguageChosen, Language[Language],0), FALSE)","v":"Oil shale and oil sands"},{"$f":"VLOOKUP(H797, LanguageData, MATCH(LanguageChosen, Language[Language],0), FALSE)","v":"Other deliveries (services, households, …)"},null,2]
["INDPROD",null,null,"COKEOVEN",1,null,null,"Production ","Coke oven coke","2022M03",{"$f":"VLOOKUP(I798, LanguageData, MATCH(LanguageChosen, Language[Language],0), FALSE)","v":"Coke oven coke"},{"$f":"VLOOKUP(H798, LanguageData, MATCH(LanguageChosen, Language[Language],0), FALSE)","v":"Production "},null,2]
["OSOURCES",null,null,"COKEOVEN",1,null,null,"Recovered products","Coke oven coke","2022M03",{"$f":"VLOOKUP(I799, LanguageData, MATCH(LanguageChosen, Language[Language],0), FALSE)","v":"Coke oven coke"},{"$f":"VLOOKUP(H799, LanguageData, MATCH(LanguageChosen, Language[Language],0), FALSE)","v":"Recovered products"},null,2]
["TOTIMPSB",null,null,"COKEOVEN",1,null,null,"Total imports","Coke oven coke","2022M03",{"$f":"VLOOKUP(I800, LanguageData, MATCH(LanguageChosen, Language[Language],0), FALSE)","v":"Coke oven coke"},{"$f":"VLOOKUP(H800, LanguageData, MATCH(LanguageChosen, Language[Language],0), FALSE)","v":"Total imports"},null,2]
["TOTIMPSBEU",null,null,"COKEOVEN",1,null,null,"Imports: of which from outside EU","Coke oven coke","2022M03",{"$f":"VLOOKUP(I801, LanguageData, MATCH(LanguageChosen, Language[Language],0), FALSE)","v":"Coke oven coke"},{"$f":"VLOOKUP(H801, LanguageData, MATCH(LanguageChosen, Language[Language],0), FALSE)","v":"Imports: of which from outside EU"},null,2]
["TOTEXPSB",null,null,"COKEOVEN",1,null,null,"Total exports","Coke oven coke","2022M03",{"$f":"VLOOKUP(I802, LanguageData, MATCH(LanguageChosen, Language[Language],0), FALSE)","v":"Coke oven coke"},{"$f":"VLOOKUP(H802, LanguageData, MATCH(LanguageChosen, Language[Language],0), FALSE)","v":"Total exports"},null,2]
["STOCKSTART",null,null,"COKEOVEN",1,null,null,"Stocks - beginning of period","Coke oven coke","2022M03",{"$f":"VLOOKUP(I803, LanguageData, MATCH(LanguageChosen, Language[Language],0), FALSE)","v":"Coke oven coke"},{"$f":"VLOOKUP(H803, LanguageData, MATCH(LanguageChosen, Language[Language],0), FALSE)","v":"Stocks - beginning of period"},null,2]
["STOCKEND",null,null,"COKEOVEN",1,null,null,"Stocks - end of period","Coke oven coke","2022M03",{"$f":"VLOOKUP(I804, LanguageData, MATCH(LanguageChosen, Language[Language],0), FALSE)","v":"Coke oven coke"},{"$f":"VLOOKUP(H804, LanguageData, MATCH(LanguageChosen, Language[Language],0), FALSE)","v":"Stocks - end of period"},null,2]
["STCHANAT",null,null,"COKEOVEN",1,null,null,"Stock changes","Coke oven coke","2022M03",{"$f":"VLOOKUP(I805, LanguageData, MATCH(LanguageChosen, Language[Language],0), FALSE)","v":"Coke oven coke"},{"$f":"VLOOKUP(H805, LanguageData, MATCH(LanguageChosen, Language[Language],0), FALSE)","v":"Stock changes"},null,2]
["INDCONC",null,null,"COKEOVEN",1,null,null,"Calculated inland deliveries","Coke oven coke","2022M03",{"$f":"VLOOKUP(I806, LanguageData, MATCH(LanguageChosen, Language[Language],0), FALSE)","v":"Coke oven coke"},{"$f":"VLOOKUP(H806, LanguageData, MATCH(LanguageChosen, Language[Language],0), FALSE)","v":"Calculated inland deliveries"},null,2]
["STATDIFF",null,null,"COKEOVEN",1,null,null,"Statistical differences","Coke oven coke","2022M03",{"$f":"VLOOKUP(I807, LanguageData, MATCH(LanguageChosen, Language[Language],0), FALSE)","v":"Coke oven coke"},{"$f":"VLOOKUP(H807, LanguageData, MATCH(LanguageChosen, Language[Language],0), FALSE)","v":"Statistical differences"},null,2]
["INTERNAD",null,null,"COKEOVEN",1,null,null,"Internal market deliveries (observed)","Coke oven coke","2022M03",{"$f":"VLOOKUP(I808, LanguageData, MATCH(LanguageChosen, Language[Language],0), FALSE)","v":"Coke oven coke"},{"$f":"VLOOKUP(H808, LanguageData, MATCH(LanguageChosen, Language[Language],0), FALSE)","v":"Internal market deliveries (observed)"},null,2]
["MAINPROD",null,null,"COKEOVEN",1,null,null,"Deliveries to main activity producers","Coke oven coke","2022M03",{"$f":"VLOOKUP(I809, LanguageData, MATCH(LanguageChosen, Language[Language],0), FALSE)","v":"Coke oven coke"},{"$f":"VLOOKUP(H809, LanguageData, MATCH(LanguageChosen, Language[Language],0), FALSE)","v":"Deliveries to main activity producers"},null,2]
["ECOKEOVS",null,null,"COKEOVEN",1,null,null,"Deliveries to coking plants","Coke oven coke","2022M03",{"$f":"VLOOKUP(I810, LanguageData, MATCH(LanguageChosen, Language[Language],0), FALSE)","v":"Coke oven coke"},{"$f":"VLOOKUP(H810, LanguageData, MATCH(LanguageChosen, Language[Language],0), FALSE)","v":"Deliveries to coking plants"},null,2]
["TOTIND",null,null,"COKEOVEN",1,null,null,"Deliveries to total industry","Coke oven coke","2022M03",{"$f":"VLOOKUP(I811, LanguageData, MATCH(LanguageChosen, Language[Language],0), FALSE)","v":"Coke oven coke"},{"$f":"VLOOKUP(H811, LanguageData, MATCH(LanguageChosen, Language[Language],0), FALSE)","v":"Deliveries to total industry"},null,2]
["IRONSTL",null,null,"COKEOVEN",1,null,null,"Deliveries to total industry of which to iron and steel industry","Coke oven coke","2022M03",{"$f":"VLOOKUP(I812, LanguageData, MATCH(LanguageChosen, Language[Language],0), FALSE)","v":"Coke oven coke"},{"$f":"VLOOKUP(H812, LanguageData, MATCH(LanguageChosen, Language[Language],0), FALSE)","v":"Deliveries to total industry of which to iron and steel industry"},null,2]
["OTHER",null,null,"COKEOVEN",1,null,null,"Other deliveries (services, households, …)","Coke oven coke","2022M03",{"$f":"VLOOKUP(I813, LanguageData, MATCH(LanguageChosen, Language[Language],0), FALSE)","v":"Coke oven coke"},{"$f":"VLOOKUP(H813, LanguageData, MATCH(LanguageChosen, Language[Language],0), FALSE)","v":"Other deliveries (services, households, …)"},null,2]
["INDPROD",null,null,"HARDCOAL",1,null,null,"Production ","Hard coal","2022M04",{"$f":"VLOOKUP(I814, LanguageData, MATCH(LanguageChosen, Language[Language],0), FALSE)","v":"Hard coal"},{"$f":"VLOOKUP(H814, LanguageData, MATCH(LanguageChosen, Language[Language],0), FALSE)","v":"Production "},null,1]
["OSOURCES",null,null,"HARDCOAL",1,null,null,"Recovered products","Hard coal","2022M04",{"$f":"VLOOKUP(I815, LanguageData, MATCH(LanguageChosen, Language[Language],0), FALSE)","v":"Hard coal"},{"$f":"VLOOKUP(H815, LanguageData, MATCH(LanguageChosen, Language[Language],0), FALSE)","v":"Recovered products"},null,1]
["TOTIMPSB",null,null,"HARDCOAL",1,null,null,"Total imports","Hard coal","2022M04",{"$f":"VLOOKUP(I816, LanguageData, MATCH(LanguageChosen, Language[Language],0), FALSE)","v":"Hard coal"},{"$f":"VLOOKUP(H816, LanguageData, MATCH(LanguageChosen, Language[Language],0), FALSE)","v":"Total imports"},null,1]
["TOTIMPSBEU",null,null,"HARDCOAL",1,null,null,"Imports: of which from outside EU","Hard coal","2022M04",{"$f":"VLOOKUP(I817, LanguageData, MATCH(LanguageChosen, Language[Language],0), FALSE)","v":"Hard coal"},{"$f":"VLOOKUP(H817, LanguageData, MATCH(LanguageChosen, Language[Language],0), FALSE)","v":"Imports: of which from outside EU"},null,1]
["TOTEXPSB",null,null,"HARDCOAL",1,null,null,"Total exports","Hard coal","2022M04",{"$f":"VLOOKUP(I818, LanguageData, MATCH(LanguageChosen, Language[Language],0), FALSE)","v":"Hard coal"},{"$f":"VLOOKUP(H818, LanguageData, MATCH(LanguageChosen, Language[Language],0), FALSE)","v":"Total exports"},null,1]
["STOCKSTART",null,null,"HARDCOAL",1,null,null,"Stocks - beginning of period","Hard coal","2022M04",{"$f":"VLOOKUP(I819, LanguageData, MATCH(LanguageChosen, Language[Language],0), FALSE)","v":"Hard coal"},{"$f":"VLOOKUP(H819, LanguageData, MATCH(LanguageChosen, Language[Language],0), FALSE)","v":"Stocks - beginning of period"},null,1]
["STOCKEND",null,null,"HARDCOAL",1,null,null,"Stocks - end of period","Hard coal","2022M04",{"$f":"VLOOKUP(I820, LanguageData, MATCH(LanguageChosen, Language[Language],0), FALSE)","v":"Hard coal"},{"$f":"VLOOKUP(H820, LanguageData, MATCH(LanguageChosen, Language[Language],0), FALSE)","v":"Stocks - end of period"},null,1]
["STCHANAT",null,null,"HARDCOAL",1,null,null,"Stock changes","Hard coal","2022M04",{"$f":"VLOOKUP(I821, LanguageData, MATCH(LanguageChosen, Language[Language],0), FALSE)","v":"Hard coal"},{"$f":"VLOOKUP(H821, LanguageData, MATCH(LanguageChosen, Language[Language],0), FALSE)","v":"Stock changes"},null,1]
["INDCONC",null,null,"HARDCOAL",1,null,null,"Calculated inland deliveries","Hard coal","2022M04",{"$f":"VLOOKUP(I822, LanguageData, MATCH(LanguageChosen, Language[Language],0), FALSE)","v":"Hard coal"},{"$f":"VLOOKUP(H822, LanguageData, MATCH(LanguageChosen, Language[Language],0), FALSE)","v":"Calculated inland deliveries"},null,1]
["STATDIFF",null,null,"HARDCOAL",1,null,null,"Statistical differences","Hard coal","2022M04",{"$f":"VLOOKUP(I823, LanguageData, MATCH(LanguageChosen, Language[Language],0), FALSE)","v":"Hard coal"},{"$f":"VLOOKUP(H823, LanguageData, MATCH(LanguageChosen, Language[Language],0), FALSE)","v":"Statistical differences"},null,1]
["INTERNAD",null,null,"HARDCOAL",1,null,null,"Internal market deliveries (observed)","Hard coal","2022M04",{"$f":"VLOOKUP(I824, LanguageData, MATCH(LanguageChosen, Language[Language],0), FALSE)","v":"Hard coal"},{"$f":"VLOOKUP(H824, LanguageData, MATCH(LanguageChosen, Language[Language],0), FALSE)","v":"Internal market deliveries (observed)"},null,1]
["MAINPROD",null,null,"HARDCOAL",1,null,null,"Deliveries to main activity producers","Hard coal","2022M04",{"$f":"VLOOKUP(I825, LanguageData, MATCH(LanguageChosen, Language[Language],0), FALSE)","v":"Hard coal"},{"$f":"VLOOKUP(H825, LanguageData, MATCH(LanguageChosen, Language[Language],0), FALSE)","v":"Deliveries to main activity producers"},null,1]
["ECOKEOVS",null,null,"HARDCOAL",1,null,null,"Deliveries to coking plants","Hard coal","2022M04",{"$f":"VLOOKUP(I826, LanguageData, MATCH(LanguageChosen, Language[Language],0), FALSE)","v":"Hard coal"},{"$f":"VLOOKUP(H826, LanguageData, MATCH(LanguageChosen, Language[Language],0), FALSE)","v":"Deliveries to coking plants"},null,1]
["TOTIND",null,null,"HARDCOAL",1,null,null,"Deliveries to total industry","Hard coal","2022M04",{"$f":"VLOOKUP(I827, LanguageData, MATCH(LanguageChosen, Language[Language],0), FALSE)","v":"Hard coal"},{"$f":"VLOOKUP(H827, LanguageData, MATCH(LanguageChosen, Language[Language],0), FALSE)","v":"Deliveries to total industry"},null,1]
["IRONSTL",null,null,"HARDCOAL",1,null,null,"Deliveries to total industry of which to iron and steel industry","Hard coal","2022M04",{"$f":"VLOOKUP(I828, LanguageData, MATCH(LanguageChosen, Language[Language],0), FALSE)","v":"Hard coal"},{"$f":"VLOOKUP(H828, LanguageData, MATCH(LanguageChosen, Language[Language],0), FALSE)","v":"Deliveries to total industry of which to iron and steel industry"},null,1]
["OTHER",null,null,"HARDCOAL",1,null,null,"Other deliveries (services, households, …)","Hard coal","2022M04",{"$f":"VLOOKUP(I829, LanguageData, MATCH(LanguageChosen, Language[Language],0), FALSE)","v":"Hard coal"},{"$f":"VLOOKUP(H829, LanguageData, MATCH(LanguageChosen, Language[Language],0), FALSE)","v":"Other deliveries (services, households, …)"},null,1]
["INDPROD",null,null,"BROWN",1,null,null,"Production ","Brown coal","2022M04",{"$f":"VLOOKUP(I830, LanguageData, MATCH(LanguageChosen, Language[Language],0), FALSE)","v":"Brown coal"},{"$f":"VLOOKUP(H830, LanguageData, MATCH(LanguageChosen, Language[Language],0), FALSE)","v":"Production "},null,1]
["OSOURCES",null,null,"BROWN",1,null,null,"Recovered products","Brown coal","2022M04",{"$f":"VLOOKUP(I831, LanguageData, MATCH(LanguageChosen, Language[Language],0), FALSE)","v":"Brown coal"},{"$f":"VLOOKUP(H831, LanguageData, MATCH(LanguageChosen, Language[Language],0), FALSE)","v":"Recovered products"},null,1]
["TOTIMPSB",null,null,"BROWN",1,null,null,"Total imports","Brown coal","2022M04",{"$f":"VLOOKUP(I832, LanguageData, MATCH(LanguageChosen, Language[Language],0), FALSE)","v":"Brown coal"},{"$f":"VLOOKUP(H832, LanguageData, MATCH(LanguageChosen, Language[Language],0), FALSE)","v":"Total imports"},null,1]
["TOTIMPSBEU",null,null,"BROWN",1,null,null,"Imports: of which from outside EU","Brown coal","2022M04",{"$f":"VLOOKUP(I833, LanguageData, MATCH(LanguageChosen, Language[Language],0), FALSE)","v":"Brown coal"},{"$f":"VLOOKUP(H833, LanguageData, MATCH(LanguageChosen, Language[Language],0), FALSE)","v":"Imports: of which from outside EU"},null,1]
["TOTEXPSB",null,null,"BROWN",1,null,null,"Total exports","Brown coal","2022M04",{"$f":"VLOOKUP(I834, LanguageData, MATCH(LanguageChosen, Language[Language],0), FALSE)","v":"Brown coal"},{"$f":"VLOOKUP(H834, LanguageData, MATCH(LanguageChosen, Language[Language],0), FALSE)","v":"Total exports"},null,1]
["STOCKSTART",null,null,"BROWN",1,null,null,"Stocks - beginning of period","Brown coal","2022M04",{"$f":"VLOOKUP(I835, LanguageData, MATCH(LanguageChosen, Language[Language],0), FALSE)","v":"Brown coal"},{"$f":"VLOOKUP(H835, LanguageData, MATCH(LanguageChosen, Language[Language],0), FALSE)","v":"Stocks - beginning of period"},null,1]
["STOCKEND",null,null,"BROWN",1,null,null,"Stocks - end of period","Brown coal","2022M04",{"$f":"VLOOKUP(I836, LanguageData, MATCH(LanguageChosen, Language[Language],0), FALSE)","v":"Brown coal"},{"$f":"VLOOKUP(H836, LanguageData, MATCH(LanguageChosen, Language[Language],0), FALSE)","v":"Stocks - end of period"},null,1]
["STCHANAT",null,null,"BROWN",1,null,null,"Stock changes","Brown coal","2022M04",{"$f":"VLOOKUP(I837, LanguageData, MATCH(LanguageChosen, Language[Language],0), FALSE)","v":"Brown coal"},{"$f":"VLOOKUP(H837, LanguageData, MATCH(LanguageChosen, Language[Language],0), FALSE)","v":"Stock changes"},null,1]
["INDCONC",null,null,"BROWN",1,null,null,"Calculated inland deliveries","Brown coal","2022M04",{"$f":"VLOOKUP(I838, LanguageData, MATCH(LanguageChosen, Language[Language],0), FALSE)","v":"Brown coal"},{"$f":"VLOOKUP(H838, LanguageData, MATCH(LanguageChosen, Language[Language],0), FALSE)","v":"Calculated inland deliveries"},null,1]
["STATDIFF",null,null,"BROWN",1,null,null,"Statistical differences","Brown coal","2022M04",{"$f":"VLOOKUP(I839, LanguageData, MATCH(LanguageChosen, Language[Language],0), FALSE)","v":"Brown coal"},{"$f":"VLOOKUP(H839, LanguageData, MATCH(LanguageChosen, Language[Language],0), FALSE)","v":"Statistical differences"},null,1]
["INTERNAD",null,null,"BROWN",1,null,null,"Internal market deliveries (observed)","Brown coal","2022M04",{"$f":"VLOOKUP(I840, LanguageData, MATCH(LanguageChosen, Language[Language],0), FALSE)","v":"Brown coal"},{"$f":"VLOOKUP(H840, LanguageData, MATCH(LanguageChosen, Language[Language],0), FALSE)","v":"Internal market deliveries (observed)"},null,1]
["MAINPROD",null,null,"BROWN",1,null,null,"Deliveries to main activity producers","Brown coal","2022M04",{"$f":"VLOOKUP(I841, LanguageData, MATCH(LanguageChosen, Language[Language],0), FALSE)","v":"Brown coal"},{"$f":"VLOOKUP(H841, LanguageData, MATCH(LanguageChosen, Language[Language],0), FALSE)","v":"Deliveries to main activity producers"},null,1]
["ECOKEOVS",null,null,"BROWN",1,null,null,"Deliveries to coking plants","Brown coal","2022M04",{"$f":"VLOOKUP(I842, LanguageData, MATCH(LanguageChosen, Language[Language],0), FALSE)","v":"Brown coal"},{"$f":"VLOOKUP(H842, LanguageData, MATCH(LanguageChosen, Language[Language],0), FALSE)","v":"Deliveries to coking plants"},null,1]
["TOTIND",null,null,"BROWN",1,null,null,"Deliveries to total industry","Brown coal","2022M04",{"$f":"VLOOKUP(I843, LanguageData, MATCH(LanguageChosen, Language[Language],0), FALSE)","v":"Brown coal"},{"$f":"VLOOKUP(H843, LanguageData, MATCH(LanguageChosen, Language[Language],0), FALSE)","v":"Deliveries to total industry"},null,1]
["IRONSTL",null,null,"BROWN",1,null,null,"Deliveries to total industry of which to iron and steel industry","Brown coal","2022M04",{"$f":"VLOOKUP(I844, LanguageData, MATCH(LanguageChosen, Language[Language],0), FALSE)","v":"Brown coal"},{"$f":"VLOOKUP(H844, LanguageData, MATCH(LanguageChosen, Language[Language],0), FALSE)","v":"Deliveries to total industry of which to iron and steel industry"},null,1]
["OTHER",null,null,"BROWN",1,null,null,"Other deliveries (services, households, …)","Brown coal","2022M04",{"$f":"VLOOKUP(I845, LanguageData, MATCH(LanguageChosen, Language[Language],0), FALSE)","v":"Brown coal"},{"$f":"VLOOKUP(H845, LanguageData, MATCH(LanguageChosen, Language[Language],0), FALSE)","v":"Other deliveries (services, households, …)"},null,1]
["INDPROD",null,null,"PEAT",1,null,null,"Production ","Peat","2022M04",{"$f":"VLOOKUP(I846, LanguageData, MATCH(LanguageChosen, Language[Language],0), FALSE)","v":"Peat"},{"$f":"VLOOKUP(H846, LanguageData, MATCH(LanguageChosen, Language[Language],0), FALSE)","v":"Production "},null,1]
["OSOURCES",null,null,"PEAT",1,null,null,"Recovered products","Peat",{"$f":"YEAR(DATE(LEFT($B$1,4),RIGHT($B$1,2)-N847,1)) & \"M\" & TEXT(MONTH(DATE(LEFT($B$1,4),RIGHT($B$1,2)-N847,1)),\"00\")","v":"2022M04"},{"$f":"VLOOKUP(I847, LanguageData, MATCH(LanguageChosen, Language[Language],0), FALSE)","v":"Peat"},{"$f":"VLOOKUP(H847, LanguageData, MATCH(LanguageChosen, Language[Language],0), FALSE)","v":"Recovered products"},null,1]
["TOTIMPSB",null,null,"PEAT",1,null,null,"Total imports","Peat","2022M04",{"$f":"VLOOKUP(I848, LanguageData, MATCH(LanguageChosen, Language[Language],0), FALSE)","v":"Peat"},{"$f":"VLOOKUP(H848, LanguageData, MATCH(LanguageChosen, Language[Language],0), FALSE)","v":"Total imports"},null,1]
["TOTIMPSBEU",null,null,"PEAT",1,null,null,"Imports: of which from outside EU","Peat","2022M04",{"$f":"VLOOKUP(I849, LanguageData, MATCH(LanguageChosen, Language[Language],0), FALSE)","v":"Peat"},{"$f":"VLOOKUP(H849, LanguageData, MATCH(LanguageChosen, Language[Language],0), FALSE)","v":"Imports: of which from outside EU"},null,1]
["TOTEXPSB",null,null,"PEAT",1,null,null,"Total exports","Peat","2022M04",{"$f":"VLOOKUP(I850, LanguageData, MATCH(LanguageChosen, Language[Language],0), FALSE)","v":"Peat"},{"$f":"VLOOKUP(H850, LanguageData, MATCH(LanguageChosen, Language[Language],0), FALSE)","v":"Total exports"},null,1]
["STOCKSTART",null,null,"PEAT",1,null,null,"Stocks - beginning of period","Peat","2022M04",{"$f":"VLOOKUP(I851, LanguageData, MATCH(LanguageChosen, Language[Language],0), FALSE)","v":"Peat"},{"$f":"VLOOKUP(H851, LanguageData, MATCH(LanguageChosen, Language[Language],0), FALSE)","v":"Stocks - beginning of period"},null,1]
["STOCKEND",null,null,"PEAT",1,null,null,"Stocks - end of period","Peat","2022M04",{"$f":"VLOOKUP(I852, LanguageData, MATCH(LanguageChosen, Language[Language],0), FALSE)","v":"Peat"},{"$f":"VLOOKUP(H852, LanguageData, MATCH(LanguageChosen, Language[Language],0), FALSE)","v":"Stocks - end of period"},null,1]
["STCHANAT",null,null,"PEAT",1,null,null,"Stock changes","Peat","2022M04",{"$f":"VLOOKUP(I853, LanguageData, MATCH(LanguageChosen, Language[Language],0), FALSE)","v":"Peat"},{"$f":"VLOOKUP(H853, LanguageData, MATCH(LanguageChosen, Language[Language],0), FALSE)","v":"Stock changes"},null,1]
["INDCONC",null,null,"PEAT",1,null,null,"Calculated inland deliveries","Peat","2022M04",{"$f":"VLOOKUP(I854, LanguageData, MATCH(LanguageChosen, Language[Language],0), FALSE)","v":"Peat"},{"$f":"VLOOKUP(H854, LanguageData, MATCH(LanguageChosen, Language[Language],0), FALSE)","v":"Calculated inland deliveries"},null,1]
["STATDIFF",null,null,"PEAT",1,null,null,"Statistical differences","Peat","2022M04",{"$f":"VLOOKUP(I855, LanguageData, MATCH(LanguageChosen, Language[Language],0), FALSE)","v":"Peat"},{"$f":"VLOOKUP(H855, LanguageData, MATCH(LanguageChosen, Language[Language],0), FALSE)","v":"Statistical differences"},null,1]
["INTERNAD",null,null,"PEAT",1,null,null,"Internal market deliveries (observed)","Peat","2022M04",{"$f":"VLOOKUP(I856, LanguageData, MATCH(LanguageChosen, Language[Language],0), FALSE)","v":"Peat"},{"$f":"VLOOKUP(H856, LanguageData, MATCH(LanguageChosen, Language[Language],0), FALSE)","v":"Internal market deliveries (observed)"},null,1]
["MAINPROD",null,null,"PEAT",1,null,null,"Deliveries to main activity producers","Peat","2022M04",{"$f":"VLOOKUP(I857, LanguageData, MATCH(LanguageChosen, Language[Language],0), FALSE)","v":"Peat"},{"$f":"VLOOKUP(H857, LanguageData, MATCH(LanguageChosen, Language[Language],0), FALSE)","v":"Deliveries to main activity producers"},null,1]
["ECOKEOVS",null,null,"PEAT",1,null,null,"Deliveries to coking plants","Peat","2022M04",{"$f":"VLOOKUP(I858, LanguageData, MATCH(LanguageChosen, Language[Language],0), FALSE)","v":"Peat"},{"$f":"VLOOKUP(H858, LanguageData, MATCH(LanguageChosen, Language[Language],0), FALSE)","v":"Deliveries to coking plants"},null,1]
["TOTIND",null,null,"PEAT",1,null,null,"Deliveries to total industry","Peat","2022M04",{"$f":"VLOOKUP(I859, LanguageData, MATCH(LanguageChosen, Language[Language],0), FALSE)","v":"Peat"},{"$f":"VLOOKUP(H859, LanguageData, MATCH(LanguageChosen, Language[Language],0), FALSE)","v":"Deliveries to total industry"},null,1]
["IRONSTL",null,null,"PEAT",1,null,null,"Deliveries to total industry of which to iron and steel industry","Peat","2022M04",{"$f":"VLOOKUP(I860, LanguageData, MATCH(LanguageChosen, Language[Language],0), FALSE)","v":"Peat"},{"$f":"VLOOKUP(H860, LanguageData, MATCH(LanguageChosen, Language[Language],0), FALSE)","v":"Deliveries to total industry of which to iron and steel industry"},null,1]
["OTHER",null,null,"PEAT",1,null,null,"Other deliveries (services, households, …)","Peat","2022M04",{"$f":"VLOOKUP(I861, LanguageData, MATCH(LanguageChosen, Language[Language],0), FALSE)","v":"Peat"},{"$f":"VLOOKUP(H861, LanguageData, MATCH(LanguageChosen, Language[Language],0), FALSE)","v":"Other deliveries (services, households, …)"},null,1]
["INDPROD",null,null,"OILSHALE",1,null,null,"Production ","Oil shale and oil sands","2022M04",{"$f":"VLOOKUP(I862, LanguageData, MATCH(LanguageChosen, Language[Language],0), FALSE)","v":"Oil shale and oil sands"},{"$f":"VLOOKUP(H862, LanguageData, MATCH(LanguageChosen, Language[Language],0), FALSE)","v":"Production "},null,1]
["OSOURCES",null,null,"OILSHALE",1,null,null,"Recovered products","Oil shale and oil sands","2022M04",{"$f":"VLOOKUP(I863, LanguageData, MATCH(LanguageChosen, Language[Language],0), FALSE)","v":"Oil shale and oil sands"},{"$f":"VLOOKUP(H863, LanguageData, MATCH(LanguageChosen, Language[Language],0), FALSE)","v":"Recovered products"},null,1]
["TOTIMPSB",null,null,"OILSHALE",1,null,null,"Total imports","Oil shale and oil sands","2022M04",{"$f":"VLOOKUP(I864, LanguageData, MATCH(LanguageChosen, Language[Language],0), FALSE)","v":"Oil shale and oil sands"},{"$f":"VLOOKUP(H864, LanguageData, MATCH(LanguageChosen, Language[Language],0), FALSE)","v":"Total imports"},null,1]
["TOTIMPSBEU",null,null,"OILSHALE",1,null,null,"Imports: of which from outside EU","Oil shale and oil sands","2022M04",{"$f":"VLOOKUP(I865, LanguageData, MATCH(LanguageChosen, Language[Language],0), FALSE)","v":"Oil shale and oil sands"},{"$f":"VLOOKUP(H865, LanguageData, MATCH(LanguageChosen, Language[Language],0), FALSE)","v":"Imports: of which from outside EU"},null,1]
["TOTEXPSB",null,null,"OILSHALE",1,null,null,"Total exports","Oil shale and oil sands","2022M04",{"$f":"VLOOKUP(I866, LanguageData, MATCH(LanguageChosen, Language[Language],0), FALSE)","v":"Oil shale and oil sands"},{"$f":"VLOOKUP(H866, LanguageData, MATCH(LanguageChosen, Language[Language],0), FALSE)","v":"Total exports"},null,1]
["STOCKSTART",null,null,"OILSHALE",1,null,null,"Stocks - beginning of period","Oil shale and oil sands","2022M04",{"$f":"VLOOKUP(I867, LanguageData, MATCH(LanguageChosen, Language[Language],0), FALSE)","v":"Oil shale and oil sands"},{"$f":"VLOOKUP(H867, LanguageData, MATCH(LanguageChosen, Language[Language],0), FALSE)","v":"Stocks - beginning of period"},null,1]
["STOCKEND",null,null,"OILSHALE",1,null,null,"Stocks - end of period","Oil shale and oil sands","2022M04",{"$f":"VLOOKUP(I868, LanguageData, MATCH(LanguageChosen, Language[Language],0), FALSE)","v":"Oil shale and oil sands"},{"$f":"VLOOKUP(H868, LanguageData, MATCH(LanguageChosen, Language[Language],0), FALSE)","v":"Stocks - end of period"},null,1]
["STCHANAT",null,null,"OILSHALE",1,null,null,"Stock changes","Oil shale and oil sands","2022M04",{"$f":"VLOOKUP(I869, LanguageData, MATCH(LanguageChosen, Language[Language],0), FALSE)","v":"Oil shale and oil sands"},{"$f":"VLOOKUP(H869, LanguageData, MATCH(LanguageChosen, Language[Language],0), FALSE)","v":"Stock changes"},null,1]
["INDCONC",null,null,"OILSHALE",1,null,null,"Calculated inland deliveries","Oil shale and oil sands","2022M04",{"$f":"VLOOKUP(I870, LanguageData, MATCH(LanguageChosen, Language[Language],0), FALSE)","v":"Oil shale and oil sands"},{"$f":"VLOOKUP(H870, LanguageData, MATCH(LanguageChosen, Language[Language],0), FALSE)","v":"Calculated inland deliveries"},null,1]
["STATDIFF",null,null,"OILSHALE",1,null,null,"Statistical differences","Oil shale and oil sands","2022M04",{"$f":"VLOOKUP(I871, LanguageData, MATCH(LanguageChosen, Language[Language],0), FALSE)","v":"Oil shale and oil sands"},{"$f":"VLOOKUP(H871, LanguageData, MATCH(LanguageChosen, Language[Language],0), FALSE)","v":"Statistical differences"},null,1]
["INTERNAD",null,null,"OILSHALE",1,null,null,"Internal market deliveries (observed)","Oil shale and oil sands","2022M04",{"$f":"VLOOKUP(I872, LanguageData, MATCH(LanguageChosen, Language[Language],0), FALSE)","v":"Oil shale and oil sands"},{"$f":"VLOOKUP(H872, LanguageData, MATCH(LanguageChosen, Language[Language],0), FALSE)","v":"Internal market deliveries (observed)"},null,1]
["MAINPROD",null,null,"OILSHALE",1,null,null,"Deliveries to main activity producers","Oil shale and oil sands","2022M04",{"$f":"VLOOKUP(I873, LanguageData, MATCH(LanguageChosen, Language[Language],0), FALSE)","v":"Oil shale and oil sands"},{"$f":"VLOOKUP(H873, LanguageData, MATCH(LanguageChosen, Language[Language],0), FALSE)","v":"Deliveries to main activity producers"},null,1]
["ECOKEOVS",null,null,"OILSHALE",1,null,null,"Deliveries to coking plants","Oil shale and oil sands","2022M04",{"$f":"VLOOKUP(I874, LanguageData, MATCH(LanguageChosen, Language[Language],0), FALSE)","v":"Oil shale and oil sands"},{"$f":"VLOOKUP(H874, LanguageData, MATCH(LanguageChosen, Language[Language],0), FALSE)","v":"Deliveries to coking plants"},null,1]
["TOTIND",null,null,"OILSHALE",1,null,null,"Deliveries to total industry","Oil shale and oil sands","2022M04",{"$f":"VLOOKUP(I875, LanguageData, MATCH(LanguageChosen, Language[Language],0), FALSE)","v":"Oil shale and oil sands"},{"$f":"VLOOKUP(H875, LanguageData, MATCH(LanguageChosen, Language[Language],0), FALSE)","v":"Deliveries to total industry"},null,1]
["IRONSTL",null,null,"OILSHALE",1,null,null,"Deliveries to total industry of which to iron and steel industry","Oil shale and oil sands","2022M04",{"$f":"VLOOKUP(I876, LanguageData, MATCH(LanguageChosen, Language[Language],0), FALSE)","v":"Oil shale and oil sands"},{"$f":"VLOOKUP(H876, LanguageData, MATCH(LanguageChosen, Language[Language],0), FALSE)","v":"Deliveries to total industry of which to iron and steel industry"},null,1]
["OTHER",null,null,"OILSHALE",1,null,null,"Other deliveries (services, households, …)","Oil shale and oil sands","2022M04",{"$f":"VLOOKUP(I877, LanguageData, MATCH(LanguageChosen, Language[Language],0), FALSE)","v":"Oil shale and oil sands"},{"$f":"VLOOKUP(H877, LanguageData, MATCH(LanguageChosen, Language[Language],0), FALSE)","v":"Other deliveries (services, households, …)"},null,1]
["INDPROD",null,null,"COKEOVEN",1,null,null,"Production ","Coke oven coke","2022M04",{"$f":"VLOOKUP(I878, LanguageData, MATCH(LanguageChosen, Language[Language],0), FALSE)","v":"Coke oven coke"},{"$f":"VLOOKUP(H878, LanguageData, MATCH(LanguageChosen, Language[Language],0), FALSE)","v":"Production "},null,1]
["OSOURCES",null,null,"COKEOVEN",1,null,null,"Recovered products","Coke oven coke","2022M04",{"$f":"VLOOKUP(I879, LanguageData, MATCH(LanguageChosen, Language[Language],0), FALSE)","v":"Coke oven coke"},{"$f":"VLOOKUP(H879, LanguageData, MATCH(LanguageChosen, Language[Language],0), FALSE)","v":"Recovered products"},null,1]
["TOTIMPSB",null,null,"COKEOVEN",1,null,null,"Total imports","Coke oven coke","2022M04",{"$f":"VLOOKUP(I880, LanguageData, MATCH(LanguageChosen, Language[Language],0), FALSE)","v":"Coke oven coke"},{"$f":"VLOOKUP(H880, LanguageData, MATCH(LanguageChosen, Language[Language],0), FALSE)","v":"Total imports"},null,1]
["TOTIMPSBEU",null,null,"COKEOVEN",1,null,null,"Imports: of which from outside EU","Coke oven coke","2022M04",{"$f":"VLOOKUP(I881, LanguageData, MATCH(LanguageChosen, Language[Language],0), FALSE)","v":"Coke oven coke"},{"$f":"VLOOKUP(H881, LanguageData, MATCH(LanguageChosen, Language[Language],0), FALSE)","v":"Imports: of which from outside EU"},null,1]
["TOTEXPSB",null,null,"COKEOVEN",1,null,null,"Total exports","Coke oven coke","2022M04",{"$f":"VLOOKUP(I882, LanguageData, MATCH(LanguageChosen, Language[Language],0), FALSE)","v":"Coke oven coke"},{"$f":"VLOOKUP(H882, LanguageData, MATCH(LanguageChosen, Language[Language],0), FALSE)","v":"Total exports"},null,1]
["STOCKSTART",null,null,"COKEOVEN",1,null,null,"Stocks - beginning of period","Coke oven coke","2022M04",{"$f":"VLOOKUP(I883, LanguageData, MATCH(LanguageChosen, Language[Language],0), FALSE)","v":"Coke oven coke"},{"$f":"VLOOKUP(H883, LanguageData, MATCH(LanguageChosen, Language[Language],0), FALSE)","v":"Stocks - beginning of period"},null,1]
["STOCKEND",null,null,"COKEOVEN",1,null,null,"Stocks - end of period","Coke oven coke","2022M04",{"$f":"VLOOKUP(I884, LanguageData, MATCH(LanguageChosen, Language[Language],0), FALSE)","v":"Coke oven coke"},{"$f":"VLOOKUP(H884, LanguageData, MATCH(LanguageChosen, Language[Language],0), FALSE)","v":"Stocks - end of period"},null,1]
["STCHANAT",null,null,"COKEOVEN",1,null,null,"Stock changes","Coke oven coke","2022M04",{"$f":"VLOOKUP(I885, LanguageData, MATCH(LanguageChosen, Language[Language],0), FALSE)","v":"Coke oven coke"},{"$f":"VLOOKUP(H885, LanguageData, MATCH(LanguageChosen, Language[Language],0), FALSE)","v":"Stock changes"},null,1]
["INDCONC",null,null,"COKEOVEN",1,null,null,"Calculated inland deliveries","Coke oven coke","2022M04",{"$f":"VLOOKUP(I886, LanguageData, MATCH(LanguageChosen, Language[Language],0), FALSE)","v":"Coke oven coke"},{"$f":"VLOOKUP(H886, LanguageData, MATCH(LanguageChosen, Language[Language],0), FALSE)","v":"Calculated inland deliveries"},null,1]
["STATDIFF",null,null,"COKEOVEN",1,null,null,"Statistical differences","Coke oven coke","2022M04",{"$f":"VLOOKUP(I887, LanguageData, MATCH(LanguageChosen, Language[Language],0), FALSE)","v":"Coke oven coke"},{"$f":"VLOOKUP(H887, LanguageData, MATCH(LanguageChosen, Language[Language],0), FALSE)","v":"Statistical differences"},null,1]
["INTERNAD",null,null,"COKEOVEN",1,null,null,"Internal market deliveries (observed)","Coke oven coke","2022M04",{"$f":"VLOOKUP(I888, LanguageData, MATCH(LanguageChosen, Language[Language],0), FALSE)","v":"Coke oven coke"},{"$f":"VLOOKUP(H888, LanguageData, MATCH(LanguageChosen, Language[Language],0), FALSE)","v":"Internal market deliveries (observed)"},null,1]
["MAINPROD",null,null,"COKEOVEN",1,null,null,"Deliveries to main activity producers","Coke oven coke","2022M04",{"$f":"VLOOKUP(I889, LanguageData, MATCH(LanguageChosen, Language[Language],0), FALSE)","v":"Coke oven coke"},{"$f":"VLOOKUP(H889, LanguageData, MATCH(LanguageChosen, Language[Language],0), FALSE)","v":"Deliveries to main activity producers"},null,1]
["ECOKEOVS",null,null,"COKEOVEN",1,null,null,"Deliveries to coking plants","Coke oven coke","2022M04",{"$f":"VLOOKUP(I890, LanguageData, MATCH(LanguageChosen, Language[Language],0), FALSE)","v":"Coke oven coke"},{"$f":"VLOOKUP(H890, LanguageData, MATCH(LanguageChosen, Language[Language],0), FALSE)","v":"Deliveries to coking plants"},null,1]
["TOTIND",null,null,"COKEOVEN",1,null,null,"Deliveries to total industry","Coke oven coke","2022M04",{"$f":"VLOOKUP(I891, LanguageData, MATCH(LanguageChosen, Language[Language],0), FALSE)","v":"Coke oven coke"},{"$f":"VLOOKUP(H891, LanguageData, MATCH(LanguageChosen, Language[Language],0), FALSE)","v":"Deliveries to total industry"},null,1]
["IRONSTL",null,null,"COKEOVEN",1,null,null,"Deliveries to total industry of which to iron and steel industry","Coke oven coke","2022M04",{"$f":"VLOOKUP(I892, LanguageData, MATCH(LanguageChosen, Language[Language],0), FALSE)","v":"Coke oven coke"},{"$f":"VLOOKUP(H892, LanguageData, MATCH(LanguageChosen, Language[Language],0), FALSE)","v":"Deliveries to total industry of which to iron and steel industry"},null,1]
["OTHER",null,null,"COKEOVEN",1,null,null,"Other deliveries (services, households, …)","Coke oven coke","2022M04",{"$f":"VLOOKUP(I893, LanguageData, MATCH(LanguageChosen, Language[Language],0), FALSE)","v":"Coke oven coke"},{"$f":"VLOOKUP(H893, LanguageData, MATCH(LanguageChosen, Language[Language],0), FALSE)","v":"Other deliveries (services, households, …)"},null,1]
["INDPROD",null,null,"HARDCOAL",1,null,null,"Production ","Hard coal","2022M05",{"$f":"VLOOKUP(I894, LanguageData, MATCH(LanguageChosen, Language[Language],0), FALSE)","v":"Hard coal"},{"$f":"VLOOKUP(H894, LanguageData, MATCH(LanguageChosen, Language[Language],0), FALSE)","v":"Production "},null,0]
["OSOURCES",null,null,"HARDCOAL",1,null,null,"Recovered products","Hard coal","2022M05",{"$f":"VLOOKUP(I895, LanguageData, MATCH(LanguageChosen, Language[Language],0), FALSE)","v":"Hard coal"},{"$f":"VLOOKUP(H895, LanguageData, MATCH(LanguageChosen, Language[Language],0), FALSE)","v":"Recovered products"},null,0]
["TOTIMPSB",null,null,"HARDCOAL",1,null,null,"Total imports","Hard coal","2022M05",{"$f":"VLOOKUP(I896, LanguageData, MATCH(LanguageChosen, Language[Language],0), FALSE)","v":"Hard coal"},{"$f":"VLOOKUP(H896, LanguageData, MATCH(LanguageChosen, Language[Language],0), FALSE)","v":"Total imports"},null,0]
["TOTIMPSBEU",null,null,"HARDCOAL",1,null,null,"Imports: of which from outside EU","Hard coal","2022M05",{"$f":"VLOOKUP(I897, LanguageData, MATCH(LanguageChosen, Language[Language],0), FALSE)","v":"Hard coal"},{"$f":"VLOOKUP(H897, LanguageData, MATCH(LanguageChosen, Language[Language],0), FALSE)","v":"Imports: of which from outside EU"},null,0]
["TOTEXPSB",null,null,"HARDCOAL",1,null,null,"Total exports","Hard coal","2022M05",{"$f":"VLOOKUP(I898, LanguageData, MATCH(LanguageChosen, Language[Language],0), FALSE)","v":"Hard coal"},{"$f":"VLOOKUP(H898, LanguageData, MATCH(LanguageChosen, Language[Language],0), FALSE)","v":"Total exports"},null,0]
["STOCKSTART",null,null,"HARDCOAL",1,null,null,"Stocks - beginning of period","Hard coal","2022M05",{"$f":"VLOOKUP(I899, LanguageData, MATCH(LanguageChosen, Language[Language],0), FALSE)","v":"Hard coal"},{"$f":"VLOOKUP(H899, LanguageData, MATCH(LanguageChosen, Language[Language],0), FALSE)","v":"Stocks - beginning of period"},null,0]
["STOCKEND",null,null,"HARDCOAL",1,null,null,"Stocks - end of period","Hard coal","2022M05",{"$f":"VLOOKUP(I900, LanguageData, MATCH(LanguageChosen, Language[Language],0), FALSE)","v":"Hard coal"},{"$f":"VLOOKUP(H900, LanguageData, MATCH(LanguageChosen, Language[Language],0), FALSE)","v":"Stocks - end of period"},null,0]
["STCHANAT",null,null,"HARDCOAL",1,null,null,"Stock changes","Hard coal","2022M05",{"$f":"VLOOKUP(I901, LanguageData, MATCH(LanguageChosen, Language[Language],0), FALSE)","v":"Hard coal"},{"$f":"VLOOKUP(H901, LanguageData, MATCH(LanguageChosen, Language[Language],0), FALSE)","v":"Stock changes"},null,0]
["INDCONC",null,null,"HARDCOAL",1,null,null,"Calculated inland deliveries","Hard coal","2022M05",{"$f":"VLOOKUP(I902, LanguageData, MATCH(LanguageChosen, Language[Language],0), FALSE)","v":"Hard coal"},{"$f":"VLOOKUP(H902, LanguageData, MATCH(LanguageChosen, Language[Language],0), FALSE)","v":"Calculated inland deliveries"},null,0]
["STATDIFF",null,null,"HARDCOAL",1,null,null,"Statistical differences","Hard coal","2022M05",{"$f":"VLOOKUP(I903, LanguageData, MATCH(LanguageChosen, Language[Language],0), FALSE)","v":"Hard coal"},{"$f":"VLOOKUP(H903, LanguageData, MATCH(LanguageChosen, Language[Language],0), FALSE)","v":"Statistical differences"},null,0]
["INTERNAD",null,null,"HARDCOAL",1,null,null,"Internal market deliveries (observed)","Hard coal","2022M05",{"$f":"VLOOKUP(I904, LanguageData, MATCH(LanguageChosen, Language[Language],0), FALSE)","v":"Hard coal"},{"$f":"VLOOKUP(H904, LanguageData, MATCH(LanguageChosen, Language[Language],0), FALSE)","v":"Internal market deliveries (observed)"},null,0]
["MAINPROD",null,null,"HARDCOAL",1,null,null,"Deliveries to main activity producers","Hard coal","2022M05",{"$f":"VLOOKUP(I905, LanguageData, MATCH(LanguageChosen, Language[Language],0), FALSE)","v":"Hard coal"},{"$f":"VLOOKUP(H905, LanguageData, MATCH(LanguageChosen, Language[Language],0), FALSE)","v":"Deliveries to main activity producers"},null,0]
["ECOKEOVS",null,null,"HARDCOAL",1,null,null,"Deliveries to coking plants","Hard coal","2022M05",{"$f":"VLOOKUP(I906, LanguageData, MATCH(LanguageChosen, Language[Language],0), FALSE)","v":"Hard coal"},{"$f":"VLOOKUP(H906, LanguageData, MATCH(LanguageChosen, Language[Language],0), FALSE)","v":"Deliveries to coking plants"},null,0]
["TOTIND",null,null,"HARDCOAL",1,null,null,"Deliveries to total industry","Hard coal","2022M05",{"$f":"VLOOKUP(I907, LanguageData, MATCH(LanguageChosen, Language[Language],0), FALSE)","v":"Hard coal"},{"$f":"VLOOKUP(H907, LanguageData, MATCH(LanguageChosen, Language[Language],0), FALSE)","v":"Deliveries to total industry"},null,0]
["IRONSTL",null,null,"HARDCOAL",1,null,null,"Deliveries to total industry of which to iron and steel industry","Hard coal","2022M05",{"$f":"VLOOKUP(I908, LanguageData, MATCH(LanguageChosen, Language[Language],0), FALSE)","v":"Hard coal"},{"$f":"VLOOKUP(H908, LanguageData, MATCH(LanguageChosen, Language[Language],0), FALSE)","v":"Deliveries to total industry of which to iron and steel industry"},null,0]
["OTHER",null,null,"HARDCOAL",1,null,null,"Other deliveries (services, households, …)","Hard coal","2022M05",{"$f":"VLOOKUP(I909, LanguageData, MATCH(LanguageChosen, Language[Language],0), FALSE)","v":"Hard coal"},{"$f":"VLOOKUP(H909, LanguageData, MATCH(LanguageChosen, Language[Language],0), FALSE)","v":"Other deliveries (services, households, …)"},null,0]
["INDPROD",null,null,"BROWN",1,null,null,"Production ","Brown coal","2022M05",{"$f":"VLOOKUP(I910, LanguageData, MATCH(LanguageChosen, Language[Language],0), FALSE)","v":"Brown coal"},{"$f":"VLOOKUP(H910, LanguageData, MATCH(LanguageChosen, Language[Language],0), FALSE)","v":"Production "},null,0]
["OSOURCES",null,null,"BROWN",1,null,null,"Recovered products","Brown coal",{"$f":"YEAR(DATE(LEFT($B$1,4),RIGHT($B$1,2)-N911,1)) & \"M\" & TEXT(MONTH(DATE(LEFT($B$1,4),RIGHT($B$1,2)-N911,1)),\"00\")","v":"2022M05"},{"$f":"VLOOKUP(I911, LanguageData, MATCH(LanguageChosen, Language[Language],0), FALSE)","v":"Brown coal"},{"$f":"VLOOKUP(H911, LanguageData, MATCH(LanguageChosen, Language[Language],0), FALSE)","v":"Recovered products"},null,0]
["TOTIMPSB",null,null,"BROWN",1,null,null,"Total imports","Brown coal","2022M05",{"$f":"VLOOKUP(I912, LanguageData, MATCH(LanguageChosen, Language[Language],0), FALSE)","v":"Brown coal"},{"$f":"VLOOKUP(H912, LanguageData, MATCH(LanguageChosen, Language[Language],0), FALSE)","v":"Total imports"},null,0]
["TOTIMPSBEU",null,null,"BROWN",1,null,null,"Imports: of which from outside EU","Brown coal","2022M05",{"$f":"VLOOKUP(I913, LanguageData, MATCH(LanguageChosen, Language[Language],0), FALSE)","v":"Brown coal"},{"$f":"VLOOKUP(H913, LanguageData, MATCH(LanguageChosen, Language[Language],0), FALSE)","v":"Imports: of which from outside EU"},null,0]
["TOTEXPSB",null,null,"BROWN",1,null,null,"Total exports","Brown coal","2022M05",{"$f":"VLOOKUP(I914, LanguageData, MATCH(LanguageChosen, Language[Language],0), FALSE)","v":"Brown coal"},{"$f":"VLOOKUP(H914, LanguageData, MATCH(LanguageChosen, Language[Language],0), FALSE)","v":"Total exports"},null,0]
["STOCKSTART",null,null,"BROWN",1,null,null,"Stocks - beginning of period","Brown coal","2022M05",{"$f":"VLOOKUP(I915, LanguageData, MATCH(LanguageChosen, Language[Language],0), FALSE)","v":"Brown coal"},{"$f":"VLOOKUP(H915, LanguageData, MATCH(LanguageChosen, Language[Language],0), FALSE)","v":"Stocks - beginning of period"},null,0]
["STOCKEND",null,null,"BROWN",1,null,null,"Stocks - end of period","Brown coal","2022M05",{"$f":"VLOOKUP(I916, LanguageData, MATCH(LanguageChosen, Language[Language],0), FALSE)","v":"Brown coal"},{"$f":"VLOOKUP(H916, LanguageData, MATCH(LanguageChosen, Language[Language],0), FALSE)","v":"Stocks - end of period"},null,0]
["STCHANAT",null,null,"BROWN",1,null,null,"Stock changes","Brown coal","2022M05",{"$f":"VLOOKUP(I917, LanguageData, MATCH(LanguageChosen, Language[Language],0), FALSE)","v":"Brown coal"},{"$f":"VLOOKUP(H917, LanguageData, MATCH(LanguageChosen, Language[Language],0), FALSE)","v":"Stock changes"},null,0]
["INDCONC",null,null,"BROWN",1,null,null,"Calculated inland deliveries","Brown coal","2022M05",{"$f":"VLOOKUP(I918, LanguageData, MATCH(LanguageChosen, Language[Language],0), FALSE)","v":"Brown coal"},{"$f":"VLOOKUP(H918, LanguageData, MATCH(LanguageChosen, Language[Language],0), FALSE)","v":"Calculated inland deliveries"},null,0]
["STATDIFF",null,null,"BROWN",1,null,null,"Statistical differences","Brown coal","2022M05",{"$f":"VLOOKUP(I919, LanguageData, MATCH(LanguageChosen, Language[Language],0), FALSE)","v":"Brown coal"},{"$f":"VLOOKUP(H919, LanguageData, MATCH(LanguageChosen, Language[Language],0), FALSE)","v":"Statistical differences"},null,0]
["INTERNAD",null,null,"BROWN",1,null,null,"Internal market deliveries (observed)","Brown coal","2022M05",{"$f":"VLOOKUP(I920, LanguageData, MATCH(LanguageChosen, Language[Language],0), FALSE)","v":"Brown coal"},{"$f":"VLOOKUP(H920, LanguageData, MATCH(LanguageChosen, Language[Language],0), FALSE)","v":"Internal market deliveries (observed)"},null,0]
["MAINPROD",null,null,"BROWN",1,null,null,"Deliveries to main activity producers","Brown coal","2022M05",{"$f":"VLOOKUP(I921, LanguageData, MATCH(LanguageChosen, Language[Language],0), FALSE)","v":"Brown coal"},{"$f":"VLOOKUP(H921, LanguageData, MATCH(LanguageChosen, Language[Language],0), FALSE)","v":"Deliveries to main activity producers"},null,0]
["ECOKEOVS",null,null,"BROWN",1,null,null,"Deliveries to coking plants","Brown coal","2022M05",{"$f":"VLOOKUP(I922, LanguageData, MATCH(LanguageChosen, Language[Language],0), FALSE)","v":"Brown coal"},{"$f":"VLOOKUP(H922, LanguageData, MATCH(LanguageChosen, Language[Language],0), FALSE)","v":"Deliveries to coking plants"},null,0]
["TOTIND",null,null,"BROWN",1,null,null,"Deliveries to total industry","Brown coal","2022M05",{"$f":"VLOOKUP(I923, LanguageData, MATCH(LanguageChosen, Language[Language],0), FALSE)","v":"Brown coal"},{"$f":"VLOOKUP(H923, LanguageData, MATCH(LanguageChosen, Language[Language],0), FALSE)","v":"Deliveries to total industry"},null,0]
["IRONSTL",null,null,"BROWN",1,null,null,"Deliveries to total industry of which to iron and steel industry","Brown coal","2022M05",{"$f":"VLOOKUP(I924, LanguageData, MATCH(LanguageChosen, Language[Language],0), FALSE)","v":"Brown coal"},{"$f":"VLOOKUP(H924, LanguageData, MATCH(LanguageChosen, Language[Language],0), FALSE)","v":"Deliveries to total industry of which to iron and steel industry"},null,0]
["OTHER",null,null,"BROWN",1,null,null,"Other deliveries (services, households, …)","Brown coal","2022M05",{"$f":"VLOOKUP(I925, LanguageData, MATCH(LanguageChosen, Language[Language],0), FALSE)","v":"Brown coal"},{"$f":"VLOOKUP(H925, LanguageData, MATCH(LanguageChosen, Language[Language],0), FALSE)","v":"Other deliveries (services, households, …)"},null,0]
["INDPROD",null,null,"PEAT",1,null,null,"Production ","Peat","2022M05",{"$f":"VLOOKUP(I926, LanguageData, MATCH(LanguageChosen, Language[Language],0), FALSE)","v":"Peat"},{"$f":"VLOOKUP(H926, LanguageData, MATCH(LanguageChosen, Language[Language],0), FALSE)","v":"Production "},null,0]
["OSOURCES",null,null,"PEAT",1,null,null,"Recovered products","Peat","2022M05",{"$f":"VLOOKUP(I927, LanguageData, MATCH(LanguageChosen, Language[Language],0), FALSE)","v":"Peat"},{"$f":"VLOOKUP(H927, LanguageData, MATCH(LanguageChosen, Language[Language],0), FALSE)","v":"Recovered products"},null,0]
["TOTIMPSB",null,null,"PEAT",1,null,null,"Total imports","Peat","2022M05",{"$f":"VLOOKUP(I928, LanguageData, MATCH(LanguageChosen, Language[Language],0), FALSE)","v":"Peat"},{"$f":"VLOOKUP(H928, LanguageData, MATCH(LanguageChosen, Language[Language],0), FALSE)","v":"Total imports"},null,0]
["TOTIMPSBEU",null,null,"PEAT",1,null,null,"Imports: of which from outside EU","Peat","2022M05",{"$f":"VLOOKUP(I929, LanguageData, MATCH(LanguageChosen, Language[Language],0), FALSE)","v":"Peat"},{"$f":"VLOOKUP(H929, LanguageData, MATCH(LanguageChosen, Language[Language],0), FALSE)","v":"Imports: of which from outside EU"},null,0]
["TOTEXPSB",null,null,"PEAT",1,null,null,"Total exports","Peat","2022M05",{"$f":"VLOOKUP(I930, LanguageData, MATCH(LanguageChosen, Language[Language],0), FALSE)","v":"Peat"},{"$f":"VLOOKUP(H930, LanguageData, MATCH(LanguageChosen, Language[Language],0), FALSE)","v":"Total exports"},null,0]
["STOCKSTART",null,null,"PEAT",1,null,null,"Stocks - beginning of period","Peat","2022M05",{"$f":"VLOOKUP(I931, LanguageData, MATCH(LanguageChosen, Language[Language],0), FALSE)","v":"Peat"},{"$f":"VLOOKUP(H931, LanguageData, MATCH(LanguageChosen, Language[Language],0), FALSE)","v":"Stocks - beginning of period"},null,0]
["STOCKEND",null,null,"PEAT",1,null,null,"Stocks - end of period","Peat","2022M05",{"$f":"VLOOKUP(I932, LanguageData, MATCH(LanguageChosen, Language[Language],0), FALSE)","v":"Peat"},{"$f":"VLOOKUP(H932, LanguageData, MATCH(LanguageChosen, Language[Language],0), FALSE)","v":"Stocks - end of period"},null,0]
["STCHANAT",null,null,"PEAT",1,null,null,"Stock changes","Peat","2022M05",{"$f":"VLOOKUP(I933, LanguageData, MATCH(LanguageChosen, Language[Language],0), FALSE)","v":"Peat"},{"$f":"VLOOKUP(H933, LanguageData, MATCH(LanguageChosen, Language[Language],0), FALSE)","v":"Stock changes"},null,0]
["INDCONC",null,null,"PEAT",1,null,null,"Calculated inland deliveries","Peat","2022M05",{"$f":"VLOOKUP(I934, LanguageData, MATCH(LanguageChosen, Language[Language],0), FALSE)","v":"Peat"},{"$f":"VLOOKUP(H934, LanguageData, MATCH(LanguageChosen, Language[Language],0), FALSE)","v":"Calculated inland deliveries"},null,0]
["STATDIFF",null,null,"PEAT",1,null,null,"Statistical differences","Peat","2022M05",{"$f":"VLOOKUP(I935, LanguageData, MATCH(LanguageChosen, Language[Language],0), FALSE)","v":"Peat"},{"$f":"VLOOKUP(H935, LanguageData, MATCH(LanguageChosen, Language[Language],0), FALSE)","v":"Statistical differences"},null,0]
["INTERNAD",null,null,"PEAT",1,null,null,"Internal market deliveries (observed)","Peat","2022M05",{"$f":"VLOOKUP(I936, LanguageData, MATCH(LanguageChosen, Language[Language],0), FALSE)","v":"Peat"},{"$f":"VLOOKUP(H936, LanguageData, MATCH(LanguageChosen, Language[Language],0), FALSE)","v":"Internal market deliveries (observed)"},null,0]
["MAINPROD",null,null,"PEAT",1,null,null,"Deliveries to main activity producers","Peat","2022M05",{"$f":"VLOOKUP(I937, LanguageData, MATCH(LanguageChosen, Language[Language],0), FALSE)","v":"Peat"},{"$f":"VLOOKUP(H937, LanguageData, MATCH(LanguageChosen, Language[Language],0), FALSE)","v":"Deliveries to main activity producers"},null,0]
["ECOKEOVS",null,null,"PEAT",1,null,null,"Deliveries to coking plants","Peat","2022M05",{"$f":"VLOOKUP(I938, LanguageData, MATCH(LanguageChosen, Language[Language],0), FALSE)","v":"Peat"},{"$f":"VLOOKUP(H938, LanguageData, MATCH(LanguageChosen, Language[Language],0), FALSE)","v":"Deliveries to coking plants"},null,0]
["TOTIND",null,null,"PEAT",1,null,null,"Deliveries to total industry","Peat","2022M05",{"$f":"VLOOKUP(I939, LanguageData, MATCH(LanguageChosen, Language[Language],0), FALSE)","v":"Peat"},{"$f":"VLOOKUP(H939, LanguageData, MATCH(LanguageChosen, Language[Language],0), FALSE)","v":"Deliveries to total industry"},null,0]
["IRONSTL",null,null,"PEAT",1,null,null,"Deliveries to total industry of which to iron and steel industry","Peat","2022M05",{"$f":"VLOOKUP(I940, LanguageData, MATCH(LanguageChosen, Language[Language],0), FALSE)","v":"Peat"},{"$f":"VLOOKUP(H940, LanguageData, MATCH(LanguageChosen, Language[Language],0), FALSE)","v":"Deliveries to total industry of which to iron and steel industry"},null,0]
["OTHER",null,null,"PEAT",1,null,null,"Other deliveries (services, households, …)","Peat","2022M05",{"$f":"VLOOKUP(I941, LanguageData, MATCH(LanguageChosen, Language[Language],0), FALSE)","v":"Peat"},{"$f":"VLOOKUP(H941, LanguageData, MATCH(LanguageChosen, Language[Language],0), FALSE)","v":"Other deliveries (services, households, …)"},null,0]
["INDPROD",null,null,"OILSHALE",1,null,null,"Production ","Oil shale and oil sands","2022M05",{"$f":"VLOOKUP(I942, LanguageData, MATCH(LanguageChosen, Language[Language],0), FALSE)","v":"Oil shale and oil sands"},{"$f":"VLOOKUP(H942, LanguageData, MATCH(LanguageChosen, Language[Language],0), FALSE)","v":"Production "},null,0]
["OSOURCES",null,null,"OILSHALE",1,null,null,"Recovered products","Oil shale and oil sands","2022M05",{"$f":"VLOOKUP(I943, LanguageData, MATCH(LanguageChosen, Language[Language],0), FALSE)","v":"Oil shale and oil sands"},{"$f":"VLOOKUP(H943, LanguageData, MATCH(LanguageChosen, Language[Language],0), FALSE)","v":"Recovered products"},null,0]
["TOTIMPSB",null,null,"OILSHALE",1,null,null,"Total imports","Oil shale and oil sands","2022M05",{"$f":"VLOOKUP(I944, LanguageData, MATCH(LanguageChosen, Language[Language],0), FALSE)","v":"Oil shale and oil sands"},{"$f":"VLOOKUP(H944, LanguageData, MATCH(LanguageChosen, Language[Language],0), FALSE)","v":"Total imports"},null,0]
["TOTIMPSBEU",null,null,"OILSHALE",1,null,null,"Imports: of which from outside EU","Oil shale and oil sands","2022M05",{"$f":"VLOOKUP(I945, LanguageData, MATCH(LanguageChosen, Language[Language],0), FALSE)","v":"Oil shale and oil sands"},{"$f":"VLOOKUP(H945, LanguageData, MATCH(LanguageChosen, Language[Language],0), FALSE)","v":"Imports: of which from outside EU"},null,0]
["TOTEXPSB",null,null,"OILSHALE",1,null,null,"Total exports","Oil shale and oil sands","2022M05",{"$f":"VLOOKUP(I946, LanguageData, MATCH(LanguageChosen, Language[Language],0), FALSE)","v":"Oil shale and oil sands"},{"$f":"VLOOKUP(H946, LanguageData, MATCH(LanguageChosen, Language[Language],0), FALSE)","v":"Total exports"},null,0]
["STOCKSTART",null,null,"OILSHALE",1,null,null,"Stocks - beginning of period","Oil shale and oil sands","2022M05",{"$f":"VLOOKUP(I947, LanguageData, MATCH(LanguageChosen, Language[Language],0), FALSE)","v":"Oil shale and oil sands"},{"$f":"VLOOKUP(H947, LanguageData, MATCH(LanguageChosen, Language[Language],0), FALSE)","v":"Stocks - beginning of period"},null,0]
["STOCKEND",null,null,"OILSHALE",1,null,null,"Stocks - end of period","Oil shale and oil sands","2022M05",{"$f":"VLOOKUP(I948, LanguageData, MATCH(LanguageChosen, Language[Language],0), FALSE)","v":"Oil shale and oil sands"},{"$f":"VLOOKUP(H948, LanguageData, MATCH(LanguageChosen, Language[Language],0), FALSE)","v":"Stocks - end of period"},null,0]
["STCHANAT",null,null,"OILSHALE",1,null,null,"Stock changes","Oil shale and oil sands","2022M05",{"$f":"VLOOKUP(I949, LanguageData, MATCH(LanguageChosen, Language[Language],0), FALSE)","v":"Oil shale and oil sands"},{"$f":"VLOOKUP(H949, LanguageData, MATCH(LanguageChosen, Language[Language],0), FALSE)","v":"Stock changes"},null,0]
["INDCONC",null,null,"OILSHALE",1,null,null,"Calculated inland deliveries","Oil shale and oil sands","2022M05",{"$f":"VLOOKUP(I950, LanguageData, MATCH(LanguageChosen, Language[Language],0), FALSE)","v":"Oil shale and oil sands"},{"$f":"VLOOKUP(H950, LanguageData, MATCH(LanguageChosen, Language[Language],0), FALSE)","v":"Calculated inland deliveries"},null,0]
["STATDIFF",null,null,"OILSHALE",1,null,null,"Statistical differences","Oil shale and oil sands","2022M05",{"$f":"VLOOKUP(I951, LanguageData, MATCH(LanguageChosen, Language[Language],0), FALSE)","v":"Oil shale and oil sands"},{"$f":"VLOOKUP(H951, LanguageData, MATCH(LanguageChosen, Language[Language],0), FALSE)","v":"Statistical differences"},null,0]
["INTERNAD",null,null,"OILSHALE",1,null,null,"Internal market deliveries (observed)","Oil shale and oil sands","2022M05",{"$f":"VLOOKUP(I952, LanguageData, MATCH(LanguageChosen, Language[Language],0), FALSE)","v":"Oil shale and oil sands"},{"$f":"VLOOKUP(H952, LanguageData, MATCH(LanguageChosen, Language[Language],0), FALSE)","v":"Internal market deliveries (observed)"},null,0]
["MAINPROD",null,null,"OILSHALE",1,null,null,"Deliveries to main activity producers","Oil shale and oil sands","2022M05",{"$f":"VLOOKUP(I953, LanguageData, MATCH(LanguageChosen, Language[Language],0), FALSE)","v":"Oil shale and oil sands"},{"$f":"VLOOKUP(H953, LanguageData, MATCH(LanguageChosen, Language[Language],0), FALSE)","v":"Deliveries to main activity producers"},null,0]
["ECOKEOVS",null,null,"OILSHALE",1,null,null,"Deliveries to coking plants","Oil shale and oil sands","2022M05",{"$f":"VLOOKUP(I954, LanguageData, MATCH(LanguageChosen, Language[Language],0), FALSE)","v":"Oil shale and oil sands"},{"$f":"VLOOKUP(H954, LanguageData, MATCH(LanguageChosen, Language[Language],0), FALSE)","v":"Deliveries to coking plants"},null,0]
["TOTIND",null,null,"OILSHALE",1,null,null,"Deliveries to total industry","Oil shale and oil sands","2022M05",{"$f":"VLOOKUP(I955, LanguageData, MATCH(LanguageChosen, Language[Language],0), FALSE)","v":"Oil shale and oil sands"},{"$f":"VLOOKUP(H955, LanguageData, MATCH(LanguageChosen, Language[Language],0), FALSE)","v":"Deliveries to total industry"},null,0]
["IRONSTL",null,null,"OILSHALE",1,null,null,"Deliveries to total industry of which to iron and steel industry","Oil shale and oil sands","2022M05",{"$f":"VLOOKUP(I956, LanguageData, MATCH(LanguageChosen, Language[Language],0), FALSE)","v":"Oil shale and oil sands"},{"$f":"VLOOKUP(H956, LanguageData, MATCH(LanguageChosen, Language[Language],0), FALSE)","v":"Deliveries to total industry of which to iron and steel industry"},null,0]
["OTHER",null,null,"OILSHALE",1,null,null,"Other deliveries (services, households, …)","Oil shale and oil sands","2022M05",{"$f":"VLOOKUP(I957, LanguageData, MATCH(LanguageChosen, Language[Language],0), FALSE)","v":"Oil shale and oil sands"},{"$f":"VLOOKUP(H957, LanguageData, MATCH(LanguageChosen, Language[Language],0), FALSE)","v":"Other deliveries (services, households, …)"},null,0]
["INDPROD",null,null,"COKEOVEN",1,null,null,"Production ","Coke oven coke","2022M05",{"$f":"VLOOKUP(I958, LanguageData, MATCH(LanguageChosen, Language[Language],0), FALSE)","v":"Coke oven coke"},{"$f":"VLOOKUP(H958, LanguageData, MATCH(LanguageChosen, Language[Language],0), FALSE)","v":"Production "},null,0]
["OSOURCES",null,null,"COKEOVEN",1,null,null,"Recovered products","Coke oven coke","2022M05",{"$f":"VLOOKUP(I959, LanguageData, MATCH(LanguageChosen, Language[Language],0), FALSE)","v":"Coke oven coke"},{"$f":"VLOOKUP(H959, LanguageData, MATCH(LanguageChosen, Language[Language],0), FALSE)","v":"Recovered products"},null,0]
["TOTIMPSB",null,null,"COKEOVEN",1,null,null,"Total imports","Coke oven coke","2022M05",{"$f":"VLOOKUP(I960, LanguageData, MATCH(LanguageChosen, Language[Language],0), FALSE)","v":"Coke oven coke"},{"$f":"VLOOKUP(H960, LanguageData, MATCH(LanguageChosen, Language[Language],0), FALSE)","v":"Total imports"},null,0]
["TOTIMPSBEU",null,null,"COKEOVEN",1,null,null,"Imports: of which from outside EU","Coke oven coke","2022M05",{"$f":"VLOOKUP(I961, LanguageData, MATCH(LanguageChosen, Language[Language],0), FALSE)","v":"Coke oven coke"},{"$f":"VLOOKUP(H961, LanguageData, MATCH(LanguageChosen, Language[Language],0), FALSE)","v":"Imports: of which from outside EU"},null,0]
["TOTEXPSB",null,null,"COKEOVEN",1,null,null,"Total exports","Coke oven coke","2022M05",{"$f":"VLOOKUP(I962, LanguageData, MATCH(LanguageChosen, Language[Language],0), FALSE)","v":"Coke oven coke"},{"$f":"VLOOKUP(H962, LanguageData, MATCH(LanguageChosen, Language[Language],0), FALSE)","v":"Total exports"},null,0]
["STOCKSTART",null,null,"COKEOVEN",1,null,null,"Stocks - beginning of period","Coke oven coke","2022M05",{"$f":"VLOOKUP(I963, LanguageData, MATCH(LanguageChosen, Language[Language],0), FALSE)","v":"Coke oven coke"},{"$f":"VLOOKUP(H963, LanguageData, MATCH(LanguageChosen, Language[Language],0), FALSE)","v":"Stocks - beginning of period"},null,0]
["STOCKEND",null,null,"COKEOVEN",1,null,null,"Stocks - end of period","Coke oven coke","2022M05",{"$f":"VLOOKUP(I964, LanguageData, MATCH(LanguageChosen, Language[Language],0), FALSE)","v":"Coke oven coke"},{"$f":"VLOOKUP(H964, LanguageData, MATCH(LanguageChosen, Language[Language],0), FALSE)","v":"Stocks - end of period"},null,0]
["STCHANAT",null,null,"COKEOVEN",1,null,null,"Stock changes","Coke oven coke","2022M05",{"$f":"VLOOKUP(I965, LanguageData, MATCH(LanguageChosen, Language[Language],0), FALSE)","v":"Coke oven coke"},{"$f":"VLOOKUP(H965, LanguageData, MATCH(LanguageChosen, Language[Language],0), FALSE)","v":"Stock changes"},null,0]
["INDCONC",null,null,"COKEOVEN",1,null,null,"Calculated inland deliveries","Coke oven coke","2022M05",{"$f":"VLOOKUP(I966, LanguageData, MATCH(LanguageChosen, Language[Language],0), FALSE)","v":"Coke oven coke"},{"$f":"VLOOKUP(H966, LanguageData, MATCH(LanguageChosen, Language[Language],0), FALSE)","v":"Calculated inland deliveries"},null,0]
["STATDIFF",null,null,"COKEOVEN",1,null,null,"Statistical differences","Coke oven coke","2022M05",{"$f":"VLOOKUP(I967, LanguageData, MATCH(LanguageChosen, Language[Language],0), FALSE)","v":"Coke oven coke"},{"$f":"VLOOKUP(H967, LanguageData, MATCH(LanguageChosen, Language[Language],0), FALSE)","v":"Statistical differences"},null,0]
["INTERNAD",null,null,"COKEOVEN",1,null,null,"Internal market deliveries (observed)","Coke oven coke","2022M05",{"$f":"VLOOKUP(I968, LanguageData, MATCH(LanguageChosen, Language[Language],0), FALSE)","v":"Coke oven coke"},{"$f":"VLOOKUP(H968, LanguageData, MATCH(LanguageChosen, Language[Language],0), FALSE)","v":"Internal market deliveries (observed)"},null,0]
["MAINPROD",null,null,"COKEOVEN",1,null,null,"Deliveries to main activity producers","Coke oven coke","2022M05",{"$f":"VLOOKUP(I969, LanguageData, MATCH(LanguageChosen, Language[Language],0), FALSE)","v":"Coke oven coke"},{"$f":"VLOOKUP(H969, LanguageData, MATCH(LanguageChosen, Language[Language],0), FALSE)","v":"Deliveries to main activity producers"},null,0]
["ECOKEOVS",null,null,"COKEOVEN",1,null,null,"Deliveries to coking plants","Coke oven coke","2022M05",{"$f":"VLOOKUP(I970, LanguageData, MATCH(LanguageChosen, Language[Language],0), FALSE)","v":"Coke oven coke"},{"$f":"VLOOKUP(H970, LanguageData, MATCH(LanguageChosen, Language[Language],0), FALSE)","v":"Deliveries to coking plants"},null,0]
["TOTIND",null,null,"COKEOVEN",1,null,null,"Deliveries to total industry","Coke oven coke","2022M05",{"$f":"VLOOKUP(I971, LanguageData, MATCH(LanguageChosen, Language[Language],0), FALSE)","v":"Coke oven coke"},{"$f":"VLOOKUP(H971, LanguageData, MATCH(LanguageChosen, Language[Language],0), FALSE)","v":"Deliveries to total industry"},null,0]
["IRONSTL",null,null,"COKEOVEN",1,null,null,"Deliveries to total industry of which to iron and steel industry","Coke oven coke","2022M05",{"$f":"VLOOKUP(I972, LanguageData, MATCH(LanguageChosen, Language[Language],0), FALSE)","v":"Coke oven coke"},{"$f":"VLOOKUP(H972, LanguageData, MATCH(LanguageChosen, Language[Language],0), FALSE)","v":"Deliveries to total industry of which to iron and steel industry"},null,0]
["OTHER",null,null,"COKEOVEN",1,null,null,"Other deliveries (services, households, …)","Coke oven coke","2022M05",{"$f":"VLOOKUP(I973, LanguageData, MATCH(LanguageChosen, Language[Language],0), FALSE)","v":"Coke oven coke"},{"$f":"VLOOKUP(H973, LanguageData, MATCH(LanguageChosen, Language[Language],0), FALSE)","v":"Other deliveries (services, households, …)"},null,0]
[]
[]
[null,"Sum of Value","Column Labels"]
[null,null,"Brown coal","Coke oven coke","Hard coal"]
[null,"Row Labels","Calculated inland deliveries","Calculated inland deliveries","Calculated inland deliveries"]
[null,"2022M06"]
[null,"2022M07"]
[null,"2022M08"]
[null,"2022M09"]
[null,"2022M10"]
[null,"2022M11"]
[null,"2022M12"]
[null,"2023M01"]
[null,"2023M02"]
[null,"2023M03"]
[null,"2023M04"]
[null,"2023M05"]
[]
[]
[]
[]
[]
[]
[]
[]
[]
[]
[]
[]
[]
[]
[]
[]
[]
[]
[]
[]
[]
[]
[]
[]
[]
[]
[]
[]
[]
[]
[]
[]
[]
[]
[]
[]
[]
[]
[]
[]
[]
[]
[]
[]
[]
[]
[]
[]
[]
[]
[]
[]
[]
[]
[]
[]
[]
[]
[]
[]
[]
[]
[]
[]
[]
[]
[]
[]
[]
[]
[]
[]
[]
[]
[]
[]
[]
[]
[]
[]
[]
[]
[]
[]
[]
[]
[]
[]
[]
[]
[]
[]
[]
[]
[null,"Sum of Value","Column Labels"]
[null,null,"Hard coal"]
[null,"Row Labels","Calculated inland deliveries","Internal market deliveries (observed)"]
[null,"2022M06"]
[null,"2022M07"]
[null,"2022M08"]
[null,"2022M09"]
[null,"2022M10"]
[null,"2022M11"]
[null,"2022M12"]
[null,"2023M01"]
[null,"2023M02"]
[null,"2023M03"]
[null,"2023M04"]
[null,"2023M05"]

{"sheet":"CheckReport","index":29,"n_rows":1,"n_cols":14,"rows_kept":1,"cut":false,"hidden":true,"merged":[]}
["COUNTRY","QUEST","DATATYPE","PRODUCT","ITEM1","ITEM2","TIME","VALIDATION","VALUE","EXPECTED","RULE","CELL","TABLE","ERRORTYPE"]

{"sheet":"Param_Sheets","index":30,"n_rows":35,"n_cols":14,"rows_kept":35,"cut":false,"hidden":true,"merged":[]}
["Name","Template_Sheet","Version","Datatype","Product","Item1","Item2","Time","Protect",null,null,null,"Refresh Formula","Name"]
["Table1","Template_Table1",null,"FLOW","Template","Template",null,{"$f":"PeriodSelected","v":"2023M06"},1,null,null,null,null,"Table1"]
["TSHardCoal_2018","Template_TS1",2018,"FLOW","HARDCOAL","Template",null,"Template",1]
["TSHardCoal_2019","Template_TS1",2019,"FLOW","HARDCOAL","Template",null,"Template",1]
["TSHardCoal_2020","Template_TS1",2020,"FLOW","HARDCOAL","Template",null,"Template",1]
["TSHardCoal_2021","Template_TS1",2021,"FLOW","HARDCOAL","Template",null,"Template",1]
["TSHardCoal_2022","Template_TS1",2022,"FLOW","HARDCOAL","Template",null,"Template",1]
["TSHardCoal_2023","Template_TS1",2023,"FLOW","HARDCOAL","Template",null,"Template",1]
["TSBrown_2018","Template_TS1",2018,"FLOW","BROWN","Template",null,"Template",1]
["TSBrown_2019","Template_TS1",2019,"FLOW","BROWN","Template",null,"Template",1]
["TSBrown_2020","Template_TS1",2020,"FLOW","BROWN","Template",null,"Template",1]
["TSBrown_2021","Template_TS1",2021,"FLOW","BROWN","Template",null,"Template",1]
["TSBrown_2022","Template_TS1",2022,"FLOW","BROWN","Template",null,"Template",1]
["TSBrown_2023","Template_TS1",2023,"FLOW","BROWN","Template",null,"Template",1]
["TSPeat_2018","Template_TS1",2018,"FLOW","PEAT","Template",null,"Template",1]
["TSPeat_2019","Template_TS1",2019,"FLOW","PEAT","Template",null,"Template",1]
["TSPeat_2020","Template_TS1",2020,"FLOW","PEAT","Template",null,"Template",1]
["TSPeat_2021","Template_TS1",2021,"FLOW","PEAT","Template",null,"Template",1]
["TSPeat_2022","Template_TS1",2022,"FLOW","PEAT","Template",null,"Template",1]
["TSPeat_2023","Template_TS1",2023,"FLOW","PEAT","Template",null,"Template",1]
["TSOilShale_2018","Template_TS1",2018,"FLOW","OILSHALE","Template",null,"Template",1]
["TSOilShale_2019","Template_TS1",2019,"FLOW","OILSHALE","Template",null,"Template",1]
["TSOilShale_2020","Template_TS1",2020,"FLOW","OILSHALE","Template",null,"Template",1]
["TSOilShale_2021","Template_TS1",2021,"FLOW","OILSHALE","Template",null,"Template",1]
["TSOilShale_2022","Template_TS1",2022,"FLOW","OILSHALE","Template",null,"Template",1]
["TSOilShale_2023","Template_TS1",2023,"FLOW","OILSHALE","Template",null,"Template",1]
["TSCokeoven_2018","Template_TS1",2018,"FLOW","COKEOVEN","Template",null,"Template",1]
["TSCokeoven_2019","Template_TS1",2019,"FLOW","COKEOVEN","Template",null,"Template",1]
["TSCokeoven_2020","Template_TS1",2020,"FLOW","COKEOVEN","Template",null,"Template",1]
["TSCokeoven_2021","Template_TS1",2021,"FLOW","COKEOVEN","Template",null,"Template",1]
["TSCokeoven_2022","Template_TS1",2022,"FLOW","COKEOVEN","Template",null,"Template",1]
["TSCokeoven_2023","Template_TS1",2023,"FLOW","COKEOVEN","Template",null,"Template",1]
["Graphs","Template_Graphs",{"$f":"Menu!G26","v":"2023M06"},"FLOW","Template","Template",null,"Template",3]
["REMARKS","TemplateRemarks",null,"REMARKS",null,"Template",null,{"$f":"Menu!C13","v":"2023M06"},2]
["REMARKSTS","TemplateRemarksTS",{"$f":"LEFT(Param_Questionnaire!$B$10,4)","v":"2023"},"REMARKS",null,"Template",null,"Template",2]

{"sheet":"Param_Sheets_Templates","index":31,"n_rows":6,"n_cols":6,"rows_kept":6,"cut":false,"hidden":true,"merged":[]}
["Name","Template_Table1","Template_TS1","Template_Graphs","TemplateRemarks","TemplateRemarksTS"]
["Format","OneYear","TimeSeries","TimeSeries","OneYear","TimeSeries"]
["VersionRow",null,5,1,null,4]
["VersionCol",null,2,2,null,2]
["HideCol","A:H","A:H","A:N","A:C","A:C"]
["HideRow","3:10","2:8","4:11","4:7","4:5"]

{"sheet":"Param_Tables","index":32,"n_rows":35,"n_cols":9,"rows_kept":35,"cut":false,"hidden":true,"merged":[]}
["Name","SheetName","Template","Version","Datatype","Product","Item1","Item2","Time"]
["Table1","Table1","Template_Table1",null,"FLOW","Template","Template",null,{"$f":"PeriodSelected","v":"2023M06"}]
["TSHardCoal_2018","TSHardCoal_2018","Template_TS1",2018,"FLOW","HARDCOAL","Template",null,"Template"]
["TSHardCoal_2019","TSHardCoal_2019","Template_TS1",2019,"FLOW","HARDCOAL","Template",null,"Template"]
["TSHardCoal_2020","TSHardCoal_2020","Template_TS1",2020,"FLOW","HARDCOAL","Template",null,"Template"]
["TSHardCoal_2021","TSHardCoal_2021","Template_TS1",2021,"FLOW","HARDCOAL","Template",null,"Template"]
["TSHardCoal_2022","TSHardCoal_2022","Template_TS1",2022,"FLOW","HARDCOAL","Template",null,"Template"]
["TSHardCoal_2023","TSHardCoal_2023","Template_TS1",2023,"FLOW","HARDCOAL","Template",null,"Template"]
["TSBrown_2018","TSBrown_2018","Template_TS1",2018,"FLOW","BROWN","Template",null,"Template"]
["TSBrown_2019","TSBrown_2019","Template_TS1",2019,"FLOW","BROWN","Template",null,"Template"]
["TSBrown_2020","TSBrown_2020","Template_TS1",2020,"FLOW","BROWN","Template",null,"Template"]
["TSBrown_2021","TSBrown_2021","Template_TS1",2021,"FLOW","BROWN","Template",null,"Template"]
["TSBrown_2022","TSBrown_2022","Template_TS1",2022,"FLOW","BROWN","Template",null,"Template"]
["TSBrown_2023","TSBrown_2023","Template_TS1",2023,"FLOW","BROWN","Template",null,"Template"]
["TSPeat_2018","TSPeat_2018","Template_TS1",2018,"FLOW","PEAT","Template",null,"Template"]
["TSPeat_2019","TSPeat_2019","Template_TS1",2019,"FLOW","PEAT","Template",null,"Template"]
["TSPeat_2020","TSPeat_2020","Template_TS1",2020,"FLOW","PEAT","Template",null,"Template"]
["TSPeat_2021","TSPeat_2021","Template_TS1",2021,"FLOW","PEAT","Template",null,"Template"]
["TSPeat_2022","TSPeat_2022","Template_TS1",2022,"FLOW","PEAT","Template",null,"Template"]
["TSPeat_2023","TSPeat_2023","Template_TS1",2023,"FLOW","PEAT","Template",null,"Template"]
["TSOilShale_2018","TSOilShale_2018","Template_TS1",2018,"FLOW","OILSHALE","Template",null,"Template"]
["TSOilShale_2019","TSOilShale_2019","Template_TS1",2019,"FLOW","OILSHALE","Template",null,"Template"]
["TSOilShale_2020","TSOilShale_2020","Template_TS1",2020,"FLOW","OILSHALE","Template",null,"Template"]
["TSOilShale_2021","TSOilShale_2021","Template_TS1",2021,"FLOW","OILSHALE","Template",null,"Template"]
["TSOilShale_2022","TSOilShale_2022","Template_TS1",2022,"FLOW","OILSHALE","Template",null,"Template"]
["TSOilShale_2023","TSOilShale_2023","Template_TS1",2023,"FLOW","OILSHALE","Template",null,"Template"]
["TSCokeoven_2018","TSCokeoven_2018","Template_TS1",2018,"FLOW","COKEOVEN","Template",null,"Template"]
["TSCokeoven_2019","TSCokeoven_2019","Template_TS1",2019,"FLOW","COKEOVEN","Template",null,"Template"]
["TSCokeoven_2020","TSCokeoven_2020","Template_TS1",2020,"FLOW","COKEOVEN","Template",null,"Template"]
["TSCokeoven_2021","TSCokeoven_2021","Template_TS1",2021,"FLOW","COKEOVEN","Template",null,"Template"]
["TSCokeoven_2022","TSCokeoven_2022","Template_TS1",2022,"FLOW","COKEOVEN","Template",null,"Template"]
["TSCokeoven_2023","TSCokeoven_2023","Template_TS1",2023,"FLOW","COKEOVEN","Template",null,"Template"]
["Graphs","Graphs","Template_Graphs",{"$f":"Menu!G26","v":"2023M06"},"FLOW","Template","Template",null,"Template"]
["REMARKS","REMARKS","TemplateRemarks",null,"REMARKS",null,"Template",null,{"$f":"Menu!C13","v":"2023M06"}]
["REMARKSTS","REMARKSTS","TemplateRemarksTS",{"$f":"LEFT(Param_Questionnaire!$B$10,4)","v":"2023"},"REMARKS",null,"Template",null,"Template"]

{"sheet":"Param_Tables_Templates","index":33,"n_rows":45,"n_cols":6,"rows_kept":45,"cut":false,"hidden":true,"merged":[]}
["Name","Template_Table1","Template_TS1","TemplateRemarks","Template_Graphs","TemplateRemarksTS"]
["SheetName","Template_Table1","Template_TS1","TemplateRemarks","Template_Graphs","TemplateRemarksTS"]
["Format","OneYear","TimeSeries","OneYear","OneYear","TimeSeries"]
["VersionRow",null,5,null,1,4]
["VersionCol",null,2,null,2,2]
["FirstRow",13,13,8,14,8]
["FirstCol",10,10,5,13,5]
["LastRow",28,28,35,973,35]
["LastCol",14,21,5,13,16]
["DataTypeRow",2,2,2,2,2]
["DataTypeCol",2,2,2,2,2]
["ProductRow",3,3,3,0,3]
["ProductCol",0,2,2,4,2]
["Item1Row",0,0,0,0,0]
["Item1Col",1,1,1,1,1]
["Item2Row",3,4,5,3,5]
["Item2Col",2,2,2,2,2]
["TimeRow",1,3,4,0,6]
["TimeCol",2,0,2,10,0]
["FormulaRow",4,4,null,5]
["FormulaCol",2,2,null,2]
["CheckCol1",3,3,null,3]
["CheckCol2"]
["CheckCol3"]
["CheckRow",5,5,null,6]
["LabelCheckCol1",4,4]
["LabelCheckCol2"]
["LabelCheckCol3"]
["LabelCheckRow",null,6]
["LockedRow",null,7,null,7]
["LockedCol",5,5,null,5]
["EmptyRow",7,8,null,8]
["EmptyCol",6,6,null,6]
["VoluntaryRow",8,9,null,9]
["VoluntaryCol",7,7,null,7]
["LabelRow",10,11,7,13,6]
["LabelCol",9,9,4,10,4]
["HideCol",null,null,"A:C",null,"A:C"]
["HideRow",null,null,"4:7","5000:10000","4:5"]
["TableSourceCol"]
["TableSourceRow"]
["NbDecimalRow"]
["NbDecimalCol"]
["TypeRow",null,null,5,null,5]
["TypeCol"]