{"text_format":"1","workbook":"xlsx","n_sheets":34,"sheets":["Historical_ISO","Historical_ISO_Period","Historical_SDMX","Historical_SDMX_Period","Historical","Input_ISO","Input_ISO_Period","Input_SDMX","Input_SDMX_Period","Entries","Output_ISO_csv","Output_SDMX_csv","Output_SDMX_long_complete","Mapping_Products_Flows","Parameters","Parameter_mapping","Mapping_countries","Logs","Param_Menu","Param_Questionnaire","Param_Multilanguage","Menu","Instructions","TemplateTable1","TemplateRemarks","Template_TS","TemplateCalorific_values","TemplateRemarksTS","CheckReport","TemplateGraph","Param_Sheets","Param_Sheets_Templates","Param_Tables","Param_Tables_Templates"],"not_rendered":{"charts":1,"images":0,"macros":1,"external_links":0,"defined_names":58,"comments":0,"pivot_tables":1},"unopened":[],"bounds":{"document_bytes":16777216,"sheet_cells":100000,"rows_first":2000,"rows_last":500,"rows_between":2000,"halvings":0,"cell_chars":16384,"cell_head_chars":4096},"cells_cut":0,"cells_raw":0,"read":"whole","date_system":"1900"}

{"sheet":"Historical_ISO","index":0,"n_rows":1,"n_cols":11,"rows_kept":1,"cut":false,"hidden":true,"merged":[]}
["COUNTRY","QUEST","PRODUCT","DATATYPE","ITEM1","ITEM2","TIME","VALUE","OBSERVATION","CONFIDENTIALITY","Record"]

{"sheet":"Historical_ISO_Period","index":1,"n_rows":1,"n_cols":1,"rows_kept":1,"cut":false,"hidden":true,"merged":[]}
["TIME"]

{"sheet":"Historical_SDMX","index":2,"n_rows":1,"n_cols":11,"rows_kept":1,"cut":false,"hidden":true,"merged":[]}
["REF_AREA","DATAFLOW","PRODUCT","DATATYPE","ITEM1","ITEM2","TIME","VALUE","OBSERVATION","CONFIDENTIALITY","Record"]

{"sheet":"Historical_SDMX_Period","index":3,"n_rows":1,"n_cols":1,"rows_kept":1,"cut":false,"hidden":true,"merged":[]}
["TIME"]

{"sheet":"Historical","index":4,"n_rows":1,"n_cols":11,"rows_kept":1,"cut":false,"hidden":true,"merged":[]}
["COUNTRY","QUEST","PRODUCT","DATATYPE","ITEM1","ITEM2","TIME","VALUE","OBSERVATION","CONFIDENTIALITY","KEYREC"]

{"sheet":"Input_ISO","index":5,"n_rows":1,"n_cols":11,"rows_kept":1,"cut":false,"hidden":true,"merged":[]}
["COUNTRY","QUEST","PRODUCT","DATATYPE","ITEM1","ITEM2","TIME","VALUE","OBSERVATION","CONFIDENTIALITY","Record"]

{"sheet":"Input_ISO_Period","index":6,"n_rows":1,"n_cols":1,"rows_kept":1,"cut":false,"hidden":true,"merged":[]}
["TIME"]

{"sheet":"Input_SDMX","index":7,"n_rows":1,"n_cols":11,"rows_kept":1,"cut":false,"hidden":true,"merged":[]}
["REF_AREA","DATAFLOW","PRODUCT","DATATYPE","ITEM1","ITEM2","TIME","VALUE","OBSERVATION","CONFIDENTIALITY","Record"]

{"sheet":"Input_SDMX_Period","index":8,"n_rows":1,"n_cols":1,"rows_kept":1,"cut":false,"hidden":true,"merged":[]}
["TIME"]

{"sheet":"Entries","index":9,"n_rows":1,"n_cols":11,"rows_kept":1,"cut":false,"hidden":true,"merged":[]}
["COUNTRY","QUEST","PRODUCT","DATATYPE","ITEM1","ITEM2","TIME","VALUE","OBSERVATION","CONFIDENTIALITY","KEYREC"]

{"sheet":"Output_ISO_csv","index":10,"n_rows":1,"n_cols":1,"rows_kept":1,"cut":false,"hidden":true,"merged":[]}
["Output"]

{"sheet":"Output_SDMX_csv","index":11,"n_rows":1,"n_cols":1,"rows_kept":1,"cut":false,"hidden":true,"merged":[]}
["Output"]

{"sheet":"Output_SDMX_long_complete","index":12,"n_rows":1,"n_cols":22,"rows_kept":1,"cut":false,"hidden":true,"merged":[]}
["DATAFLOW","QUEST_SOURCE","REF_AREA","FREQ","ENERGY_PRODUCT","MAIN_FLOW","FLOW_BREAKDOWN","PLANT_TECH","PLANT_TYPE","STOCKS","INFRASTRUCTURE_IND","VIS_A_VIS_AREA","MEASURE_VALUE_TYPE","FACILITY_ID","TIME_PERIOD","OBS_VALUE","UNIT_MEASURE","OBS_STATUS","CONF_STATUS","COMMENT_OBS","FACILITY_TYPE","FACILITY_NAME"]

{"sheet":"Mapping_Products_Flows","index":13,"n_rows":1813,"n_cols":16,"rows_kept":1813,"cut":false,"hidden":true,"merged":[]}
["DATATYPE","PRODUCT","ITEM1","ITEM2","ENERGY_PRODUCT","MAIN_FLOW","FLOW_BREAKDOWN","PLANT_TECH","PLANT_TYPE","STOCKS","INFRASTRUCTURE_IND","VIS_A_VIS_AREA","MEASURE_VALUE_TYPE","FACILITY_ID","UNIT_MEASURE","ISO_EXCLUSION"]
["FINCONS","COAL","C33","KT","SFFPO","ENERGUSE","C33","_Z","_Z","_Z","_Z","_Z","WEIGHT","_Z","KT","y"]
["FINCONS","COAL","E","KT","SFFPO","ENERGUSE","E","_Z","_Z","_Z","_Z","_Z","WEIGHT","_Z","KT","y"]
["FINCONS","COAL","E36","KT","SFFPO","ENERGUSE","E36","_Z","_Z","_Z","_Z","_Z","WEIGHT","_Z","KT","y"]
["FINCONS","COAL","E37-E39","KT","SFFPO","ENERGUSE","E37-E39","_Z","_Z","_Z","_Z","_Z","WEIGHT","_Z","KT","y"]
["FINCONS","COAL","E37","KT","SFFPO","ENERGUSE","E37","_Z","_Z","_Z","_Z","_Z","WEIGHT","_Z","KT","y"]
["FINCONS","COAL","E38","KT","SFFPO","ENERGUSE","E38","_Z","_Z","_Z","_Z","_Z","WEIGHT","_Z","KT","y"]
["FINCONS","COAL","E39","KT","SFFPO","ENERGUSE","E39","_Z","_Z","_Z","_Z","_Z","WEIGHT","_Z","KT","y"]
["FINCONS","COAL","G","KT","SFFPO","ENERGUSE","G","_Z","_Z","_Z","_Z","_Z","WEIGHT","_Z","KT","y"]
["FINCONS","COAL","G_HEAT","KT","SFFPO","FC_OTH_CP_E_HEAT","G","_Z","_Z","_Z","_Z","_Z","WEIGHT","_Z","KT","y"]
["FINCONS","COAL","G_S_HEAT","KT","SFFPO","FC_OTH_CP_E_SH","G","_Z","_Z","_Z","_Z","_Z","WEIGHT","_Z","KT","y"]
["FINCONS","COAL","G_W_HEAT","KT","SFFPO","FC_OTH_CP_E_WH","G","_Z","_Z","_Z","_Z","_Z","WEIGHT","_Z","KT","y"]
["FINCONS","COAL","G_COOL","KT","SFFPO","FC_OTH_CP_E_CL","G","_Z","_Z","_Z","_Z","_Z","WEIGHT","_Z","KT","y"]
["FINCONS","COAL","G_S_COOL","KT","SFFPO","FC_OTH_CP_E_SC","G","_Z","_Z","_Z","_Z","_Z","WEIGHT","_Z","KT","y"]
["FINCONS","COAL","G_P_COOL","KT","SFFPO","FC_OTH_CP_E_PC","G","_Z","_Z","_Z","_Z","_Z","WEIGHT","_Z","KT","y"]
["FINCONS","COAL","G_LIGHT","KT","SFFPO","FC_OTH_CP_E_LOUT","G","_Z","_Z","_Z","_Z","_Z","WEIGHT","_Z","KT","y"]
["FINCONS","COAL","G_IN_LIGHT","KT","SFFPO","FC_OTH_CP_E_LINDRE","G","_Z","_Z","_Z","_Z","_Z","WEIGHT","_Z","KT","y"]
["FINCONS","COAL","G_OTH_BUILD","KT","SFFPO","FC_OTH_CP_E_OE_BLD","G","_Z","_Z","_Z","_Z","_Z","WEIGHT","_Z","KT","y"]
["FINCONS","COAL","G_OTH_NBUILD","KT","SFFPO","FC_OTH_CP_E_OE_NBLD","G","_Z","_Z","_Z","_Z","_Z","WEIGHT","_Z","KT","y"]
["FINCONS","COAL","G45","KT","SFFPO","ENERGUSE","G45","_Z","_Z","_Z","_Z","_Z","WEIGHT","_Z","KT","y"]
["FINCONS","COAL","G46","KT","SFFPO","ENERGUSE","G46","_Z","_Z","_Z","_Z","_Z","WEIGHT","_Z","KT","y"]
["FINCONS","COAL","G47","KT","SFFPO","ENERGUSE","G47","_Z","_Z","_Z","_Z","_Z","WEIGHT","_Z","KT","y"]
["FINCONS","COAL","G471","KT","SFFPO","ENERGUSE","G471","_Z","_Z","_Z","_Z","_Z","WEIGHT","_Z","KT","y"]
["FINCONS","COAL","G47_X_G471","KT","SFFPO","ENERGUSE","G47_X_G471","_Z","_Z","_Z","_Z","_Z","WEIGHT","_Z","KT","y"]
["FINCONS","COAL","H52","KT","SFFPO","ENERGUSE","H52","_Z","_Z","_Z","_Z","_Z","WEIGHT","_Z","KT","y"]
["FINCONS","COAL","H52_STL","KT","SFFPO","ENERGUSE","H52_STL","_Z","_Z","_Z","_Z","_Z","WEIGHT","_Z","KT","y"]
["FINCONS","COAL","H53","KT","SFFPO","ENERGUSE","H53","_Z","_Z","_Z","_Z","_Z","WEIGHT","_Z","KT","y"]
["FINCONS","COAL","I","KT","SFFPO","ENERGUSE","I","_Z","_Z","_Z","_Z","_Z","WEIGHT","_Z","KT","y"]
["FINCONS","COAL","I55","KT","SFFPO","ENERGUSE","I55","_Z","_Z","_Z","_Z","_Z","WEIGHT","_Z","KT","y"]
["FINCONS","COAL","I55_HEAT","KT","SFFPO","FC_OTH_CP_E_HEAT","I55","_Z","_Z","_Z","_Z","_Z","WEIGHT","_Z","KT","y"]
["FINCONS","COAL","I55_S_HEAT","KT","SFFPO","FC_OTH_CP_E_SH","I55","_Z","_Z","_Z","_Z","_Z","WEIGHT","_Z","KT","y"]
["FINCONS","COAL","I55_W_HEAT","KT","SFFPO","FC_OTH_CP_E_WH","I55","_Z","_Z","_Z","_Z","_Z","WEIGHT","_Z","KT","y"]
["FINCONS","COAL","I55_COOL","KT","SFFPO","FC_OTH_CP_E_CL","I55","_Z","_Z","_Z","_Z","_Z","WEIGHT","_Z","KT","y"]
["FINCONS","COAL","I55_S_COOL","KT","SFFPO","FC_OTH_CP_E_SC","I55","_Z","_Z","_Z","_Z","_Z","WEIGHT","_Z","KT","y"]
["FINCONS","COAL","I55_P_COOL","KT","SFFPO","FC_OTH_CP_E_PC","I55","_Z","_Z","_Z","_Z","_Z","WEIGHT","_Z","KT","y"]
["FINCONS","COAL","I55_LIGHT","KT","SFFPO","FC_OTH_CP_E_LOUT","I55","_Z","_Z","_Z","_Z","_Z","WEIGHT","_Z","KT","y"]
["FINCONS","COAL","I55_IN_LIGHT","KT","SFFPO","FC_OTH_CP_E_LINDRE","I55","_Z","_Z","_Z","_Z","_Z","WEIGHT","_Z","KT","y"]
["FINCONS","COAL","I55_OTH_BUILD","KT","SFFPO","FC_OTH_CP_E_OE_BLD","I55","_Z","_Z","_Z","_Z","_Z","WEIGHT","_Z","KT","y"]
["FINCONS","COAL","I55_OTH_NBUILD","KT","SFFPO","FC_OTH_CP_E_OE_NBLD","I55","_Z","_Z","_Z","_Z","_Z","WEIGHT","_Z","KT","y"]
["FINCONS","COAL","I551","KT","SFFPO","ENERGUSE","I551","_Z","_Z","_Z","_Z","_Z","WEIGHT","_Z","KT","y"]
["FINCONS","COAL","I552","KT","SFFPO","ENERGUSE","I552","_Z","_Z","_Z","_Z","_Z","WEIGHT","_Z","KT","y"]
["FINCONS","COAL","I553","KT","SFFPO","ENERGUSE","I553","_Z","_Z","_Z","_Z","_Z","WEIGHT","_Z","KT","y"]
["FINCONS","COAL","I559","KT","SFFPO","ENERGUSE","I559","_Z","_Z","_Z","_Z","_Z","WEIGHT","_Z","KT","y"]
["FINCONS","COAL","I56","KT","SFFPO","ENERGUSE","I56","_Z","_Z","_Z","_Z","_Z","WEIGHT","_Z","KT","y"]
["FINCONS","COAL","I56_HEAT","KT","SFFPO","FC_OTH_CP_E_HEAT","I56","_Z","_Z","_Z","_Z","_Z","WEIGHT","_Z","KT","y"]
["FINCONS","COAL","I56_S_HEAT","KT","SFFPO","FC_OTH_CP_E_SH","I56","_Z","_Z","_Z","_Z","_Z","WEIGHT","_Z","KT","y"]
["FINCONS","COAL","I56_W_HEAT","KT","SFFPO","FC_OTH_CP_E_WH","I56","_Z","_Z","_Z","_Z","_Z","WEIGHT","_Z","KT","y"]
["FINCONS","COAL","I56_COOL","KT","SFFPO","FC_OTH_CP_E_CL","I56","_Z","_Z","_Z","_Z","_Z","WEIGHT","_Z","KT","y"]
["FINCONS","COAL","I56_S_COOL","KT","SFFPO","FC_OTH_CP_E_SC","I56","_Z","_Z","_Z","_Z","_Z","WEIGHT","_Z","KT","y"]
["FINCONS","COAL","I56_P_COOL","KT","SFFPO","FC_OTH_CP_E_PC","I56","_Z","_Z","_Z","_Z","_Z","WEIGHT","_Z","KT","y"]
["FINCONS","COAL","I56_LIGHT","KT","SFFPO","FC_OTH_CP_E_LOUT","I56","_Z","_Z","_Z","_Z","_Z","WEIGHT","_Z","KT","y"]
["FINCONS","COAL","I56_IN_LIGHT","KT","SFFPO","FC_OTH_CP_E_LINDRE","I56","_Z","_Z","_Z","_Z","_Z","WEIGHT","_Z","KT","y"]
["FINCONS","COAL","I56_OTH_BUILD","KT","SFFPO","FC_OTH_CP_E_OE_BLD","I56","_Z","_Z","_Z","_Z","_Z","WEIGHT","_Z","KT","y"]
["FINCONS","COAL","I56_OTH_NBUILD","KT","SFFPO","FC_OTH_CP_E_OE_NBLD","I56","_Z","_Z","_Z","_Z","_Z","WEIGHT","_Z","KT","y"]
["FINCONS","COAL","I561","KT","SFFPO","ENERGUSE","I561","_Z","_Z","_Z","_Z","_Z","WEIGHT","_Z","KT","y"]
["FINCONS","COAL","I562","KT","SFFPO","ENERGUSE","I562","_Z","_Z","_Z","_Z","_Z","WEIGHT","_Z","KT","y"]
["FINCONS","COAL","I563","KT","SFFPO","ENERGUSE","I563","_Z","_Z","_Z","_Z","_Z","WEIGHT","_Z","KT","y"]
["FINCONS","COAL","J","KT","SFFPO","ENERGUSE","J","_Z","_Z","_Z","_Z","_Z","WEIGHT","_Z","KT","y"]
["FINCONS","COAL","J58","KT","SFFPO","ENERGUSE","J58","_Z","_Z","_Z","_Z","_Z","WEIGHT","_Z","KT","y"]
["FINCONS","COAL","J59_J60","KT","SFFPO","ENERGUSE","J59_J60","_Z","_Z","_Z","_Z","_Z","WEIGHT","_Z","KT","y"]
["FINCONS","COAL","J61","KT","SFFPO","ENERGUSE","J61","_Z","_Z","_Z","_Z","_Z","WEIGHT","_Z","KT","y"]
["FINCONS","COAL","J62_J63","KT","SFFPO","ENERGUSE","J62_J63","_Z","_Z","_Z","_Z","_Z","WEIGHT","_Z","KT","y"]
["FINCONS","COAL","J62","KT","SFFPO","ENERGUSE","J62","_Z","_Z","_Z","_Z","_Z","WEIGHT","_Z","KT","y"]
["FINCONS","COAL","J63","KT","SFFPO","ENERGUSE","J63","_Z","_Z","_Z","_Z","_Z","WEIGHT","_Z","KT","y"]
["FINCONS","COAL","K_L","KT","SFFPO","ENERGUSE","K_L","_Z","_Z","_Z","_Z","_Z","WEIGHT","_Z","KT","y"]
["FINCONS","COAL","K","KT","SFFPO","ENERGUSE","K","_Z","_Z","_Z","_Z","_Z","WEIGHT","_Z","KT","y"]
["FINCONS","COAL","L","KT","SFFPO","ENERGUSE","L","_Z","_Z","_Z","_Z","_Z","WEIGHT","_Z","KT","y"]
["FINCONS","COAL","M_S","KT","SFFPO","ENERGUSE","M_S","_Z","_Z","_Z","_Z","_Z","WEIGHT","_Z","KT","y"]
["FINCONS","COAL","M","KT","SFFPO","ENERGUSE","M","_Z","_Z","_Z","_Z","_Z","WEIGHT","_Z","KT","y"]
["FINCONS","COAL","M69_M70","KT","SFFPO","ENERGUSE","M69_M70","_Z","_Z","_Z","_Z","_Z","WEIGHT","_Z","KT","y"]
["FINCONS","COAL","M71","KT","SFFPO","ENERGUSE","M71","_Z","_Z","_Z","_Z","_Z","WEIGHT","_Z","KT","y"]
["FINCONS","COAL","M72","KT","SFFPO","ENERGUSE","M72","_Z","_Z","_Z","_Z","_Z","WEIGHT","_Z","KT","y"]
["FINCONS","COAL","M73","KT","SFFPO","ENERGUSE","M73","_Z","_Z","_Z","_Z","_Z","WEIGHT","_Z","KT","y"]
["FINCONS","COAL","M74_M75","KT","SFFPO","ENERGUSE","M74_M75","_Z","_Z","_Z","_Z","_Z","WEIGHT","_Z","KT","y"]
["FINCONS","COAL","N","KT","SFFPO","ENERGUSE","N","_Z","_Z","_Z","_Z","_Z","WEIGHT","_Z","KT","y"]
["FINCONS","COAL","N77","KT","SFFPO","ENERGUSE","N77","_Z","_Z","_Z","_Z","_Z","WEIGHT","_Z","KT","y"]
["FINCONS","COAL","N78","KT","SFFPO","ENERGUSE","N78","_Z","_Z","_Z","_Z","_Z","WEIGHT","_Z","KT","y"]
["FINCONS","COAL","N79","KT","SFFPO","ENERGUSE","N79","_Z","_Z","_Z","_Z","_Z","WEIGHT","_Z","KT","y"]
["FINCONS","COAL","N80-N82","KT","SFFPO","ENERGUSE","N80-N82","_Z","_Z","_Z","_Z","_Z","WEIGHT","_Z","KT","y"]
["FINCONS","COAL","O","KT","SFFPO","ENERGUSE","O","_Z","_Z","_Z","_Z","_Z","WEIGHT","_Z","KT","y"]
["FINCONS","COAL","O_HEAT","KT","SFFPO","FC_OTH_CP_E_HEAT","O","_Z","_Z","_Z","_Z","_Z","WEIGHT","_Z","KT","y"]
["FINCONS","COAL","O_S_HEAT","KT","SFFPO","FC_OTH_CP_E_SH","O","_Z","_Z","_Z","_Z","_Z","WEIGHT","_Z","KT","y"]
["FINCONS","COAL","O_W_HEAT","KT","SFFPO","FC_OTH_CP_E_WH","O","_Z","_Z","_Z","_Z","_Z","WEIGHT","_Z","KT","y"]
["FINCONS","COAL","O_COOL","KT","SFFPO","FC_OTH_CP_E_CL","O","_Z","_Z","_Z","_Z","_Z","WEIGHT","_Z","KT","y"]
["FINCONS","COAL","O_S_COOL","KT","SFFPO","FC_OTH_CP_E_SC","O","_Z","_Z","_Z","_Z","_Z","WEIGHT","_Z","KT","y"]
["FINCONS","COAL","O_P_COOL","KT","SFFPO","FC_OTH_CP_E_PC","O","_Z","_Z","_Z","_Z","_Z","WEIGHT","_Z","KT","y"]
["FINCONS","COAL","O_LIGHT","KT","SFFPO","FC_OTH_CP_E_LOUT","O","_Z","_Z","_Z","_Z","_Z","WEIGHT","_Z","KT","y"]
["FINCONS","COAL","O_IN_LIGHT","KT","SFFPO","FC_OTH_CP_E_LINDRE","O","_Z","_Z","_Z","_Z","_Z","WEIGHT","_Z","KT","y"]
["FINCONS","COAL","O_OTH_BUILD","KT","SFFPO","FC_OTH_CP_E_OE_BLD","O","_Z","_Z","_Z","_Z","_Z","WEIGHT","_Z","KT","y"]
["FINCONS","COAL","O_OTH_NBUILD","KT","SFFPO","FC_OTH_CP_E_OE_NBLD","O","_Z","_Z","_Z","_Z","_Z","WEIGHT","_Z","KT","y"]
["FINCONS","COAL","P","KT","SFFPO","ENERGUSE","P","_Z","_Z","_Z","_Z","_Z","WEIGHT","_Z","KT","y"]
["FINCONS","COAL","Q","KT","SFFPO","ENERGUSE","Q","_Z","_Z","_Z","_Z","_Z","WEIGHT","_Z","KT","y"]
["FINCONS","COAL","Q861","KT","SFFPO","ENERGUSE","Q861","_Z","_Z","_Z","_Z","_Z","WEIGHT","_Z","KT","y"]
["FINCONS","COAL","Q861_HEAT","KT","SFFPO","FC_OTH_CP_E_HEAT","Q861","_Z","_Z","_Z","_Z","_Z","WEIGHT","_Z","KT","y"]
["FINCONS","COAL","Q861_S_HEAT","KT","SFFPO","FC_OTH_CP_E_SH","Q861","_Z","_Z","_Z","_Z","_Z","WEIGHT","_Z","KT","y"]
["FINCONS","COAL","Q861_W_HEAT","KT","SFFPO","FC_OTH_CP_E_WH","Q861","_Z","_Z","_Z","_Z","_Z","WEIGHT","_Z","KT","y"]
["FINCONS","COAL","Q861_COOL","KT","SFFPO","FC_OTH_CP_E_CL","Q861","_Z","_Z","_Z","_Z","_Z","WEIGHT","_Z","KT","y"]
["FINCONS","COAL","Q861_S_COOL","KT","SFFPO","FC_OTH_CP_E_SC","Q861","_Z","_Z","_Z","_Z","_Z","WEIGHT","_Z","KT","y"]
["FINCONS","COAL","Q861_P_COOL","KT","SFFPO","FC_OTH_CP_E_PC","Q861","_Z","_Z","_Z","_Z","_Z","WEIGHT","_Z","KT","y"]
["FINCONS","COAL","Q861_LIGHT","KT","SFFPO","FC_OTH_CP_E_LOUT","Q861","_Z","_Z","_Z","_Z","_Z","WEIGHT","_Z","KT","y"]
["FINCONS","COAL","Q861_IN_LIGHT","KT","SFFPO","FC_OTH_CP_E_LINDRE","Q861","_Z","_Z","_Z","_Z","_Z","WEIGHT","_Z","KT","y"]
["FINCONS","COAL","Q861_OTH_BUILD","KT","SFFPO","FC_OTH_CP_E_OE_BLD","Q861","_Z","_Z","_Z","_Z","_Z","WEIGHT","_Z","KT","y"]
["FINCONS","COAL","Q861_OTH_NBUILD","KT","SFFPO","FC_OTH_CP_E_OE_NBLD","Q861","_Z","_Z","_Z","_Z","_Z","WEIGHT","_Z","KT","y"]
["FINCONS","COAL","R","KT","SFFPO","ENERGUSE","R","_Z","_Z","_Z","_Z","_Z","WEIGHT","_Z","KT","y"]
["FINCONS","COAL","R90-R92","KT","SFFPO","ENERGUSE","R90-R92","_Z","_Z","_Z","_Z","_Z","WEIGHT","_Z","KT","y"]
["FINCONS","COAL","R93","KT","SFFPO","ENERGUSE","R93","_Z","_Z","_Z","_Z","_Z","WEIGHT","_Z","KT","y"]
["FINCONS","COAL","S","KT","SFFPO","ENERGUSE","S","_Z","_Z","_Z","_Z","_Z","WEIGHT","_Z","KT","y"]
["FINCONS","COAL","U","KT","SFFPO","ENERGUSE","U","_Z","_Z","_Z","_Z","_Z","WEIGHT","_Z","KT","y"]
["FINCONS","COAL","DATAC","KT","SFFPO","ENERGUSE","DATAC","_Z","_Z","_Z","_Z","_Z","WEIGHT","_Z","KT","y"]
["FINCONS","COAL","TOTSER","KT","SFFPO","ENERGUSE","_T","_Z","_Z","_Z","_Z","_Z","WEIGHT","_Z","KT","y"]
["FINCONS","TOT","C33","TJ","_T","ENERGUSE","C33","_Z","_Z","_Z","_Z","_Z","ENERGY","_Z","TJ_NCV","y"]
["FINCONS","TOT","E","TJ","_T","ENERGUSE","E","_Z","_Z","_Z","_Z","_Z","ENERGY","_Z","TJ_NCV","y"]
["FINCONS","TOT","E36","TJ","_T","ENERGUSE","E36","_Z","_Z","_Z","_Z","_Z","ENERGY","_Z","TJ_NCV","y"]
["FINCONS","TOT","E37-E39","TJ","_T","ENERGUSE","E37-E39","_Z","_Z","_Z","_Z","_Z","ENERGY","_Z","TJ_NCV","y"]
["FINCONS","TOT","E37","TJ","_T","ENERGUSE","E37","_Z","_Z","_Z","_Z","_Z","ENERGY","_Z","TJ_NCV","y"]
["FINCONS","TOT","E38","TJ","_T","ENERGUSE","E38","_Z","_Z","_Z","_Z","_Z","ENERGY","_Z","TJ_NCV","y"]
["FINCONS","TOT","E39","TJ","_T","ENERGUSE","E39","_Z","_Z","_Z","_Z","_Z","ENERGY","_Z","TJ_NCV","y"]
["FINCONS","TOT","G","TJ","_T","ENERGUSE","G","_Z","_Z","_Z","_Z","_Z","ENERGY","_Z","TJ_NCV","y"]
["FINCONS","TOT","G_HEAT","TJ","_T","FC_OTH_CP_E_HEAT","G","_Z","_Z","_Z","_Z","_Z","ENERGY","_Z","TJ_NCV","y"]
["FINCONS","TOT","G_S_HEAT","TJ","_T","FC_OTH_CP_E_SH","G","_Z","_Z","_Z","_Z","_Z","ENERGY","_Z","TJ_NCV","y"]
["FINCONS","TOT","G_W_HEAT","TJ","_T","FC_OTH_CP_E_WH","G","_Z","_Z","_Z","_Z","_Z","ENERGY","_Z","TJ_NCV","y"]
["FINCONS","TOT","G_COOL","TJ","_T","FC_OTH_CP_E_CL","G","_Z","_Z","_Z","_Z","_Z","ENERGY","_Z","TJ_NCV","y"]
["FINCONS","TOT","G_S_COOL","TJ","_T","FC_OTH_CP_E_SC","G","_Z","_Z","_Z","_Z","_Z","ENERGY","_Z","TJ_NCV","y"]
["FINCONS","TOT","G_P_COOL","TJ","_T","FC_OTH_CP_E_PC","G","_Z","_Z","_Z","_Z","_Z","ENERGY","_Z","TJ_NCV","y"]
["FINCONS","TOT","G_LIGHT","TJ","_T","FC_OTH_CP_E_LOUT","G","_Z","_Z","_Z","_Z","_Z","ENERGY","_Z","TJ_NCV","y"]
["FINCONS","TOT","G_IN_LIGHT","TJ","_T","FC_OTH_CP_E_LINDRE","G","_Z","_Z","_Z","_Z","_Z","ENERGY","_Z","TJ_NCV","y"]
["FINCONS","TOT","G_OTH_BUILD","TJ","_T","FC_OTH_CP_E_OE_BLD","G","_Z","_Z","_Z","_Z","_Z","ENERGY","_Z","TJ_NCV","y"]
["FINCONS","TOT","G_OTH_NBUILD","TJ","_T","FC_OTH_CP_E_OE_NBLD","G","_Z","_Z","_Z","_Z","_Z","ENERGY","_Z","TJ_NCV","y"]
["FINCONS","TOT","G45","TJ","_T","ENERGUSE","G45","_Z","_Z","_Z","_Z","_Z","ENERGY","_Z","TJ_NCV","y"]
["FINCONS","TOT","G46","TJ","_T","ENERGUSE","G46","_Z","_Z","_Z","_Z","_Z","ENERGY","_Z","TJ_NCV","y"]
["FINCONS","TOT","G47","TJ","_T","ENERGUSE","G47","_Z","_Z","_Z","_Z","_Z","ENERGY","_Z","TJ_NCV","y"]
["FINCONS","TOT","G471","TJ","_T","ENERGUSE","G471","_Z","_Z","_Z","_Z","_Z","ENERGY","_Z","TJ_NCV","y"]
["FINCONS","TOT","G47_X_G471","TJ","_T","ENERGUSE","G47_X_G471","_Z","_Z","_Z","_Z","_Z","ENERGY","_Z","TJ_NCV","y"]
["FINCONS","TOT","H52","TJ","_T","ENERGUSE","H52","_Z","_Z","_Z","_Z","_Z","ENERGY","_Z","TJ_NCV","y"]
["FINCONS","TOT","H52_STL","TJ","_T","ENERGUSE","H52_STL","_Z","_Z","_Z","_Z","_Z","ENERGY","_Z","TJ_NCV","y"]
["FINCONS","TOT","H53","TJ","_T","ENERGUSE","H53","_Z","_Z","_Z","_Z","_Z","ENERGY","_Z","TJ_NCV","y"]
["FINCONS","TOT","I","TJ","_T","ENERGUSE","I","_Z","_Z","_Z","_Z","_Z","ENERGY","_Z","TJ_NCV","y"]
["FINCONS","TOT","I55","TJ","_T","ENERGUSE","I55","_Z","_Z","_Z","_Z","_Z","ENERGY","_Z","TJ_NCV","y"]
["FINCONS","TOT","I55_HEAT","TJ","_T","FC_OTH_CP_E_HEAT","I55","_Z","_Z","_Z","_Z","_Z","ENERGY","_Z","TJ_NCV","y"]
["FINCONS","TOT","I55_S_HEAT","TJ","_T","FC_OTH_CP_E_SH","I55","_Z","_Z","_Z","_Z","_Z","ENERGY","_Z","TJ_NCV","y"]
["FINCONS","TOT","I55_W_HEAT","TJ","_T","FC_OTH_CP_E_WH","I55","_Z","_Z","_Z","_Z","_Z","ENERGY","_Z","TJ_NCV","y"]
["FINCONS","TOT","I55_COOL","TJ","_T","FC_OTH_CP_E_CL","I55","_Z","_Z","_Z","_Z","_Z","ENERGY","_Z","TJ_NCV","y"]
["FINCONS","TOT","I55_S_COOL","TJ","_T","FC_OTH_CP_E_SC","I55","_Z","_Z","_Z","_Z","_Z","ENERGY","_Z","TJ_NCV","y"]
["FINCONS","TOT","I55_P_COOL","TJ","_T","FC_OTH_CP_E_PC","I55","_Z","_Z","_Z","_Z","_Z","ENERGY","_Z","TJ_NCV","y"]
["FINCONS","TOT","I55_LIGHT","TJ","_T","FC_OTH_CP_E_LOUT","I55","_Z","_Z","_Z","_Z","_Z","ENERGY","_Z","TJ_NCV","y"]
["FINCONS","TOT","I55_IN_LIGHT","TJ","_T","FC_OTH_CP_E_LINDRE","I55","_Z","_Z","_Z","_Z","_Z","ENERGY","_Z","TJ_NCV","y"]
["FINCONS","TOT","I55_OTH_BUILD","TJ","_T","FC_OTH_CP_E_OE_BLD","I55","_Z","_Z","_Z","_Z","_Z","ENERGY","_Z","TJ_NCV","y"]
["FINCONS","TOT","I55_OTH_NBUILD","TJ","_T","FC_OTH_CP_E_OE_NBLD","I55","_Z","_Z","_Z","_Z","_Z","ENERGY","_Z","TJ_NCV","y"]
["FINCONS","TOT","I551","TJ","_T","ENERGUSE","I551","_Z","_Z","_Z","_Z","_Z","ENERGY","_Z","TJ_NCV","y"]
["FINCONS","TOT","I552","TJ","_T","ENERGUSE","I552","_Z","_Z","_Z","_Z","_Z","ENERGY","_Z","TJ_NCV","y"]
["FINCONS","TOT","I553","TJ","_T","ENERGUSE","I553","_Z","_Z","_Z","_Z","_Z","ENERGY","_Z","TJ_NCV","y"]
["FINCONS","TOT","I559","TJ","_T","ENERGUSE","I559","_Z","_Z","_Z","_Z","_Z","ENERGY","_Z","TJ_NCV","y"]
["FINCONS","TOT","I56","TJ","_T","ENERGUSE","I56","_Z","_Z","_Z","_Z","_Z","ENERGY","_Z","TJ_NCV","y"]
["FINCONS","TOT","I56_HEAT","TJ","_T","FC_OTH_CP_E_HEAT","I56","_Z","_Z","_Z","_Z","_Z","ENERGY","_Z","TJ_NCV","y"]
["FINCONS","TOT","I56_S_HEAT","TJ","_T","FC_OTH_CP_E_SH","I56","_Z","_Z","_Z","_Z","_Z","ENERGY","_Z","TJ_NCV","y"]
["FINCONS","TOT","I56_W_HEAT","TJ","_T","FC_OTH_CP_E_WH","I56","_Z","_Z","_Z","_Z","_Z","ENERGY","_Z","TJ_NCV","y"]
["FINCONS","TOT","I56_COOL","TJ","_T","FC_OTH_CP_E_CL","I56","_Z","_Z","_Z","_Z","_Z","ENERGY","_Z","TJ_NCV","y"]
["FINCONS","TOT","I56_S_COOL","TJ","_T","FC_OTH_CP_E_SC","I56","_Z","_Z","_Z","_Z","_Z","ENERGY","_Z","TJ_NCV","y"]
["FINCONS","TOT","I56_P_COOL","TJ","_T","FC_OTH_CP_E_PC","I56","_Z","_Z","_Z","_Z","_Z","ENERGY","_Z","TJ_NCV","y"]
["FINCONS","TOT","I56_LIGHT","TJ","_T","FC_OTH_CP_E_LOUT","I56","_Z","_Z","_Z","_Z","_Z","ENERGY","_Z","TJ_NCV","y"]
["FINCONS","TOT","I56_IN_LIGHT","TJ","_T","FC_OTH_CP_E_LINDRE","I56","_Z","_Z","_Z","_Z","_Z","ENERGY","_Z","TJ_NCV","y"]
["FINCONS","TOT","I56_OTH_BUILD","TJ","_T","FC_OTH_CP_E_OE_BLD","I56","_Z","_Z","_Z","_Z","_Z","ENERGY","_Z","TJ_NCV","y"]
["FINCONS","TOT","I56_OTH_NBUILD","TJ","_T","FC_OTH_CP_E_OE_NBLD","I56","_Z","_Z","_Z","_Z","_Z","ENERGY","_Z","TJ_NCV","y"]
["FINCONS","TOT","I561","TJ","_T","ENERGUSE","I561","_Z","_Z","_Z","_Z","_Z","ENERGY","_Z","TJ_NCV","y"]
["FINCONS","TOT","I562","TJ","_T","ENERGUSE","I562","_Z","_Z","_Z","_Z","_Z","ENERGY","_Z","TJ_NCV","y"]
["FINCONS","TOT","I563","TJ","_T","ENERGUSE","I563","_Z","_Z","_Z","_Z","_Z","ENERGY","_Z","TJ_NCV","y"]
["FINCONS","TOT","J","TJ","_T","ENERGUSE","J","_Z","_Z","_Z","_Z","_Z","ENERGY","_Z","TJ_NCV","y"]
["FINCONS","TOT","J58","TJ","_T","ENERGUSE","J58","_Z","_Z","_Z","_Z","_Z","ENERGY","_Z","TJ_NCV","y"]
["FINCONS","TOT","J59_J60","TJ","_T","ENERGUSE","J59_J60","_Z","_Z","_Z","_Z","_Z","ENERGY","_Z","TJ_NCV","y"]
["FINCONS","TOT","J61","TJ","_T","ENERGUSE","J61","_Z","_Z","_Z","_Z","_Z","ENERGY","_Z","TJ_NCV","y"]
["FINCONS","TOT","J62_J63","TJ","_T","ENERGUSE","J62_J63","_Z","_Z","_Z","_Z","_Z","ENERGY","_Z","TJ_NCV","y"]
["FINCONS","TOT","J62","TJ","_T","ENERGUSE","J62","_Z","_Z","_Z","_Z","_Z","ENERGY","_Z","TJ_NCV","y"]
["FINCONS","TOT","J63","TJ","_T","ENERGUSE","J63","_Z","_Z","_Z","_Z","_Z","ENERGY","_Z","TJ_NCV","y"]
["FINCONS","TOT","K_L","TJ","_T","ENERGUSE","K_L","_Z","_Z","_Z","_Z","_Z","ENERGY","_Z","TJ_NCV","y"]
["FINCONS","TOT","K","TJ","_T","ENERGUSE","K","_Z","_Z","_Z","_Z","_Z","ENERGY","_Z","TJ_NCV","y"]
["FINCONS","TOT","L","TJ","_T","ENERGUSE","L","_Z","_Z","_Z","_Z","_Z","ENERGY","_Z","TJ_NCV","y"]
["FINCONS","TOT","M_S","TJ","_T","ENERGUSE","M_S","_Z","_Z","_Z","_Z","_Z","ENERGY","_Z","TJ_NCV","y"]
["FINCONS","TOT","M","TJ","_T","ENERGUSE","M","_Z","_Z","_Z","_Z","_Z","ENERGY","_Z","TJ_NCV","y"]
["FINCONS","TOT","M69_M70","TJ","_T","ENERGUSE","M69_M70","_Z","_Z","_Z","_Z","_Z","ENERGY","_Z","TJ_NCV","y"]
["FINCONS","TOT","M71","TJ","_T","ENERGUSE","M71","_Z","_Z","_Z","_Z","_Z","ENERGY","_Z","TJ_NCV","y"]
["FINCONS","TOT","M72","TJ","_T","ENERGUSE","M72","_Z","_Z","_Z","_Z","_Z","ENERGY","_Z","TJ_NCV","y"]
["FINCONS","TOT","M73","TJ","_T","ENERGUSE","M73","_Z","_Z","_Z","_Z","_Z","ENERGY","_Z","TJ_NCV","y"]
["FINCONS","TOT","M74_M75","TJ","_T","ENERGUSE","M74_M75","_Z","_Z","_Z","_Z","_Z","ENERGY","_Z","TJ_NCV","y"]
["FINCONS","TOT","N","TJ","_T","ENERGUSE","N","_Z","_Z","_Z","_Z","_Z","ENERGY","_Z","TJ_NCV","y"]
["FINCONS","TOT","N77","TJ","_T","ENERGUSE","N77","_Z","_Z","_Z","_Z","_Z","ENERGY","_Z","TJ_NCV","y"]
["FINCONS","TOT","N78","TJ","_T","ENERGUSE","N78","_Z","_Z","_Z","_Z","_Z","ENERGY","_Z","TJ_NCV","y"]
["FINCONS","TOT","N79","TJ","_T","ENERGUSE","N79","_Z","_Z","_Z","_Z","_Z","ENERGY","_Z","TJ_NCV","y"]
["FINCONS","TOT","N80-N82","TJ","_T","ENERGUSE","N80-N82","_Z","_Z","_Z","_Z","_Z","ENERGY","_Z","TJ_NCV","y"]
["FINCONS","TOT","O","TJ","_T","ENERGUSE","O","_Z","_Z","_Z","_Z","_Z","ENERGY","_Z","TJ_NCV","y"]
["FINCONS","TOT","O_HEAT","TJ","_T","FC_OTH_CP_E_HEAT","O","_Z","_Z","_Z","_Z","_Z","ENERGY","_Z","TJ_NCV","y"]
["FINCONS","TOT","O_S_HEAT","TJ","_T","FC_OTH_CP_E_SH","O","_Z","_Z","_Z","_Z","_Z","ENERGY","_Z","TJ_NCV","y"]
["FINCONS","TOT","O_W_HEAT","TJ","_T","FC_OTH_CP_E_WH","O","_Z","_Z","_Z","_Z","_Z","ENERGY","_Z","TJ_NCV","y"]
["FINCONS","TOT","O_COOL","TJ","_T","FC_OTH_CP_E_CL","O","_Z","_Z","_Z","_Z","_Z","ENERGY","_Z","TJ_NCV","y"]
["FINCONS","TOT","O_S_COOL","TJ","_T","FC_OTH_CP_E_SC","O","_Z","_Z","_Z","_Z","_Z","ENERGY","_Z","TJ_NCV","y"]
["FINCONS","TOT","O_P_COOL","TJ","_T","FC_OTH_CP_E_PC","O","_Z","_Z","_Z","_Z","_Z","ENERGY","_Z","TJ_NCV","y"]
["FINCONS","TOT","O_LIGHT","TJ","_T","FC_OTH_CP_E_LOUT","O","_Z","_Z","_Z","_Z","_Z","ENERGY","_Z","TJ_NCV","y"]
["FINCONS","TOT","O_IN_LIGHT","TJ","_T","FC_OTH_CP_E_LINDRE","O","_Z","_Z","_Z","_Z","_Z","ENERGY","_Z","TJ_NCV","y"]
["FINCONS","TOT","O_OTH_BUILD","TJ","_T","FC_OTH_CP_E_OE_BLD","O","_Z","_Z","_Z","_Z","_Z","ENERGY","_Z","TJ_NCV","y"]
["FINCONS","TOT","O_OTH_NBUILD","TJ","_T","FC_OTH_CP_E_OE_NBLD","O","_Z","_Z","_Z","_Z","_Z","ENERGY","_Z","TJ_NCV","y"]
["FINCONS","TOT","P","TJ","_T","ENERGUSE","P","_Z","_Z","_Z","_Z","_Z","ENERGY","_Z","TJ_NCV","y"]
["FINCONS","TOT","Q","TJ","_T","ENERGUSE","Q","_Z","_Z","_Z","_Z","_Z","ENERGY","_Z","TJ_NCV","y"]
["FINCONS","TOT","Q861","TJ","_T","ENERGUSE","Q861","_Z","_Z","_Z","_Z","_Z","ENERGY","_Z","TJ_NCV","y"]
["FINCONS","TOT","Q861_HEAT","TJ","_T","FC_OTH_CP_E_HEAT","Q861","_Z","_Z","_Z","_Z","_Z","ENERGY","_Z","TJ_NCV","y"]
["FINCONS","TOT","Q861_S_HEAT","TJ","_T","FC_OTH_CP_E_SH","Q861","_Z","_Z","_Z","_Z","_Z","ENERGY","_Z","TJ_NCV","y"]
["FINCONS","TOT","Q861_W_HEAT","TJ","_T","FC_OTH_CP_E_WH","Q861","_Z","_Z","_Z","_Z","_Z","ENERGY","_Z","TJ_NCV","y"]
["FINCONS","TOT","Q861_COOL","TJ","_T","FC_OTH_CP_E_CL","Q861","_Z","_Z","_Z","_Z","_Z","ENERGY","_Z","TJ_NCV","y"]
["FINCONS","TOT","Q861_S_COOL","TJ","_T","FC_OTH_CP_E_SC","Q861","_Z","_Z","_Z","_Z","_Z","ENERGY","_Z","TJ_NCV","y"]
["FINCONS","TOT","Q861_P_COOL","TJ","_T","FC_OTH_CP_E_PC","Q861","_Z","_Z","_Z","_Z","_Z","ENERGY","_Z","TJ_NCV","y"]
["FINCONS","TOT","Q861_LIGHT","TJ","_T","FC_OTH_CP_E_LOUT","Q861","_Z","_Z","_Z","_Z","_Z","ENERGY","_Z","TJ_NCV","y"]
["FINCONS","TOT","Q861_IN_LIGHT","TJ","_T","FC_OTH_CP_E_LINDRE","Q861","_Z","_Z","_Z","_Z","_Z","ENERGY","_Z","TJ_NCV","y"]
["FINCONS","TOT","Q861_OTH_BUILD","TJ","_T","FC_OTH_CP_E_OE_BLD","Q861","_Z","_Z","_Z","_Z","_Z","ENERGY","_Z","TJ_NCV","y"]
["FINCONS","TOT","Q861_OTH_NBUILD","TJ","_T","FC_OTH_CP_E_OE_NBLD","Q861","_Z","_Z","_Z","_Z","_Z","ENERGY","_Z","TJ_NCV","y"]
["FINCONS","TOT","R","TJ","_T","ENERGUSE","R","_Z","_Z","_Z","_Z","_Z","ENERGY","_Z","TJ_NCV","y"]
["FINCONS","TOT","R90-R92","TJ","_T","ENERGUSE","R90-R92","_Z","_Z","_Z","_Z","_Z","ENERGY","_Z","TJ_NCV","y"]
["FINCONS","TOT","R93","TJ","_T","ENERGUSE","R93","_Z","_Z","_Z","_Z","_Z","ENERGY","_Z","TJ_NCV","y"]
["FINCONS","TOT","S","TJ","_T","ENERGUSE","S","_Z","_Z","_Z","_Z","_Z","ENERGY","_Z","TJ_NCV","y"]
["FINCONS","TOT","U","TJ","_T","ENERGUSE","U","_Z","_Z","_Z","_Z","_Z","ENERGY","_Z","TJ_NCV","y"]
["FINCONS","TOT","DATAC","TJ","_T","ENERGUSE","DATAC","_Z","_Z","_Z","_Z","_Z","ENERGY","_Z","TJ_NCV","y"]
["FINCONS","TOT","TOTSER","TJ","_T","ENERGUSE","_T","_Z","_Z","_Z","_Z","_Z","ENERGY","_Z","TJ_NCV","y"]
["FINCONS","ELECTR","C33","GWH","E7000","ENERGUSE","C33","_Z","_Z","_Z","_Z","_Z","ENERGY","_Z","GWH","y"]
["FINCONS","ELECTR","E","GWH","E7000","ENERGUSE","E","_Z","_Z","_Z","_Z","_Z","ENERGY","_Z","GWH","y"]
["FINCONS","ELECTR","E36","GWH","E7000","ENERGUSE","E36","_Z","_Z","_Z","_Z","_Z","ENERGY","_Z","GWH","y"]
["FINCONS","ELECTR","E37-E39","GWH","E7000","ENERGUSE","E37-E39","_Z","_Z","_Z","_Z","_Z","ENERGY","_Z","GWH","y"]
["FINCONS","ELECTR","E37","GWH","E7000","ENERGUSE","E37","_Z","_Z","_Z","_Z","_Z","ENERGY","_Z","GWH","y"]
["FINCONS","ELECTR","E38","GWH","E7000","ENERGUSE","E38","_Z","_Z","_Z","_Z","_Z","ENERGY","_Z","GWH","y"]
["FINCONS","ELECTR","E39","GWH","E7000","ENERGUSE","E39","_Z","_Z","_Z","_Z","_Z","ENERGY","_Z","GWH","y"]
["FINCONS","ELECTR","G","GWH","E7000","ENERGUSE","G","_Z","_Z","_Z","_Z","_Z","ENERGY","_Z","GWH","y"]
["FINCONS","ELECTR","G_HEAT","GWH","E7000","FC_OTH_CP_E_HEAT","G","_Z","_Z","_Z","_Z","_Z","ENERGY","_Z","GWH","y"]
["FINCONS","ELECTR","G_S_HEAT","GWH","E7000","FC_OTH_CP_E_SH","G","_Z","_Z","_Z","_Z","_Z","ENERGY","_Z","GWH","y"]
["FINCONS","ELECTR","G_W_HEAT","GWH","E7000","FC_OTH_CP_E_WH","G","_Z","_Z","_Z","_Z","_Z","ENERGY","_Z","GWH","y"]
["FINCONS","ELECTR","G_COOL","GWH","E7000","FC_OTH_CP_E_CL","G","_Z","_Z","_Z","_Z","_Z","ENERGY","_Z","GWH","y"]
["FINCONS","ELECTR","G_S_COOL","GWH","E7000","FC_OTH_CP_E_SC","G","_Z","_Z","_Z","_Z","_Z","ENERGY","_Z","GWH","y"]
["FINCONS","ELECTR","G_P_COOL","GWH","E7000","FC_OTH_CP_E_PC","G","_Z","_Z","_Z","_Z","_Z","ENERGY","_Z","GWH","y"]
["FINCONS","ELECTR","G_LIGHT","GWH","E7000","FC_OTH_CP_E_LOUT","G","_Z","_Z","_Z","_Z","_Z","ENERGY","_Z","GWH","y"]
["FINCONS","ELECTR","G_IN_LIGHT","GWH","E7000","FC_OTH_CP_E_LINDRE","G","_Z","_Z","_Z","_Z","_Z","ENERGY","_Z","GWH","y"]
["FINCONS","ELECTR","G_OTH_BUILD","GWH","E7000","FC_OTH_CP_E_OE_BLD","G","_Z","_Z","_Z","_Z","_Z","ENERGY","_Z","GWH","y"]
["FINCONS","ELECTR","G_OTH_NBUILD","GWH","E7000","FC_OTH_CP_E_OE_NBLD","G","_Z","_Z","_Z","_Z","_Z","ENERGY","_Z","GWH","y"]
["FINCONS","ELECTR","G45","GWH","E7000","ENERGUSE","G45","_Z","_Z","_Z","_Z","_Z","ENERGY","_Z","GWH","y"]
["FINCONS","ELECTR","G46","GWH","E7000","ENERGUSE","G46","_Z","_Z","_Z","_Z","_Z","ENERGY","_Z","GWH","y"]
["FINCONS","ELECTR","G47","GWH","E7000","ENERGUSE","G47","_Z","_Z","_Z","_Z","_Z","ENERGY","_Z","GWH","y"]
["FINCONS","ELECTR","G471","GWH","E7000","ENERGUSE","G471","_Z","_Z","_Z","_Z","_Z","ENERGY","_Z","GWH","y"]
["FINCONS","ELECTR","G47_X_G471","GWH","E7000","ENERGUSE","G47_X_G471","_Z","_Z","_Z","_Z","_Z","ENERGY","_Z","GWH","y"]
["FINCONS","ELECTR","H52","GWH","E7000","ENERGUSE","H52","_Z","_Z","_Z","_Z","_Z","ENERGY","_Z","GWH","y"]
["FINCONS","ELECTR","H52_STL","GWH","E7000","ENERGUSE","H52_STL","_Z","_Z","_Z","_Z","_Z","ENERGY","_Z","GWH","y"]
["FINCONS","ELECTR","H53","GWH","E7000","ENERGUSE","H53","_Z","_Z","_Z","_Z","_Z","ENERGY","_Z","GWH","y"]
["FINCONS","ELECTR","I","GWH","E7000","ENERGUSE","I","_Z","_Z","_Z","_Z","_Z","ENERGY","_Z","GWH","y"]
["FINCONS","ELECTR","I55","GWH","E7000","ENERGUSE","I55","_Z","_Z","_Z","_Z","_Z","ENERGY","_Z","GWH","y"]
["FINCONS","ELECTR","I55_HEAT","GWH","E7000","FC_OTH_CP_E_HEAT","I55","_Z","_Z","_Z","_Z","_Z","ENERGY","_Z","GWH","y"]
["FINCONS","ELECTR","I55_S_HEAT","GWH","E7000","FC_OTH_CP_E_SH","I55","_Z","_Z","_Z","_Z","_Z","ENERGY","_Z","GWH","y"]
["FINCONS","ELECTR","I55_W_HEAT","GWH","E7000","FC_OTH_CP_E_WH","I55","_Z","_Z","_Z","_Z","_Z","ENERGY","_Z","GWH","y"]
["FINCONS","ELECTR","I55_COOL","GWH","E7000","FC_OTH_CP_E_CL","I55","_Z","_Z","_Z","_Z","_Z","ENERGY","_Z","GWH","y"]
["FINCONS","ELECTR","I55_S_COOL","GWH","E7000","FC_OTH_CP_E_SC","I55","_Z","_Z","_Z","_Z","_Z","ENERGY","_Z","GWH","y"]
["FINCONS","ELECTR","I55_P_COOL","GWH","E7000","FC_OTH_CP_E_PC","I55","_Z","_Z","_Z","_Z","_Z","ENERGY","_Z","GWH","y"]
["FINCONS","ELECTR","I55_LIGHT","GWH","E7000","FC_OTH_CP_E_LOUT","I55","_Z","_Z","_Z","_Z","_Z","ENERGY","_Z","GWH","y"]
["FINCONS","ELECTR","I55_IN_LIGHT","GWH","E7000","FC_OTH_CP_E_LINDRE","I55","_Z","_Z","_Z","_Z","_Z","ENERGY","_Z","GWH","y"]
["FINCONS","ELECTR","I55_OTH_BUILD","GWH","E7000","FC_OTH_CP_E_OE_BLD","I55","_Z","_Z","_Z","_Z","_Z","ENERGY","_Z","GWH","y"]
["FINCONS","ELECTR","I55_OTH_NBUILD","GWH","E7000","FC_OTH_CP_E_OE_NBLD","I55","_Z","_Z","_Z","_Z","_Z","ENERGY","_Z","GWH","y"]
["FINCONS","ELECTR","I551","GWH","E7000","ENERGUSE","I551","_Z","_Z","_Z","_Z","_Z","ENERGY","_Z","GWH","y"]
["FINCONS","ELECTR","I552","GWH","E7000","ENERGUSE","I552","_Z","_Z","_Z","_Z","_Z","ENERGY","_Z","GWH","y"]
["FINCONS","ELECTR","I553","GWH","E7000","ENERGUSE","I553","_Z","_Z","_Z","_Z","_Z","ENERGY","_Z","GWH","y"]
["FINCONS","ELECTR","I559","GWH","E7000","ENERGUSE","I559","_Z","_Z","_Z","_Z","_Z","ENERGY","_Z","GWH","y"]
["FINCONS","ELECTR","I56","GWH","E7000","ENERGUSE","I56","_Z","_Z","_Z","_Z","_Z","ENERGY","_Z","GWH","y"]
["FINCONS","ELECTR","I56_HEAT","GWH","E7000","FC_OTH_CP_E_HEAT","I56","_Z","_Z","_Z","_Z","_Z","ENERGY","_Z","GWH","y"]
["FINCONS","ELECTR","I56_S_HEAT","GWH","E7000","FC_OTH_CP_E_SH","I56","_Z","_Z","_Z","_Z","_Z","ENERGY","_Z","GWH","y"]
["FINCONS","ELECTR","I56_W_HEAT","GWH","E7000","FC_OTH_CP_E_WH","I56","_Z","_Z","_Z","_Z","_Z","ENERGY","_Z","GWH","y"]
["FINCONS","ELECTR","I56_COOL","GWH","E7000","FC_OTH_CP_E_CL","I56","_Z","_Z","_Z","_Z","_Z","ENERGY","_Z","GWH","y"]
["FINCONS","ELECTR","I56_S_COOL","GWH","E7000","FC_OTH_CP_E_SC","I56","_Z","_Z","_Z","_Z","_Z","ENERGY","_Z","GWH","y"]
["FINCONS","ELECTR","I56_P_COOL","GWH","E7000","FC_OTH_CP_E_PC","I56","_Z","_Z","_Z","_Z","_Z","ENERGY","_Z","GWH","y"]
["FINCONS","ELECTR","I56_LIGHT","GWH","E7000","FC_OTH_CP_E_LOUT","I56","_Z","_Z","_Z","_Z","_Z","ENERGY","_Z","GWH","y"]
["FINCONS","ELECTR","I56_IN_LIGHT","GWH","E7000","FC_OTH_CP_E_LINDRE","I56","_Z","_Z","_Z","_Z","_Z","ENERGY","_Z","GWH","y"]
["FINCONS","ELECTR","I56_OTH_BUILD","GWH","E7000","FC_OTH_CP_E_OE_BLD","I56","_Z","_Z","_Z","_Z","_Z","ENERGY","_Z","GWH","y"]
["FINCONS","ELECTR","I56_OTH_NBUILD","GWH","E7000","FC_OTH_CP_E_OE_NBLD","I56","_Z","_Z","_Z","_Z","_Z","ENERGY","_Z","GWH","y"]
["FINCONS","ELECTR","I561","GWH","E7000","ENERGUSE","I561","_Z","_Z","_Z","_Z","_Z","ENERGY","_Z","GWH","y"]
["FINCONS","ELECTR","I562","GWH","E7000","ENERGUSE","I562","_Z","_Z","_Z","_Z","_Z","ENERGY","_Z","GWH","y"]
["FINCONS","ELECTR","I563","GWH","E7000","ENERGUSE","I563","_Z","_Z","_Z","_Z","_Z","ENERGY","_Z","GWH","y"]
["FINCONS","ELECTR","J","GWH","E7000","ENERGUSE","J","_Z","_Z","_Z","_Z","_Z","ENERGY","_Z","GWH","y"]
["FINCONS","ELECTR","J58","GWH","E7000","ENERGUSE","J58","_Z","_Z","_Z","_Z","_Z","ENERGY","_Z","GWH","y"]
["FINCONS","ELECTR","J59_J60","GWH","E7000","ENERGUSE","J59_J60","_Z","_Z","_Z","_Z","_Z","ENERGY","_Z","GWH","y"]
["FINCONS","ELECTR","J61","GWH","E7000","ENERGUSE","J61","_Z","_Z","_Z","_Z","_Z","ENERGY","_Z","GWH","y"]
["FINCONS","ELECTR","J62_J63","GWH","E7000","ENERGUSE","J62_J63","_Z","_Z","_Z","_Z","_Z","ENERGY","_Z","GWH","y"]
["FINCONS","ELECTR","J62","GWH","E7000","ENERGUSE","J62","_Z","_Z","_Z","_Z","_Z","ENERGY","_Z","GWH","y"]
["FINCONS","ELECTR","J63","GWH","E7000","ENERGUSE","J63","_Z","_Z","_Z","_Z","_Z","ENERGY","_Z","GWH","y"]
["FINCONS","ELECTR","K_L","GWH","E7000","ENERGUSE","K_L","_Z","_Z","_Z","_Z","_Z","ENERGY","_Z","GWH","y"]
["FINCONS","ELECTR","K","GWH","E7000","ENERGUSE","K","_Z","_Z","_Z","_Z","_Z","ENERGY","_Z","GWH","y"]
["FINCONS","ELECTR","L","GWH","E7000","ENERGUSE","L","_Z","_Z","_Z","_Z","_Z","ENERGY","_Z","GWH","y"]
["FINCONS","ELECTR","M_S","GWH","E7000","ENERGUSE","M_S","_Z","_Z","_Z","_Z","_Z","ENERGY","_Z","GWH","y"]
["FINCONS","ELECTR","M","GWH","E7000","ENERGUSE","M","_Z","_Z","_Z","_Z","_Z","ENERGY","_Z","GWH","y"]
["FINCONS","ELECTR","M69_M70","GWH","E7000","ENERGUSE","M69_M70","_Z","_Z","_Z","_Z","_Z","ENERGY","_Z","GWH","y"]
["FINCONS","ELECTR","M71","GWH","E7000","ENERGUSE","M71","_Z","_Z","_Z","_Z","_Z","ENERGY","_Z","GWH","y"]
["FINCONS","ELECTR","M72","GWH","E7000","ENERGUSE","M72","_Z","_Z","_Z","_Z","_Z","ENERGY","_Z","GWH","y"]
["FINCONS","ELECTR","M73","GWH","E7000","ENERGUSE","M73","_Z","_Z","_Z","_Z","_Z","ENERGY","_Z","GWH","y"]
["FINCONS","ELECTR","M74_M75","GWH","E7000","ENERGUSE","M74_M75","_Z","_Z","_Z","_Z","_Z","ENERGY","_Z","GWH","y"]
["FINCONS","ELECTR","N","GWH","E7000","ENERGUSE","N","_Z","_Z","_Z","_Z","_Z","ENERGY","_Z","GWH","y"]
["FINCONS","ELECTR","N77","GWH","E7000","ENERGUSE","N77","_Z","_Z","_Z","_Z","_Z","ENERGY","_Z","GWH","y"]
["FINCONS","ELECTR","N78","GWH","E7000","ENERGUSE","N78","_Z","_Z","_Z","_Z","_Z","ENERGY","_Z","GWH","y"]
["FINCONS","ELECTR","N79","GWH","E7000","ENERGUSE","N79","_Z","_Z","_Z","_Z","_Z","ENERGY","_Z","GWH","y"]
["FINCONS","ELECTR","N80-N82","GWH","E7000","ENERGUSE","N80-N82","_Z","_Z","_Z","_Z","_Z","ENERGY","_Z","GWH","y"]
["FINCONS","ELECTR","O","GWH","E7000","ENERGUSE","O","_Z","_Z","_Z","_Z","_Z","ENERGY","_Z","GWH","y"]
["FINCONS","ELECTR","O_HEAT","GWH","E7000","FC_OTH_CP_E_HEAT","O","_Z","_Z","_Z","_Z","_Z","ENERGY","_Z","GWH","y"]
["FINCONS","ELECTR","O_S_HEAT","GWH","E7000","FC_OTH_CP_E_SH","O","_Z","_Z","_Z","_Z","_Z","ENERGY","_Z","GWH","y"]
["FINCONS","ELECTR","O_W_HEAT","GWH","E7000","FC_OTH_CP_E_WH","O","_Z","_Z","_Z","_Z","_Z","ENERGY","_Z","GWH","y"]
["FINCONS","ELECTR","O_COOL","GWH","E7000","FC_OTH_CP_E_CL","O","_Z","_Z","_Z","_Z","_Z","ENERGY","_Z","GWH","y"]
["FINCONS","ELECTR","O_S_COOL","GWH","E7000","FC_OTH_CP_E_SC","O","_Z","_Z","_Z","_Z","_Z","ENERGY","_Z","GWH","y"]
["FINCONS","ELECTR","O_P_COOL","GWH","E7000","FC_OTH_CP_E_PC","O","_Z","_Z","_Z","_Z","_Z","ENERGY","_Z","GWH","y"]
["FINCONS","ELECTR","O_LIGHT","GWH","E7000","FC_OTH_CP_E_LOUT","O","_Z","_Z","_Z","_Z","_Z","ENERGY","_Z","GWH","y"]
["FINCONS","ELECTR","O_IN_LIGHT","GWH","E7000","FC_OTH_CP_E_LINDRE","O","_Z","_Z","_Z","_Z","_Z","ENERGY","_Z","GWH","y"]
["FINCONS","ELECTR","O_OTH_BUILD","GWH","E7000","FC_OTH_CP_E_OE_BLD","O","_Z","_Z","_Z","_Z","_Z","ENERGY","_Z","GWH","y"]
["FINCONS","ELECTR","O_OTH_NBUILD","GWH","E7000","FC_OTH_CP_E_OE_NBLD","O","_Z","_Z","_Z","_Z","_Z","ENERGY","_Z","GWH","y"]
["FINCONS","ELECTR","P","GWH","E7000","ENERGUSE","P","_Z","_Z","_Z","_Z","_Z","ENERGY","_Z","GWH","y"]
["FINCONS","ELECTR","Q","GWH","E7000","ENERGUSE","Q","_Z","_Z","_Z","_Z","_Z","ENERGY","_Z","GWH","y"]
["FINCONS","ELECTR","Q861","GWH","E7000","ENERGUSE","Q861","_Z","_Z","_Z","_Z","_Z","ENERGY","_Z","GWH","y"]
["FINCONS","ELECTR","Q861_HEAT","GWH","E7000","FC_OTH_CP_E_HEAT","Q861","_Z","_Z","_Z","_Z","_Z","ENERGY","_Z","GWH","y"]
["FINCONS","ELECTR","Q861_S_HEAT","GWH","E7000","FC_OTH_CP_E_SH","Q861","_Z","_Z","_Z","_Z","_Z","ENERGY","_Z","GWH","y"]
["FINCONS","ELECTR","Q861_W_HEAT","GWH","E7000","FC_OTH_CP_E_WH","Q861","_Z","_Z","_Z","_Z","_Z","ENERGY","_Z","GWH","y"]
["FINCONS","ELECTR","Q861_COOL","GWH","E7000","FC_OTH_CP_E_CL","Q861","_Z","_Z","_Z","_Z","_Z","ENERGY","_Z","GWH","y"]
["FINCONS","ELECTR","Q861_S_COOL","GWH","E7000","FC_OTH_CP_E_SC","Q861","_Z","_Z","_Z","_Z","_Z","ENERGY","_Z","GWH","y"]
["FINCONS","ELECTR","Q861_P_COOL","GWH","E7000","FC_OTH_CP_E_PC","Q861","_Z","_Z","_Z","_Z","_Z","ENERGY","_Z","GWH","y"]
["FINCONS","ELECTR","Q861_LIGHT","GWH","E7000","FC_OTH_CP_E_LOUT","Q861","_Z","_Z","_Z","_Z","_Z","ENERGY","_Z","GWH","y"]
["FINCONS","ELECTR","Q861_IN_LIGHT","GWH","E7000","FC_OTH_CP_E_LINDRE","Q861","_Z","_Z","_Z","_Z","_Z","ENERGY","_Z","GWH","y"]
["FINCONS","ELECTR","Q861_OTH_BUILD","GWH","E7000","FC_OTH_CP_E_OE_BLD","Q861","_Z","_Z","_Z","_Z","_Z","ENERGY","_Z","GWH","y"]
["FINCONS","ELECTR","Q861_OTH_NBUILD","GWH","E7000","FC_OTH_CP_E_OE_NBLD","Q861","_Z","_Z","_Z","_Z","_Z","ENERGY","_Z","GWH","y"]
["FINCONS","ELECTR","R","GWH","E7000","ENERGUSE","R","_Z","_Z","_Z","_Z","_Z","ENERGY","_Z","GWH","y"]
["FINCONS","ELECTR","R90-R92","GWH","E7000","ENERGUSE","R90-R92","_Z","_Z","_Z","_Z","_Z","ENERGY","_Z","GWH","y"]
["FINCONS","ELECTR","R93","GWH","E7000","ENERGUSE","R93","_Z","_Z","_Z","_Z","_Z","ENERGY","_Z","GWH","y"]
["FINCONS","ELECTR","S","GWH","E7000","ENERGUSE","S","_Z","_Z","_Z","_Z","_Z","ENERGY","_Z","GWH","y"]
["FINCONS","ELECTR","U","GWH","E7000","ENERGUSE","U","_Z","_Z","_Z","_Z","_Z","ENERGY","_Z","GWH","y"]
["FINCONS","ELECTR","DATAC","GWH","E7000","ENERGUSE","DATAC","_Z","_Z","_Z","_Z","_Z","ENERGY","_Z","GWH","y"]
["FINCONS","ELECTR","TOTSER","GWH","E7000","ENERGUSE","_T","_Z","_Z","_Z","_Z","_Z","ENERGY","_Z","GWH","y"]
["FINCONS","NATGAS","C33","TJ_GCV","G3000","ENERGUSE","C33","_Z","_Z","_Z","_Z","_Z","ENERGY","_Z","TJ_GCV","y"]
["FINCONS","NATGAS","E","TJ_GCV","G3000","ENERGUSE","E","_Z","_Z","_Z","_Z","_Z","ENERGY","_Z","TJ_GCV","y"]
["FINCONS","NATGAS","E36","TJ_GCV","G3000","ENERGUSE","E36","_Z","_Z","_Z","_Z","_Z","ENERGY","_Z","TJ_GCV","y"]
["FINCONS","NATGAS","E37-E39","TJ_GCV","G3000","ENERGUSE","E37-E39","_Z","_Z","_Z","_Z","_Z","ENERGY","_Z","TJ_GCV","y"]
["FINCONS","NATGAS","E37","TJ_GCV","G3000","ENERGUSE","E37","_Z","_Z","_Z","_Z","_Z","ENERGY","_Z","TJ_GCV","y"]
["FINCONS","NATGAS","E38","TJ_GCV","G3000","ENERGUSE","E38","_Z","_Z","_Z","_Z","_Z","ENERGY","_Z","TJ_GCV","y"]
["FINCONS","NATGAS","E39","TJ_GCV","G3000","ENERGUSE","E39","_Z","_Z","_Z","_Z","_Z","ENERGY","_Z","TJ_GCV","y"]
["FINCONS","NATGAS","G","TJ_GCV","G3000","ENERGUSE","G","_Z","_Z","_Z","_Z","_Z","ENERGY","_Z","TJ_GCV","y"]
["FINCONS","NATGAS","G_HEAT","TJ_GCV","G3000","FC_OTH_CP_E_HEAT","G","_Z","_Z","_Z","_Z","_Z","ENERGY","_Z","TJ_GCV","y"]
["FINCONS","NATGAS","G_S_HEAT","TJ_GCV","G3000","FC_OTH_CP_E_SH","G","_Z","_Z","_Z","_Z","_Z","ENERGY","_Z","TJ_GCV","y"]
["FINCONS","NATGAS","G_W_HEAT","TJ_GCV","G3000","FC_OTH_CP_E_WH","G","_Z","_Z","_Z","_Z","_Z","ENERGY","_Z","TJ_GCV","y"]
["FINCONS","NATGAS","G_COOL","TJ_GCV","G3000","FC_OTH_CP_E_CL","G","_Z","_Z","_Z","_Z","_Z","ENERGY","_Z","TJ_GCV","y"]
["FINCONS","NATGAS","G_S_COOL","TJ_GCV","G3000","FC_OTH_CP_E_SC","G","_Z","_Z","_Z","_Z","_Z","ENERGY","_Z","TJ_GCV","y"]
["FINCONS","NATGAS","G_P_COOL","TJ_GCV","G3000","FC_OTH_CP_E_PC","G","_Z","_Z","_Z","_Z","_Z","ENERGY","_Z","TJ_GCV","y"]
["FINCONS","NATGAS","G_LIGHT","TJ_GCV","G3000","FC_OTH_CP_E_LOUT","G","_Z","_Z","_Z","_Z","_Z","ENERGY","_Z","TJ_GCV","y"]
["FINCONS","NATGAS","G_IN_LIGHT","TJ_GCV","G3000","FC_OTH_CP_E_LINDRE","G","_Z","_Z","_Z","_Z","_Z","ENERGY","_Z","TJ_GCV","y"]
["FINCONS","NATGAS","G_OTH_BUILD","TJ_GCV","G3000","FC_OTH_CP_E_OE_BLD","G","_Z","_Z","_Z","_Z","_Z","ENERGY","_Z","TJ_GCV","y"]
["FINCONS","NATGAS","G_OTH_NBUILD","TJ_GCV","G3000","FC_OTH_CP_E_OE_NBLD","G","_Z","_Z","_Z","_Z","_Z","ENERGY","_Z","TJ_GCV","y"]
["FINCONS","NATGAS","G45","TJ_GCV","G3000","ENERGUSE","G45","_Z","_Z","_Z","_Z","_Z","ENERGY","_Z","TJ_GCV","y"]
["FINCONS","NATGAS","G46","TJ_GCV","G3000","ENERGUSE","G46","_Z","_Z","_Z","_Z","_Z","ENERGY","_Z","TJ_GCV","y"]
["FINCONS","NATGAS","G47","TJ_GCV","G3000","ENERGUSE","G47","_Z","_Z","_Z","_Z","_Z","ENERGY","_Z","TJ_GCV","y"]
["FINCONS","NATGAS","G471","TJ_GCV","G3000","ENERGUSE","G471","_Z","_Z","_Z","_Z","_Z","ENERGY","_Z","TJ_GCV","y"]
["FINCONS","NATGAS","G47_X_G471","TJ_GCV","G3000","ENERGUSE","G47_X_G471","_Z","_Z","_Z","_Z","_Z","ENERGY","_Z","TJ_GCV","y"]
["FINCONS","NATGAS","H52","TJ_GCV","G3000","ENERGUSE","H52","_Z","_Z","_Z","_Z","_Z","ENERGY","_Z","TJ_GCV","y"]
["FINCONS","NATGAS","H52_STL","TJ_GCV","G3000","ENERGUSE","H52_STL","_Z","_Z","_Z","_Z","_Z","ENERGY","_Z","TJ_GCV","y"]
["FINCONS","NATGAS","H53","TJ_GCV","G3000","ENERGUSE","H53","_Z","_Z","_Z","_Z","_Z","ENERGY","_Z","TJ_GCV","y"]
["FINCONS","NATGAS","I","TJ_GCV","G3000","ENERGUSE","I","_Z","_Z","_Z","_Z","_Z","ENERGY","_Z","TJ_GCV","y"]
["FINCONS","NATGAS","I55","TJ_GCV","G3000","ENERGUSE","I55","_Z","_Z","_Z","_Z","_Z","ENERGY","_Z","TJ_GCV","y"]
["FINCONS","NATGAS","I55_HEAT","TJ_GCV","G3000","FC_OTH_CP_E_HEAT","I55","_Z","_Z","_Z","_Z","_Z","ENERGY","_Z","TJ_GCV","y"]
["FINCONS","NATGAS","I55_S_HEAT","TJ_GCV","G3000","FC_OTH_CP_E_SH","I55","_Z","_Z","_Z","_Z","_Z","ENERGY","_Z","TJ_GCV","y"]
["FINCONS","NATGAS","I55_W_HEAT","TJ_GCV","G3000","FC_OTH_CP_E_WH","I55","_Z","_Z","_Z","_Z","_Z","ENERGY","_Z","TJ_GCV","y"]
["FINCONS","NATGAS","I55_COOL","TJ_GCV","G3000","FC_OTH_CP_E_CL","I55","_Z","_Z","_Z","_Z","_Z","ENERGY","_Z","TJ_GCV","y"]
["FINCONS","NATGAS","I55_S_COOL","TJ_GCV","G3000","FC_OTH_CP_E_SC","I55","_Z","_Z","_Z","_Z","_Z","ENERGY","_Z","TJ_GCV","y"]
["FINCONS","NATGAS","I55_P_COOL","TJ_GCV","G3000","FC_OTH_CP_E_PC","I55","_Z","_Z","_Z","_Z","_Z","ENERGY","_Z","TJ_GCV","y"]
["FINCONS","NATGAS","I55_LIGHT","TJ_GCV","G3000","FC_OTH_CP_E_LOUT","I55","_Z","_Z","_Z","_Z","_Z","ENERGY","_Z","TJ_GCV","y"]
["FINCONS","NATGAS","I55_IN_LIGHT","TJ_GCV","G3000","FC_OTH_CP_E_LINDRE","I55","_Z","_Z","_Z","_Z","_Z","ENERGY","_Z","TJ_GCV","y"]
["FINCONS","NATGAS","I55_OTH_BUILD","TJ_GCV","G3000","FC_OTH_CP_E_OE_BLD","I55","_Z","_Z","_Z","_Z","_Z","ENERGY","_Z","TJ_GCV","y"]
["FINCONS","NATGAS","I55_OTH_NBUILD","TJ_GCV","G3000","FC_OTH_CP_E_OE_NBLD","I55","_Z","_Z","_Z","_Z","_Z","ENERGY","_Z","TJ_GCV","y"]
["FINCONS","NATGAS","I551","TJ_GCV","G3000","ENERGUSE","I551","_Z","_Z","_Z","_Z","_Z","ENERGY","_Z","TJ_GCV","y"]
["FINCONS","NATGAS","I552","TJ_GCV","G3000","ENERGUSE","I552","_Z","_Z","_Z","_Z","_Z","ENERGY","_Z","TJ_GCV","y"]
["FINCONS","NATGAS","I553","TJ_GCV","G3000","ENERGUSE","I553","_Z","_Z","_Z","_Z","_Z","ENERGY","_Z","TJ_GCV","y"]
["FINCONS","NATGAS","I559","TJ_GCV","G3000","ENERGUSE","I559","_Z","_Z","_Z","_Z","_Z","ENERGY","_Z","TJ_GCV","y"]
["FINCONS","NATGAS","I56","TJ_GCV","G3000","ENERGUSE","I56","_Z","_Z","_Z","_Z","_Z","ENERGY","_Z","TJ_GCV","y"]
["FINCONS","NATGAS","I56_HEAT","TJ_GCV","G3000","FC_OTH_CP_E_HEAT","I56","_Z","_Z","_Z","_Z","_Z","ENERGY","_Z","TJ_GCV","y"]
["FINCONS","NATGAS","I56_S_HEAT","TJ_GCV","G3000","FC_OTH_CP_E_SH","I56","_Z","_Z","_Z","_Z","_Z","ENERGY","_Z","TJ_GCV","y"]
["FINCONS","NATGAS","I56_W_HEAT","TJ_GCV","G3000","FC_OTH_CP_E_WH","I56","_Z","_Z","_Z","_Z","_Z","ENERGY","_Z","TJ_GCV","y"]
["FINCONS","NATGAS","I56_COOL","TJ_GCV","G3000","FC_OTH_CP_E_CL","I56","_Z","_Z","_Z","_Z","_Z","ENERGY","_Z","TJ_GCV","y"]
["FINCONS","NATGAS","I56_S_COOL","TJ_GCV","G3000","FC_OTH_CP_E_SC","I56","_Z","_Z","_Z","_Z","_Z","ENERGY","_Z","TJ_GCV","y"]
["FINCONS","NATGAS","I56_P_COOL","TJ_GCV","G3000","FC_OTH_CP_E_PC","I56","_Z","_Z","_Z","_Z","_Z","ENERGY","_Z","TJ_GCV","y"]
["FINCONS","NATGAS","I56_LIGHT","TJ_GCV","G3000","FC_OTH_CP_E_LOUT","I56","_Z","_Z","_Z","_Z","_Z","ENERGY","_Z","TJ_GCV","y"]
["FINCONS","NATGAS","I56_IN_LIGHT","TJ_GCV","G3000","FC_OTH_CP_E_LINDRE","I56","_Z","_Z","_Z","_Z","_Z","ENERGY","_Z","TJ_GCV","y"]
["FINCONS","NATGAS","I56_OTH_BUILD","TJ_GCV","G3000","FC_OTH_CP_E_OE_BLD","I56","_Z","_Z","_Z","_Z","_Z","ENERGY","_Z","TJ_GCV","y"]
["FINCONS","NATGAS","I56_OTH_NBUILD","TJ_GCV","G3000","FC_OTH_CP_E_OE_NBLD","I56","_Z","_Z","_Z","_Z","_Z","ENERGY","_Z","TJ_GCV","y"]
["FINCONS","NATGAS","I561","TJ_GCV","G3000","ENERGUSE","I561","_Z","_Z","_Z","_Z","_Z","ENERGY","_Z","TJ_GCV","y"]
["FINCONS","NATGAS","I562","TJ_GCV","G3000","ENERGUSE","I562","_Z","_Z","_Z","_Z","_Z","ENERGY","_Z","TJ_GCV","y"]
["FINCONS","NATGAS","I563","TJ_GCV","G3000","ENERGUSE","I563","_Z","_Z","_Z","_Z","_Z","ENERGY","_Z","TJ_GCV","y"]
["FINCONS","NATGAS","J","TJ_GCV","G3000","ENERGUSE","J","_Z","_Z","_Z","_Z","_Z","ENERGY","_Z","TJ_GCV","y"]
["FINCONS","NATGAS","J58","TJ_GCV","G3000","ENERGUSE","J58","_Z","_Z","_Z","_Z","_Z","ENERGY","_Z","TJ_GCV","y"]
["FINCONS","NATGAS","J59_J60","TJ_GCV","G3000","ENERGUSE","J59_J60","_Z","_Z","_Z","_Z","_Z","ENERGY","_Z","TJ_GCV","y"]
["FINCONS","NATGAS","J61","TJ_GCV","G3000","ENERGUSE","J61","_Z","_Z","_Z","_Z","_Z","ENERGY","_Z","TJ_GCV","y"]
["FINCONS","NATGAS","J62_J63","TJ_GCV","G3000","ENERGUSE","J62_J63","_Z","_Z","_Z","_Z","_Z","ENERGY","_Z","TJ_GCV","y"]
["FINCONS","NATGAS","J62","TJ_GCV","G3000","ENERGUSE","J62","_Z","_Z","_Z","_Z","_Z","ENERGY","_Z","TJ_GCV","y"]
["FINCONS","NATGAS","J63","TJ_GCV","G3000","ENERGUSE","J63","_Z","_Z","_Z","_Z","_Z","ENERGY","_Z","TJ_GCV","y"]
["FINCONS","NATGAS","K_L","TJ_GCV","G3000","ENERGUSE","K_L","_Z","_Z","_Z","_Z","_Z","ENERGY","_Z","TJ_GCV","y"]
["FINCONS","NATGAS","K","TJ_GCV","G3000","ENERGUSE","K","_Z","_Z","_Z","_Z","_Z","ENERGY","_Z","TJ_GCV","y"]
["FINCONS","NATGAS","L","TJ_GCV","G3000","ENERGUSE","L","_Z","_Z","_Z","_Z","_Z","ENERGY","_Z","TJ_GCV","y"]
["FINCONS","NATGAS","M_S","TJ_GCV","G3000","ENERGUSE","M_S","_Z","_Z","_Z","_Z","_Z","ENERGY","_Z","TJ_GCV","y"]
["FINCONS","NATGAS","M","TJ_GCV","G3000","ENERGUSE","M","_Z","_Z","_Z","_Z","_Z","ENERGY","_Z","TJ_GCV","y"]
["FINCONS","NATGAS","M69_M70","TJ_GCV","G3000","ENERGUSE","M69_M70","_Z","_Z","_Z","_Z","_Z","ENERGY","_Z","TJ_GCV","y"]
["FINCONS","NATGAS","M71","TJ_GCV","G3000","ENERGUSE","M71","_Z","_Z","_Z","_Z","_Z","ENERGY","_Z","TJ_GCV","y"]
["FINCONS","NATGAS","M72","TJ_GCV","G3000","ENERGUSE","M72","_Z","_Z","_Z","_Z","_Z","ENERGY","_Z","TJ_GCV","y"]
["FINCONS","NATGAS","M73","TJ_GCV","G3000","ENERGUSE","M73","_Z","_Z","_Z","_Z","_Z","ENERGY","_Z","TJ_GCV","y"]
["FINCONS","NATGAS","M74_M75","TJ_GCV","G3000","ENERGUSE","M74_M75","_Z","_Z","_Z","_Z","_Z","ENERGY","_Z","TJ_GCV","y"]
["FINCONS","NATGAS","N","TJ_GCV","G3000","ENERGUSE","N","_Z","_Z","_Z","_Z","_Z","ENERGY","_Z","TJ_GCV","y"]
["FINCONS","NATGAS","N77","TJ_GCV","G3000","ENERGUSE","N77","_Z","_Z","_Z","_Z","_Z","ENERGY","_Z","TJ_GCV","y"]
["FINCONS","NATGAS","N78","TJ_GCV","G3000","ENERGUSE","N78","_Z","_Z","_Z","_Z","_Z","ENERGY","_Z","TJ_GCV","y"]
["FINCONS","NATGAS","N79","TJ_GCV","G3000","ENERGUSE","N79","_Z","_Z","_Z","_Z","_Z","ENERGY","_Z","TJ_GCV","y"]
["FINCONS","NATGAS","N80-N82","TJ_GCV","G3000","ENERGUSE","N80-N82","_Z","_Z","_Z","_Z","_Z","ENERGY","_Z","TJ_GCV","y"]
["FINCONS","NATGAS","O","TJ_GCV","G3000","ENERGUSE","O","_Z","_Z","_Z","_Z","_Z","ENERGY","_Z","TJ_GCV","y"]
["FINCONS","NATGAS","O_HEAT","TJ_GCV","G3000","FC_OTH_CP_E_HEAT","O","_Z","_Z","_Z","_Z","_Z","ENERGY","_Z","TJ_GCV","y"]
["FINCONS","NATGAS","O_S_HEAT","TJ_GCV","G3000","FC_OTH_CP_E_SH","O","_Z","_Z","_Z","_Z","_Z","ENERGY","_Z","TJ_GCV","y"]
["FINCONS","NATGAS","O_W_HEAT","TJ_GCV","G3000","FC_OTH_CP_E_WH","O","_Z","_Z","_Z","_Z","_Z","ENERGY","_Z","TJ_GCV","y"]
["FINCONS","NATGAS","O_COOL","TJ_GCV","G3000","FC_OTH_CP_E_CL","O","_Z","_Z","_Z","_Z","_Z","ENERGY","_Z","TJ_GCV","y"]
["FINCONS","NATGAS","O_S_COOL","TJ_GCV","G3000","FC_OTH_CP_E_SC","O","_Z","_Z","_Z","_Z","_Z","ENERGY","_Z","TJ_GCV","y"]
["FINCONS","NATGAS","O_P_COOL","TJ_GCV","G3000","FC_OTH_CP_E_PC","O","_Z","_Z","_Z","_Z","_Z","ENERGY","_Z","TJ_GCV","y"]
["FINCONS","NATGAS","O_LIGHT","TJ_GCV","G3000","FC_OTH_CP_E_LOUT","O","_Z","_Z","_Z","_Z","_Z","ENERGY","_Z","TJ_GCV","y"]
["FINCONS","NATGAS","O_IN_LIGHT","TJ_GCV","G3000","FC_OTH_CP_E_LINDRE","O","_Z","_Z","_Z","_Z","_Z","ENERGY","_Z","TJ_GCV","y"]
["FINCONS","NATGAS","O_OTH_BUILD","TJ_GCV","G3000","FC_OTH_CP_E_OE_BLD","O","_Z","_Z","_Z","_Z","_Z","ENERGY","_Z","TJ_GCV","y"]
["FINCONS","NATGAS","O_OTH_NBUILD","TJ_GCV","G3000","FC_OTH_CP_E_OE_NBLD","O","_Z","_Z","_Z","_Z","_Z","ENERGY","_Z","TJ_GCV","y"]
["FINCONS","NATGAS","P","TJ_GCV","G3000","ENERGUSE","P","_Z","_Z","_Z","_Z","_Z","ENERGY","_Z","TJ_GCV","y"]
["FINCONS","NATGAS","Q","TJ_GCV","G3000","ENERGUSE","Q","_Z","_Z","_Z","_Z","_Z","ENERGY","_Z","TJ_GCV","y"]
["FINCONS","NATGAS","Q861","TJ_GCV","G3000","ENERGUSE","Q861","_Z","_Z","_Z","_Z","_Z","ENERGY","_Z","TJ_GCV","y"]
["FINCONS","NATGAS","Q861_HEAT","TJ_GCV","G3000","FC_OTH_CP_E_HEAT","Q861","_Z","_Z","_Z","_Z","_Z","ENERGY","_Z","TJ_GCV","y"]
["FINCONS","NATGAS","Q861_S_HEAT","TJ_GCV","G3000","FC_OTH_CP_E_SH","Q861","_Z","_Z","_Z","_Z","_Z","ENERGY","_Z","TJ_GCV","y"]
["FINCONS","NATGAS","Q861_W_HEAT","TJ_GCV","G3000","FC_OTH_CP_E_WH","Q861","_Z","_Z","_Z","_Z","_Z","ENERGY","_Z","TJ_GCV","y"]
["FINCONS","NATGAS","Q861_COOL","TJ_GCV","G3000","FC_OTH_CP_E_CL","Q861","_Z","_Z","_Z","_Z","_Z","ENERGY","_Z","TJ_GCV","y"]
["FINCONS","NATGAS","Q861_S_COOL","TJ_GCV","G3000","FC_OTH_CP_E_SC","Q861","_Z","_Z","_Z","_Z","_Z","ENERGY","_Z","TJ_GCV","y"]
["FINCONS","NATGAS","Q861_P_COOL","TJ_GCV","G3000","FC_OTH_CP_E_PC","Q861","_Z","_Z","_Z","_Z","_Z","ENERGY","_Z","TJ_GCV","y"]
["FINCONS","NATGAS","Q861_LIGHT","TJ_GCV","G3000","FC_OTH_CP_E_LOUT","Q861","_Z","_Z","_Z","_Z","_Z","ENERGY","_Z","TJ_GCV","y"]
["FINCONS","NATGAS","Q861_IN_LIGHT","TJ_GCV","G3000","FC_OTH_CP_E_LINDRE","Q861","_Z","_Z","_Z","_Z","_Z","ENERGY","_Z","TJ_GCV","y"]
["FINCONS","NATGAS","Q861_OTH_BUILD","TJ_GCV","G3000","FC_OTH_CP_E_OE_BLD","Q861","_Z","_Z","_Z","_Z","_Z","ENERGY","_Z","TJ_GCV","y"]
["FINCONS","NATGAS","Q861_OTH_NBUILD","TJ_GCV","G3000","FC_OTH_CP_E_OE_NBLD","Q861","_Z","_Z","_Z","_Z","_Z","ENERGY","_Z","TJ_GCV","y"]
["FINCONS","NATGAS","R","TJ_GCV","G3000","ENERGUSE","R","_Z","_Z","_Z","_Z","_Z","ENERGY","_Z","TJ_GCV","y"]
["FINCONS","NATGAS","R90-R92","TJ_GCV","G3000","ENERGUSE","R90-R92","_Z","_Z","_Z","_Z","_Z","ENERGY","_Z","TJ_GCV","y"]
["FINCONS","NATGAS","R93","TJ_GCV","G3000","ENERGUSE","R93","_Z","_Z","_Z","_Z","_Z","ENERGY","_Z","TJ_GCV","y"]
["FINCONS","NATGAS","S","TJ_GCV","G3000","ENERGUSE","S","_Z","_Z","_Z","_Z","_Z","ENERGY","_Z","TJ_GCV","y"]
["FINCONS","NATGAS","U","TJ_GCV","G3000","ENERGUSE","U","_Z","_Z","_Z","_Z","_Z","ENERGY","_Z","TJ_GCV","y"]
["FINCONS","NATGAS","DATAC","TJ_GCV","G3000","ENERGUSE","DATAC","_Z","_Z","_Z","_Z","_Z","ENERGY","_Z","TJ_GCV","y"]
["FINCONS","NATGAS","TOTSER","TJ_GCV","G3000","ENERGUSE","_T","_Z","_Z","_Z","_Z","_Z","ENERGY","_Z","TJ_GCV","y"]
["FINCONS","TOTALOIL","C33","KT","O4000","ENERGUSE","C33","_Z","_Z","_Z","_Z","_Z","WEIGHT","_Z","KT","y"]
["FINCONS","TOTALOIL","E","KT","O4000","ENERGUSE","E","_Z","_Z","_Z","_Z","_Z","WEIGHT","_Z","KT","y"]
["FINCONS","TOTALOIL","E36","KT","O4000","ENERGUSE","E36","_Z","_Z","_Z","_Z","_Z","WEIGHT","_Z","KT","y"]
["FINCONS","TOTALOIL","E37-E39","KT","O4000","ENERGUSE","E37-E39","_Z","_Z","_Z","_Z","_Z","WEIGHT","_Z","KT","y"]
["FINCONS","TOTALOIL","E37","KT","O4000","ENERGUSE","E37","_Z","_Z","_Z","_Z","_Z","WEIGHT","_Z","KT","y"]
["FINCONS","TOTALOIL","E38","KT","O4000","ENERGUSE","E38","_Z","_Z","_Z","_Z","_Z","WEIGHT","_Z","KT","y"]
["FINCONS","TOTALOIL","E39","KT","O4000","ENERGUSE","E39","_Z","_Z","_Z","_Z","_Z","WEIGHT","_Z","KT","y"]
["FINCONS","TOTALOIL","G","KT","O4000","ENERGUSE","G","_Z","_Z","_Z","_Z","_Z","WEIGHT","_Z","KT","y"]
["FINCONS","TOTALOIL","G_HEAT","KT","O4000","FC_OTH_CP_E_HEAT","G","_Z","_Z","_Z","_Z","_Z","WEIGHT","_Z","KT","y"]
["FINCONS","TOTALOIL","G_S_HEAT","KT","O4000","FC_OTH_CP_E_SH","G","_Z","_Z","_Z","_Z","_Z","WEIGHT","_Z","KT","y"]
["FINCONS","TOTALOIL","G_W_HEAT","KT","O4000","FC_OTH_CP_E_WH","G","_Z","_Z","_Z","_Z","_Z","WEIGHT","_Z","KT","y"]
["FINCONS","TOTALOIL","G_COOL","KT","O4000","FC_OTH_CP_E_CL","G","_Z","_Z","_Z","_Z","_Z","WEIGHT","_Z","KT","y"]
["FINCONS","TOTALOIL","G_S_COOL","KT","O4000","FC_OTH_CP_E_SC","G","_Z","_Z","_Z","_Z","_Z","WEIGHT","_Z","KT","y"]
["FINCONS","TOTALOIL","G_P_COOL","KT","O4000","FC_OTH_CP_E_PC","G","_Z","_Z","_Z","_Z","_Z","WEIGHT","_Z","KT","y"]
["FINCONS","TOTALOIL","G_LIGHT","KT","O4000","FC_OTH_CP_E_LOUT","G","_Z","_Z","_Z","_Z","_Z","WEIGHT","_Z","KT","y"]
["FINCONS","TOTALOIL","G_IN_LIGHT","KT","O4000","FC_OTH_CP_E_LINDRE","G","_Z","_Z","_Z","_Z","_Z","WEIGHT","_Z","KT","y"]
["FINCONS","TOTALOIL","G_OTH_BUILD","KT","O4000","FC_OTH_CP_E_OE_BLD","G","_Z","_Z","_Z","_Z","_Z","WEIGHT","_Z","KT","y"]
["FINCONS","TOTALOIL","G_OTH_NBUILD","KT","O4000","FC_OTH_CP_E_OE_NBLD","G","_Z","_Z","_Z","_Z","_Z","WEIGHT","_Z","KT","y"]
["FINCONS","TOTALOIL","G45","KT","O4000","ENERGUSE","G45","_Z","_Z","_Z","_Z","_Z","WEIGHT","_Z","KT","y"]
["FINCONS","TOTALOIL","G46","KT","O4000","ENERGUSE","G46","_Z","_Z","_Z","_Z","_Z","WEIGHT","_Z","KT","y"]
["FINCONS","TOTALOIL","G47","KT","O4000","ENERGUSE","G47","_Z","_Z","_Z","_Z","_Z","WEIGHT","_Z","KT","y"]
["FINCONS","TOTALOIL","G471","KT","O4000","ENERGUSE","G471","_Z","_Z","_Z","_Z","_Z","WEIGHT","_Z","KT","y"]
["FINCONS","TOTALOIL","G47_X_G471","KT","O4000","ENERGUSE","G47_X_G471","_Z","_Z","_Z","_Z","_Z","WEIGHT","_Z","KT","y"]
["FINCONS","TOTALOIL","H52","KT","O4000","ENERGUSE","H52","_Z","_Z","_Z","_Z","_Z","WEIGHT","_Z","KT","y"]
["FINCONS","TOTALOIL","H52_STL","KT","O4000","ENERGUSE","H52_STL","_Z","_Z","_Z","_Z","_Z","WEIGHT","_Z","KT","y"]
["FINCONS","TOTALOIL","H53","KT","O4000","ENERGUSE","H53","_Z","_Z","_Z","_Z","_Z","WEIGHT","_Z","KT","y"]
["FINCONS","TOTALOIL","I","KT","O4000","ENERGUSE","I","_Z","_Z","_Z","_Z","_Z","WEIGHT","_Z","KT","y"]
["FINCONS","TOTALOIL","I55","KT","O4000","ENERGUSE","I55","_Z","_Z","_Z","_Z","_Z","WEIGHT","_Z","KT","y"]
["FINCONS","TOTALOIL","I55_HEAT","KT","O4000","FC_OTH_CP_E_HEAT","I55","_Z","_Z","_Z","_Z","_Z","WEIGHT","_Z","KT","y"]
["FINCONS","TOTALOIL","I55_S_HEAT","KT","O4000","FC_OTH_CP_E_SH","I55","_Z","_Z","_Z","_Z","_Z","WEIGHT","_Z","KT","y"]
["FINCONS","TOTALOIL","I55_W_HEAT","KT","O4000","FC_OTH_CP_E_WH","I55","_Z","_Z","_Z","_Z","_Z","WEIGHT","_Z","KT","y"]
["FINCONS","TOTALOIL","I55_COOL","KT","O4000","FC_OTH_CP_E_CL","I55","_Z","_Z","_Z","_Z","_Z","WEIGHT","_Z","KT","y"]
["FINCONS","TOTALOIL","I55_S_COOL","KT","O4000","FC_OTH_CP_E_SC","I55","_Z","_Z","_Z","_Z","_Z","WEIGHT","_Z","KT","y"]
["FINCONS","TOTALOIL","I55_P_COOL","KT","O4000","FC_OTH_CP_E_PC","I55","_Z","_Z","_Z","_Z","_Z","WEIGHT","_Z","KT","y"]
["FINCONS","TOTALOIL","I55_LIGHT","KT","O4000","FC_OTH_CP_E_LOUT","I55","_Z","_Z","_Z","_Z","_Z","WEIGHT","_Z","KT","y"]
["FINCONS","TOTALOIL","I55_IN_LIGHT","KT","O4000","FC_OTH_CP_E_LINDRE","I55","_Z","_Z","_Z","_Z","_Z","WEIGHT","_Z","KT","y"]
["FINCONS","TOTALOIL","I55_OTH_BUILD","KT","O4000","FC_OTH_CP_E_OE_BLD","I55","_Z","_Z","_Z","_Z","_Z","WEIGHT","_Z","KT","y"]
["FINCONS","TOTALOIL","I55_OTH_NBUILD","KT","O4000","FC_OTH_CP_E_OE_NBLD","I55","_Z","_Z","_Z","_Z","_Z","WEIGHT","_Z","KT","y"]
["FINCONS","TOTALOIL","I551","KT","O4000","ENERGUSE","I551","_Z","_Z","_Z","_Z","_Z","WEIGHT","_Z","KT","y"]
["FINCONS","TOTALOIL","I552","KT","O4000","ENERGUSE","I552","_Z","_Z","_Z","_Z","_Z","WEIGHT","_Z","KT","y"]
["FINCONS","TOTALOIL","I553","KT","O4000","ENERGUSE","I553","_Z","_Z","_Z","_Z","_Z","WEIGHT","_Z","KT","y"]
["FINCONS","TOTALOIL","I559","KT","O4000","ENERGUSE","I559","_Z","_Z","_Z","_Z","_Z","WEIGHT","_Z","KT","y"]
["FINCONS","TOTALOIL","I56","KT","O4000","ENERGUSE","I56","_Z","_Z","_Z","_Z","_Z","WEIGHT","_Z","KT","y"]
["FINCONS","TOTALOIL","I56_HEAT","KT","O4000","FC_OTH_CP_E_HEAT","I56","_Z","_Z","_Z","_Z","_Z","WEIGHT","_Z","KT","y"]
["FINCONS","TOTALOIL","I56_S_HEAT","KT","O4000","FC_OTH_CP_E_SH","I56","_Z","_Z","_Z","_Z","_Z","WEIGHT","_Z","KT","y"]
["FINCONS","TOTALOIL","I56_W_HEAT","KT","O4000","FC_OTH_CP_E_WH","I56","_Z","_Z","_Z","_Z","_Z","WEIGHT","_Z","KT","y"]
["FINCONS","TOTALOIL","I56_COOL","KT","O4000","FC_OTH_CP_E_CL","I56","_Z","_Z","_Z","_Z","_Z","WEIGHT","_Z","KT","y"]
["FINCONS","TOTALOIL","I56_S_COOL","KT","O4000","FC_OTH_CP_E_SC","I56","_Z","_Z","_Z","_Z","_Z","WEIGHT","_Z","KT","y"]
["FINCONS","TOTALOIL","I56_P_COOL","KT","O4000","FC_OTH_CP_E_PC","I56","_Z","_Z","_Z","_Z","_Z","WEIGHT","_Z","KT","y"]
["FINCONS","TOTALOIL","I56_LIGHT","KT","O4000","FC_OTH_CP_E_LOUT","I56","_Z","_Z","_Z","_Z","_Z","WEIGHT","_Z","KT","y"]
["FINCONS","TOTALOIL","I56_IN_LIGHT","KT","O4000","FC_OTH_CP_E_LINDRE","I56","_Z","_Z","_Z","_Z","_Z","WEIGHT","_Z","KT","y"]
["FINCONS","TOTALOIL","I56_OTH_BUILD","KT","O4000","FC_OTH_CP_E_OE_BLD","I56","_Z","_Z","_Z","_Z","_Z","WEIGHT","_Z","KT","y"]
["FINCONS","TOTALOIL","I56_OTH_NBUILD","KT","O4000","FC_OTH_CP_E_OE_NBLD","I56","_Z","_Z","_Z","_Z","_Z","WEIGHT","_Z","KT","y"]
["FINCONS","TOTALOIL","I561","KT","O4000","ENERGUSE","I561","_Z","_Z","_Z","_Z","_Z","WEIGHT","_Z","KT","y"]
["FINCONS","TOTALOIL","I562","KT","O4000","ENERGUSE","I562","_Z","_Z","_Z","_Z","_Z","WEIGHT","_Z","KT","y"]
["FINCONS","TOTALOIL","I563","KT","O4000","ENERGUSE","I563","_Z","_Z","_Z","_Z","_Z","WEIGHT","_Z","KT","y"]
["FINCONS","TOTALOIL","J","KT","O4000","ENERGUSE","J","_Z","_Z","_Z","_Z","_Z","WEIGHT","_Z","KT","y"]
["FINCONS","TOTALOIL","J58","KT","O4000","ENERGUSE","J58","_Z","_Z","_Z","_Z","_Z","WEIGHT","_Z","KT","y"]
["FINCONS","TOTALOIL","J59_J60","KT","O4000","ENERGUSE","J59_J60","_Z","_Z","_Z","_Z","_Z","WEIGHT","_Z","KT","y"]
["FINCONS","TOTALOIL","J61","KT","O4000","ENERGUSE","J61","_Z","_Z","_Z","_Z","_Z","WEIGHT","_Z","KT","y"]
["FINCONS","TOTALOIL","J62_J63","KT","O4000","ENERGUSE","J62_J63","_Z","_Z","_Z","_Z","_Z","WEIGHT","_Z","KT","y"]
["FINCONS","TOTALOIL","J62","KT","O4000","ENERGUSE","J62","_Z","_Z","_Z","_Z","_Z","WEIGHT","_Z","KT","y"]
["FINCONS","TOTALOIL","J63","KT","O4000","ENERGUSE","J63","_Z","_Z","_Z","_Z","_Z","WEIGHT","_Z","KT","y"]
["FINCONS","TOTALOIL","K_L","KT","O4000","ENERGUSE","K_L","_Z","_Z","_Z","_Z","_Z","WEIGHT","_Z","KT","y"]
["FINCONS","TOTALOIL","K","KT","O4000","ENERGUSE","K","_Z","_Z","_Z","_Z","_Z","WEIGHT","_Z","KT","y"]
["FINCONS","TOTALOIL","L","KT","O4000","ENERGUSE","L","_Z","_Z","_Z","_Z","_Z","WEIGHT","_Z","KT","y"]
["FINCONS","TOTALOIL","M_S","KT","O4000","ENERGUSE","M_S","_Z","_Z","_Z","_Z","_Z","WEIGHT","_Z","KT","y"]
["FINCONS","TOTALOIL","M","KT","O4000","ENERGUSE","M","_Z","_Z","_Z","_Z","_Z","WEIGHT","_Z","KT","y"]
["FINCONS","TOTALOIL","M69_M70","KT","O4000","ENERGUSE","M69_M70","_Z","_Z","_Z","_Z","_Z","WEIGHT","_Z","KT","y"]
["FINCONS","TOTALOIL","M71","KT","O4000","ENERGUSE","M71","_Z","_Z","_Z","_Z","_Z","WEIGHT","_Z","KT","y"]
["FINCONS","TOTALOIL","M72","KT","O4000","ENERGUSE","M72","_Z","_Z","_Z","_Z","_Z","WEIGHT","_Z","KT","y"]
["FINCONS","TOTALOIL","M73","KT","O4000","ENERGUSE","M73","_Z","_Z","_Z","_Z","_Z","WEIGHT","_Z","KT","y"]
["FINCONS","TOTALOIL","M74_M75","KT","O4000","ENERGUSE","M74_M75","_Z","_Z","_Z","_Z","_Z","WEIGHT","_Z","KT","y"]
["FINCONS","TOTALOIL","N","KT","O4000","ENERGUSE","N","_Z","_Z","_Z","_Z","_Z","WEIGHT","_Z","KT","y"]
["FINCONS","TOTALOIL","N77","KT","O4000","ENERGUSE","N77","_Z","_Z","_Z","_Z","_Z","WEIGHT","_Z","KT","y"]
["FINCONS","TOTALOIL","N78","KT","O4000","ENERGUSE","N78","_Z","_Z","_Z","_Z","_Z","WEIGHT","_Z","KT","y"]
["FINCONS","TOTALOIL","N79","KT","O4000","ENERGUSE","N79","_Z","_Z","_Z","_Z","_Z","WEIGHT","_Z","KT","y"]
["FINCONS","TOTALOIL","N80-N82","KT","O4000","ENERGUSE","N80-N82","_Z","_Z","_Z","_Z","_Z","WEIGHT","_Z","KT","y"]
["FINCONS","TOTALOIL","O","KT","O4000","ENERGUSE","O","_Z","_Z","_Z","_Z","_Z","WEIGHT","_Z","KT","y"]
["FINCONS","TOTALOIL","O_HEAT","KT","O4000","FC_OTH_CP_E_HEAT","O","_Z","_Z","_Z","_Z","_Z","WEIGHT","_Z","KT","y"]
["FINCONS","TOTALOIL","O_S_HEAT","KT","O4000","FC_OTH_CP_E_SH","O","_Z","_Z","_Z","_Z","_Z","WEIGHT","_Z","KT","y"]
["FINCONS","TOTALOIL","O_W_HEAT","KT","O4000","FC_OTH_CP_E_WH","O","_Z","_Z","_Z","_Z","_Z","WEIGHT","_Z","KT","y"]
["FINCONS","TOTALOIL","O_COOL","KT","O4000","FC_OTH_CP_E_CL","O","_Z","_Z","_Z","_Z","_Z","WEIGHT","_Z","KT","y"]
["FINCONS","TOTALOIL","O_S_COOL","KT","O4000","FC_OTH_CP_E_SC","O","_Z","_Z","_Z","_Z","_Z","WEIGHT","_Z","KT","y"]
["FINCONS","TOTALOIL","O_P_COOL","KT","O4000","FC_OTH_CP_E_PC","O","_Z","_Z","_Z","_Z","_Z","WEIGHT","_Z","KT","y"]
["FINCONS","TOTALOIL","O_LIGHT","KT","O4000","FC_OTH_CP_E_LOUT","O","_Z","_Z","_Z","_Z","_Z","WEIGHT","_Z","KT","y"]
["FINCONS","TOTALOIL","O_IN_LIGHT","KT","O4000","FC_OTH_CP_E_LINDRE","O","_Z","_Z","_Z","_Z","_Z","WEIGHT","_Z","KT","y"]
["FINCONS","TOTALOIL","O_OTH_BUILD","KT","O4000","FC_OTH_CP_E_OE_BLD","O","_Z","_Z","_Z","_Z","_Z","WEIGHT","_Z","KT","y"]
["FINCONS","TOTALOIL","O_OTH_NBUILD","KT","O4000","FC_OTH_CP_E_OE_NBLD","O","_Z","_Z","_Z","_Z","_Z","WEIGHT","_Z","KT","y"]
["FINCONS","TOTALOIL","P","KT","O4000","ENERGUSE","P","_Z","_Z","_Z","_Z","_Z","WEIGHT","_Z","KT","y"]
["FINCONS","TOTALOIL","Q","KT","O4000","ENERGUSE","Q","_Z","_Z","_Z","_Z","_Z","WEIGHT","_Z","KT","y"]
["FINCONS","TOTALOIL","Q861","KT","O4000","ENERGUSE","Q861","_Z","_Z","_Z","_Z","_Z","WEIGHT","_Z","KT","y"]
["FINCONS","TOTALOIL","Q861_HEAT","KT","O4000","FC_OTH_CP_E_HEAT","Q861","_Z","_Z","_Z","_Z","_Z","WEIGHT","_Z","KT","y"]
["FINCONS","TOTALOIL","Q861_S_HEAT","KT","O4000","FC_OTH_CP_E_SH","Q861","_Z","_Z","_Z","_Z","_Z","WEIGHT","_Z","KT","y"]
["FINCONS","TOTALOIL","Q861_W_HEAT","KT","O4000","FC_OTH_CP_E_WH","Q861","_Z","_Z","_Z","_Z","_Z","WEIGHT","_Z","KT","y"]
["FINCONS","TOTALOIL","Q861_COOL","KT","O4000","FC_OTH_CP_E_CL","Q861","_Z","_Z","_Z","_Z","_Z","WEIGHT","_Z","KT","y"]
["FINCONS","TOTALOIL","Q861_S_COOL","KT","O4000","FC_OTH_CP_E_SC","Q861","_Z","_Z","_Z","_Z","_Z","WEIGHT","_Z","KT","y"]
["FINCONS","TOTALOIL","Q861_P_COOL","KT","O4000","FC_OTH_CP_E_PC","Q861","_Z","_Z","_Z","_Z","_Z","WEIGHT","_Z","KT","y"]
["FINCONS","TOTALOIL","Q861_LIGHT","KT","O4000","FC_OTH_CP_E_LOUT","Q861","_Z","_Z","_Z","_Z","_Z","WEIGHT","_Z","KT","y"]
["FINCONS","TOTALOIL","Q861_IN_LIGHT","KT","O4000","FC_OTH_CP_E_LINDRE","Q861","_Z","_Z","_Z","_Z","_Z","WEIGHT","_Z","KT","y"]
["FINCONS","TOTALOIL","Q861_OTH_BUILD","KT","O4000","FC_OTH_CP_E_OE_BLD","Q861","_Z","_Z","_Z","_Z","_Z","WEIGHT","_Z","KT","y"]
["FINCONS","TOTALOIL","Q861_OTH_NBUILD","KT","O4000","FC_OTH_CP_E_OE_NBLD","Q861","_Z","_Z","_Z","_Z","_Z","WEIGHT","_Z","KT","y"]
["FINCONS","TOTALOIL","R","KT","O4000","ENERGUSE","R","_Z","_Z","_Z","_Z","_Z","WEIGHT","_Z","KT","y"]
["FINCONS","TOTALOIL","R90-R92","KT","O4000","ENERGUSE","R90-R92","_Z","_Z","_Z","_Z","_Z","WEIGHT","_Z","KT","y"]
["FINCONS","TOTALOIL","R93","KT","O4000","ENERGUSE","R93","_Z","_Z","_Z","_Z","_Z","WEIGHT","_Z","KT","y"]
["FINCONS","TOTALOIL","S","KT","O4000","ENERGUSE","S","_Z","_Z","_Z","_Z","_Z","WEIGHT","_Z","KT","y"]
["FINCONS","TOTALOIL","U","KT","O4000","ENERGUSE","U","_Z","_Z","_Z","_Z","_Z","WEIGHT","_Z","KT","y"]
["FINCONS","TOTALOIL","DATAC","KT","O4000","ENERGUSE","DATAC","_Z","_Z","_Z","_Z","_Z","WEIGHT","_Z","KT","y"]
["FINCONS","TOTALOIL","TOTSER","KT","O4000","ENERGUSE","_T","_Z","_Z","_Z","_Z","_Z","WEIGHT","_Z","KT","y"]
["FINCONS","LPG","C33","KT","O4630","ENERGUSE","C33","_Z","_Z","_Z","_Z","_Z","WEIGHT","_Z","KT","y"]
["FINCONS","LPG","E","KT","O4630","ENERGUSE","E","_Z","_Z","_Z","_Z","_Z","WEIGHT","_Z","KT","y"]
["FINCONS","LPG","E36","KT","O4630","ENERGUSE","E36","_Z","_Z","_Z","_Z","_Z","WEIGHT","_Z","KT","y"]
["FINCONS","LPG","E37-E39","KT","O4630","ENERGUSE","E37-E39","_Z","_Z","_Z","_Z","_Z","WEIGHT","_Z","KT","y"]
["FINCONS","LPG","E37","KT","O4630","ENERGUSE","E37","_Z","_Z","_Z","_Z","_Z","WEIGHT","_Z","KT","y"]
["FINCONS","LPG","E38","KT","O4630","ENERGUSE","E38","_Z","_Z","_Z","_Z","_Z","WEIGHT","_Z","KT","y"]
["FINCONS","LPG","E39","KT","O4630","ENERGUSE","E39","_Z","_Z","_Z","_Z","_Z","WEIGHT","_Z","KT","y"]
["FINCONS","LPG","G","KT","O4630","ENERGUSE","G","_Z","_Z","_Z","_Z","_Z","WEIGHT","_Z","KT","y"]
["FINCONS","LPG","G_HEAT","KT","O4630","FC_OTH_CP_E_HEAT","G","_Z","_Z","_Z","_Z","_Z","WEIGHT","_Z","KT","y"]
["FINCONS","LPG","G_S_HEAT","KT","O4630","FC_OTH_CP_E_SH","G","_Z","_Z","_Z","_Z","_Z","WEIGHT","_Z","KT","y"]
["FINCONS","LPG","G_W_HEAT","KT","O4630","FC_OTH_CP_E_WH","G","_Z","_Z","_Z","_Z","_Z","WEIGHT","_Z","KT","y"]
["FINCONS","LPG","G_COOL","KT","O4630","FC_OTH_CP_E_CL","G","_Z","_Z","_Z","_Z","_Z","WEIGHT","_Z","KT","y"]
["FINCONS","LPG","G_S_COOL","KT","O4630","FC_OTH_CP_E_SC","G","_Z","_Z","_Z","_Z","_Z","WEIGHT","_Z","KT","y"]
["FINCONS","LPG","G_P_COOL","KT","O4630","FC_OTH_CP_E_PC","G","_Z","_Z","_Z","_Z","_Z","WEIGHT","_Z","KT","y"]
["FINCONS","LPG","G_LIGHT","KT","O4630","FC_OTH_CP_E_LOUT","G","_Z","_Z","_Z","_Z","_Z","WEIGHT","_Z","KT","y"]
["FINCONS","LPG","G_IN_LIGHT","KT","O4630","FC_OTH_CP_E_LINDRE","G","_Z","_Z","_Z","_Z","_Z","WEIGHT","_Z","KT","y"]
["FINCONS","LPG","G_OTH_BUILD","KT","O4630","FC_OTH_CP_E_OE_BLD","G","_Z","_Z","_Z","_Z","_Z","WEIGHT","_Z","KT","y"]
["FINCONS","LPG","G_OTH_NBUILD","KT","O4630","FC_OTH_CP_E_OE_NBLD","G","_Z","_Z","_Z","_Z","_Z","WEIGHT","_Z","KT","y"]
["FINCONS","LPG","G45","KT","O4630","ENERGUSE","G45","_Z","_Z","_Z","_Z","_Z","WEIGHT","_Z","KT","y"]
["FINCONS","LPG","G46","KT","O4630","ENERGUSE","G46","_Z","_Z","_Z","_Z","_Z","WEIGHT","_Z","KT","y"]
["FINCONS","LPG","G47","KT","O4630","ENERGUSE","G47","_Z","_Z","_Z","_Z","_Z","WEIGHT","_Z","KT","y"]
["FINCONS","LPG","G471","KT","O4630","ENERGUSE","G471","_Z","_Z","_Z","_Z","_Z","WEIGHT","_Z","KT","y"]
["FINCONS","LPG","G47_X_G471","KT","O4630","ENERGUSE","G47_X_G471","_Z","_Z","_Z","_Z","_Z","WEIGHT","_Z","KT","y"]
["FINCONS","LPG","H52","KT","O4630","ENERGUSE","H52","_Z","_Z","_Z","_Z","_Z","WEIGHT","_Z","KT","y"]
["FINCONS","LPG","H52_STL","KT","O4630","ENERGUSE","H52_STL","_Z","_Z","_Z","_Z","_Z","WEIGHT","_Z","KT","y"]
["FINCONS","LPG","H53","KT","O4630","ENERGUSE","H53","_Z","_Z","_Z","_Z","_Z","WEIGHT","_Z","KT","y"]
["FINCONS","LPG","I","KT","O4630","ENERGUSE","I","_Z","_Z","_Z","_Z","_Z","WEIGHT","_Z","KT","y"]
["FINCONS","LPG","I55","KT","O4630","ENERGUSE","I55","_Z","_Z","_Z","_Z","_Z","WEIGHT","_Z","KT","y"]
["FINCONS","LPG","I55_HEAT","KT","O4630","FC_OTH_CP_E_HEAT","I55","_Z","_Z","_Z","_Z","_Z","WEIGHT","_Z","KT","y"]
["FINCONS","LPG","I55_S_HEAT","KT","O4630","FC_OTH_CP_E_SH","I55","_Z","_Z","_Z","_Z","_Z","WEIGHT","_Z","KT","y"]
["FINCONS","LPG","I55_W_HEAT","KT","O4630","FC_OTH_CP_E_WH","I55","_Z","_Z","_Z","_Z","_Z","WEIGHT","_Z","KT","y"]
["FINCONS","LPG","I55_COOL","KT","O4630","FC_OTH_CP_E_CL","I55","_Z","_Z","_Z","_Z","_Z","WEIGHT","_Z","KT","y"]
["FINCONS","LPG","I55_S_COOL","KT","O4630","FC_OTH_CP_E_SC","I55","_Z","_Z","_Z","_Z","_Z","WEIGHT","_Z","KT","y"]
["FINCONS","LPG","I55_P_COOL","KT","O4630","FC_OTH_CP_E_PC","I55","_Z","_Z","_Z","_Z","_Z","WEIGHT","_Z","KT","y"]
["FINCONS","LPG","I55_LIGHT","KT","O4630","FC_OTH_CP_E_LOUT","I55","_Z","_Z","_Z","_Z","_Z","WEIGHT","_Z","KT","y"]
["FINCONS","LPG","I55_IN_LIGHT","KT","O4630","FC_OTH_CP_E_LINDRE","I55","_Z","_Z","_Z","_Z","_Z","WEIGHT","_Z","KT","y"]
["FINCONS","LPG","I55_OTH_BUILD","KT","O4630","FC_OTH_CP_E_OE_BLD","I55","_Z","_Z","_Z","_Z","_Z","WEIGHT","_Z","KT","y"]
["FINCONS","LPG","I55_OTH_NBUILD","KT","O4630","FC_OTH_CP_E_OE_NBLD","I55","_Z","_Z","_Z","_Z","_Z","WEIGHT","_Z","KT","y"]
["FINCONS","LPG","I551","KT","O4630","ENERGUSE","I551","_Z","_Z","_Z","_Z","_Z","WEIGHT","_Z","KT","y"]
["FINCONS","LPG","I552","KT","O4630","ENERGUSE","I552","_Z","_Z","_Z","_Z","_Z","WEIGHT","_Z","KT","y"]
["FINCONS","LPG","I553","KT","O4630","ENERGUSE","I553","_Z","_Z","_Z","_Z","_Z","WEIGHT","_Z","KT","y"]
["FINCONS","LPG","I559","KT","O4630","ENERGUSE","I559","_Z","_Z","_Z","_Z","_Z","WEIGHT","_Z","KT","y"]
["FINCONS","LPG","I56","KT","O4630","ENERGUSE","I56","_Z","_Z","_Z","_Z","_Z","WEIGHT","_Z","KT","y"]
["FINCONS","LPG","I56_HEAT","KT","O4630","FC_OTH_CP_E_HEAT","I56","_Z","_Z","_Z","_Z","_Z","WEIGHT","_Z","KT","y"]
["FINCONS","LPG","I56_S_HEAT","KT","O4630","FC_OTH_CP_E_SH","I56","_Z","_Z","_Z","_Z","_Z","WEIGHT","_Z","KT","y"]
["FINCONS","LPG","I56_W_HEAT","KT","O4630","FC_OTH_CP_E_WH","I56","_Z","_Z","_Z","_Z","_Z","WEIGHT","_Z","KT","y"]
["FINCONS","LPG","I56_COOL","KT","O4630","FC_OTH_CP_E_CL","I56","_Z","_Z","_Z","_Z","_Z","WEIGHT","_Z","KT","y"]
["FINCONS","LPG","I56_S_COOL","KT","O4630","FC_OTH_CP_E_SC","I56","_Z","_Z","_Z","_Z","_Z","WEIGHT","_Z","KT","y"]
["FINCONS","LPG","I56_P_COOL","KT","O4630","FC_OTH_CP_E_PC","I56","_Z","_Z","_Z","_Z","_Z","WEIGHT","_Z","KT","y"]
["FINCONS","LPG","I56_LIGHT","KT","O4630","FC_OTH_CP_E_LOUT","I56","_Z","_Z","_Z","_Z","_Z","WEIGHT","_Z","KT","y"]
["FINCONS","LPG","I56_IN_LIGHT","KT","O4630","FC_OTH_CP_E_LINDRE","I56","_Z","_Z","_Z","_Z","_Z","WEIGHT","_Z","KT","y"]
["FINCONS","LPG","I56_OTH_BUILD","KT","O4630","FC_OTH_CP_E_OE_BLD","I56","_Z","_Z","_Z","_Z","_Z","WEIGHT","_Z","KT","y"]
["FINCONS","LPG","I56_OTH_NBUILD","KT","O4630","FC_OTH_CP_E_OE_NBLD","I56","_Z","_Z","_Z","_Z","_Z","WEIGHT","_Z","KT","y"]
["FINCONS","LPG","I561","KT","O4630","ENERGUSE","I561","_Z","_Z","_Z","_Z","_Z","WEIGHT","_Z","KT","y"]
["FINCONS","LPG","I562","KT","O4630","ENERGUSE","I562","_Z","_Z","_Z","_Z","_Z","WEIGHT","_Z","KT","y"]
["FINCONS","LPG","I563","KT","O4630","ENERGUSE","I563","_Z","_Z","_Z","_Z","_Z","WEIGHT","_Z","KT","y"]
["FINCONS","LPG","J","KT","O4630","ENERGUSE","J","_Z","_Z","_Z","_Z","_Z","WEIGHT","_Z","KT","y"]
["FINCONS","LPG","J58","KT","O4630","ENERGUSE","J58","_Z","_Z","_Z","_Z","_Z","WEIGHT","_Z","KT","y"]
["FINCONS","LPG","J59_J60","KT","O4630","ENERGUSE","J59_J60","_Z","_Z","_Z","_Z","_Z","WEIGHT","_Z","KT","y"]
["FINCONS","LPG","J61","KT","O4630","ENERGUSE","J61","_Z","_Z","_Z","_Z","_Z","WEIGHT","_Z","KT","y"]
["FINCONS","LPG","J62_J63","KT","O4630","ENERGUSE","J62_J63","_Z","_Z","_Z","_Z","_Z","WEIGHT","_Z","KT","y"]
["FINCONS","LPG","J62","KT","O4630","ENERGUSE","J62","_Z","_Z","_Z","_Z","_Z","WEIGHT","_Z","KT","y"]
["FINCONS","LPG","J63","KT","O4630","ENERGUSE","J63","_Z","_Z","_Z","_Z","_Z","WEIGHT","_Z","KT","y"]
["FINCONS","LPG","K_L","KT","O4630","ENERGUSE","K_L","_Z","_Z","_Z","_Z","_Z","WEIGHT","_Z","KT","y"]
["FINCONS","LPG","K","KT","O4630","ENERGUSE","K","_Z","_Z","_Z","_Z","_Z","WEIGHT","_Z","KT","y"]
["FINCONS","LPG","L","KT","O4630","ENERGUSE","L","_Z","_Z","_Z","_Z","_Z","WEIGHT","_Z","KT","y"]
["FINCONS","LPG","M_S","KT","O4630","ENERGUSE","M_S","_Z","_Z","_Z","_Z","_Z","WEIGHT","_Z","KT","y"]
["FINCONS","LPG","M","KT","O4630","ENERGUSE","M","_Z","_Z","_Z","_Z","_Z","WEIGHT","_Z","KT","y"]
["FINCONS","LPG","M69_M70","KT","O4630","ENERGUSE","M69_M70","_Z","_Z","_Z","_Z","_Z","WEIGHT","_Z","KT","y"]
["FINCONS","LPG","M71","KT","O4630","ENERGUSE","M71","_Z","_Z","_Z","_Z","_Z","WEIGHT","_Z","KT","y"]
["FINCONS","LPG","M72","KT","O4630","ENERGUSE","M72","_Z","_Z","_Z","_Z","_Z","WEIGHT","_Z","KT","y"]
["FINCONS","LPG","M73","KT","O4630","ENERGUSE","M73","_Z","_Z","_Z","_Z","_Z","WEIGHT","_Z","KT","y"]
["FINCONS","LPG","M74_M75","KT","O4630","ENERGUSE","M74_M75","_Z","_Z","_Z","_Z","_Z","WEIGHT","_Z","KT","y"]
["FINCONS","LPG","N","KT","O4630","ENERGUSE","N","_Z","_Z","_Z","_Z","_Z","WEIGHT","_Z","KT","y"]
["FINCONS","LPG","N77","KT","O4630","ENERGUSE","N77","_Z","_Z","_Z","_Z","_Z","WEIGHT","_Z","KT","y"]
["FINCONS","LPG","N78","KT","O4630","ENERGUSE","N78","_Z","_Z","_Z","_Z","_Z","WEIGHT","_Z","KT","y"]
["FINCONS","LPG","N79","KT","O4630","ENERGUSE","N79","_Z","_Z","_Z","_Z","_Z","WEIGHT","_Z","KT","y"]
["FINCONS","LPG","N80-N82","KT","O4630","ENERGUSE","N80-N82","_Z","_Z","_Z","_Z","_Z","WEIGHT","_Z","KT","y"]
["FINCONS","LPG","O","KT","O4630","ENERGUSE","O","_Z","_Z","_Z","_Z","_Z","WEIGHT","_Z","KT","y"]
["FINCONS","LPG","O_HEAT","KT","O4630","FC_OTH_CP_E_HEAT","O","_Z","_Z","_Z","_Z","_Z","WEIGHT","_Z","KT","y"]
["FINCONS","LPG","O_S_HEAT","KT","O4630","FC_OTH_CP_E_SH","O","_Z","_Z","_Z","_Z","_Z","WEIGHT","_Z","KT","y"]
["FINCONS","LPG","O_W_HEAT","KT","O4630","FC_OTH_CP_E_WH","O","_Z","_Z","_Z","_Z","_Z","WEIGHT","_Z","KT","y"]
["FINCONS","LPG","O_COOL","KT","O4630","FC_OTH_CP_E_CL","O","_Z","_Z","_Z","_Z","_Z","WEIGHT","_Z","KT","y"]
["FINCONS","LPG","O_S_COOL","KT","O4630","FC_OTH_CP_E_SC","O","_Z","_Z","_Z","_Z","_Z","WEIGHT","_Z","KT","y"]
["FINCONS","LPG","O_P_COOL","KT","O4630","FC_OTH_CP_E_PC","O","_Z","_Z","_Z","_Z","_Z","WEIGHT","_Z","KT","y"]
["FINCONS","LPG","O_LIGHT","KT","O4630","FC_OTH_CP_E_LOUT","O","_Z","_Z","_Z","_Z","_Z","WEIGHT","_Z","KT","y"]
["FINCONS","LPG","O_IN_LIGHT","KT","O4630","FC_OTH_CP_E_LINDRE","O","_Z","_Z","_Z","_Z","_Z","WEIGHT","_Z","KT","y"]
["FINCONS","LPG","O_OTH_BUILD","KT","O4630","FC_OTH_CP_E_OE_BLD","O","_Z","_Z","_Z","_Z","_Z","WEIGHT","_Z","KT","y"]
["FINCONS","LPG","O_OTH_NBUILD","KT","O4630","FC_OTH_CP_E_OE_NBLD","O","_Z","_Z","_Z","_Z","_Z","WEIGHT","_Z","KT","y"]
["FINCONS","LPG","P","KT","O4630","ENERGUSE","P","_Z","_Z","_Z","_Z","_Z","WEIGHT","_Z","KT","y"]
["FINCONS","LPG","Q","KT","O4630","ENERGUSE","Q","_Z","_Z","_Z","_Z","_Z","WEIGHT","_Z","KT","y"]
["FINCONS","LPG","Q861","KT","O4630","ENERGUSE","Q861","_Z","_Z","_Z","_Z","_Z","WEIGHT","_Z","KT","y"]
["FINCONS","LPG","Q861_HEAT","KT","O4630","FC_OTH_CP_E_HEAT","Q861","_Z","_Z","_Z","_Z","_Z","WEIGHT","_Z","KT","y"]
["FINCONS","LPG","Q861_S_HEAT","KT","O4630","FC_OTH_CP_E_SH","Q861","_Z","_Z","_Z","_Z","_Z","WEIGHT","_Z","KT","y"]
["FINCONS","LPG","Q861_W_HEAT","KT","O4630","FC_OTH_CP_E_WH","Q861","_Z","_Z","_Z","_Z","_Z","WEIGHT","_Z","KT","y"]
["FINCONS","LPG","Q861_COOL","KT","O4630","FC_OTH_CP_E_CL","Q861","_Z","_Z","_Z","_Z","_Z","WEIGHT","_Z","KT","y"]
["FINCONS","LPG","Q861_S_COOL","KT","O4630","FC_OTH_CP_E_SC","Q861","_Z","_Z","_Z","_Z","_Z","WEIGHT","_Z","KT","y"]
["FINCONS","LPG","Q861_P_COOL","KT","O4630","FC_OTH_CP_E_PC","Q861","_Z","_Z","_Z","_Z","_Z","WEIGHT","_Z","KT","y"]
["FINCONS","LPG","Q861_LIGHT","KT","O4630","FC_OTH_CP_E_LOUT","Q861","_Z","_Z","_Z","_Z","_Z","WEIGHT","_Z","KT","y"]
["FINCONS","LPG","Q861_IN_LIGHT","KT","O4630","FC_OTH_CP_E_LINDRE","Q861","_Z","_Z","_Z","_Z","_Z","WEIGHT","_Z","KT","y"]
["FINCONS","LPG","Q861_OTH_BUILD","KT","O4630","FC_OTH_CP_E_OE_BLD","Q861","_Z","_Z","_Z","_Z","_Z","WEIGHT","_Z","KT","y"]
["FINCONS","LPG","Q861_OTH_NBUILD","KT","O4630","FC_OTH_CP_E_OE_NBLD","Q861","_Z","_Z","_Z","_Z","_Z","WEIGHT","_Z","KT","y"]
["FINCONS","LPG","R","KT","O4630","ENERGUSE","R","_Z","_Z","_Z","_Z","_Z","WEIGHT","_Z","KT","y"]
["FINCONS","LPG","R90-R92","KT","O4630","ENERGUSE","R90-R92","_Z","_Z","_Z","_Z","_Z","WEIGHT","_Z","KT","y"]
["FINCONS","LPG","R93","KT","O4630","ENERGUSE","R93","_Z","_Z","_Z","_Z","_Z","WEIGHT","_Z","KT","y"]
["FINCONS","LPG","S","KT","O4630","ENERGUSE","S","_Z","_Z","_Z","_Z","_Z","WEIGHT","_Z","KT","y"]
["FINCONS","LPG","U","KT","O4630","ENERGUSE","U","_Z","_Z","_Z","_Z","_Z","WEIGHT","_Z","KT","y"]
["FINCONS","LPG","DATAC","KT","O4630","ENERGUSE","DATAC","_Z","_Z","_Z","_Z","_Z","WEIGHT","_Z","KT","y"]
["FINCONS","LPG","TOTSER","KT","O4630","ENERGUSE","_T","_Z","_Z","_Z","_Z","_Z","WEIGHT","_Z","KT","y"]
["FINCONS","GASDIES","C33","KT","O4671","ENERGUSE","C33","_Z","_Z","_Z","_Z","_Z","WEIGHT","_Z","KT","y"]
["FINCONS","GASDIES","E","KT","O4671","ENERGUSE","E","_Z","_Z","_Z","_Z","_Z","WEIGHT","_Z","KT","y"]
["FINCONS","GASDIES","E36","KT","O4671","ENERGUSE","E36","_Z","_Z","_Z","_Z","_Z","WEIGHT","_Z","KT","y"]
["FINCONS","GASDIES","E37-E39","KT","O4671","ENERGUSE","E37-E39","_Z","_Z","_Z","_Z","_Z","WEIGHT","_Z","KT","y"]
["FINCONS","GASDIES","E37","KT","O4671","ENERGUSE","E37","_Z","_Z","_Z","_Z","_Z","WEIGHT","_Z","KT","y"]
["FINCONS","GASDIES","E38","KT","O4671","ENERGUSE","E38","_Z","_Z","_Z","_Z","_Z","WEIGHT","_Z","KT","y"]
["FINCONS","GASDIES","E39","KT","O4671","ENERGUSE","E39","_Z","_Z","_Z","_Z","_Z","WEIGHT","_Z","KT","y"]
["FINCONS","GASDIES","G","KT","O4671","ENERGUSE","G","_Z","_Z","_Z","_Z","_Z","WEIGHT","_Z","KT","y"]
["FINCONS","GASDIES","G_HEAT","KT","O4671","FC_OTH_CP_E_HEAT","G","_Z","_Z","_Z","_Z","_Z","WEIGHT","_Z","KT","y"]
["FINCONS","GASDIES","G_S_HEAT","KT","O4671","FC_OTH_CP_E_SH","G","_Z","_Z","_Z","_Z","_Z","WEIGHT","_Z","KT","y"]
["FINCONS","GASDIES","G_W_HEAT","KT","O4671","FC_OTH_CP_E_WH","G","_Z","_Z","_Z","_Z","_Z","WEIGHT","_Z","KT","y"]
["FINCONS","GASDIES","G_COOL","KT","O4671","FC_OTH_CP_E_CL","G","_Z","_Z","_Z","_Z","_Z","WEIGHT","_Z","KT","y"]
["FINCONS","GASDIES","G_S_COOL","KT","O4671","FC_OTH_CP_E_SC","G","_Z","_Z","_Z","_Z","_Z","WEIGHT","_Z","KT","y"]
["FINCONS","GASDIES","G_P_COOL","KT","O4671","FC_OTH_CP_E_PC","G","_Z","_Z","_Z","_Z","_Z","WEIGHT","_Z","KT","y"]
["FINCONS","GASDIES","G_LIGHT","KT","O4671","FC_OTH_CP_E_LOUT","G","_Z","_Z","_Z","_Z","_Z","WEIGHT","_Z","KT","y"]
["FINCONS","GASDIES","G_IN_LIGHT","KT","O4671","FC_OTH_CP_E_LINDRE","G","_Z","_Z","_Z","_Z","_Z","WEIGHT","_Z","KT","y"]
["FINCONS","GASDIES","G_OTH_BUILD","KT","O4671","FC_OTH_CP_E_OE_BLD","G","_Z","_Z","_Z","_Z","_Z","WEIGHT","_Z","KT","y"]
["FINCONS","GASDIES","G_OTH_NBUILD","KT","O4671","FC_OTH_CP_E_OE_NBLD","G","_Z","_Z","_Z","_Z","_Z","WEIGHT","_Z","KT","y"]
["FINCONS","GASDIES","G45","KT","O4671","ENERGUSE","G45","_Z","_Z","_Z","_Z","_Z","WEIGHT","_Z","KT","y"]
["FINCONS","GASDIES","G46","KT","O4671","ENERGUSE","G46","_Z","_Z","_Z","_Z","_Z","WEIGHT","_Z","KT","y"]
["FINCONS","GASDIES","G47","KT","O4671","ENERGUSE","G47","_Z","_Z","_Z","_Z","_Z","WEIGHT","_Z","KT","y"]
["FINCONS","GASDIES","G471","KT","O4671","ENERGUSE","G471","_Z","_Z","_Z","_Z","_Z","WEIGHT","_Z","KT","y"]
["FINCONS","GASDIES","G47_X_G471","KT","O4671","ENERGUSE","G47_X_G471","_Z","_Z","_Z","_Z","_Z","WEIGHT","_Z","KT","y"]
["FINCONS","GASDIES","H52","KT","O4671","ENERGUSE","H52","_Z","_Z","_Z","_Z","_Z","WEIGHT","_Z","KT","y"]
["FINCONS","GASDIES","H52_STL","KT","O4671","ENERGUSE","H52_STL","_Z","_Z","_Z","_Z","_Z","WEIGHT","_Z","KT","y"]
["FINCONS","GASDIES","H53","KT","O4671","ENERGUSE","H53","_Z","_Z","_Z","_Z","_Z","WEIGHT","_Z","KT","y"]
["FINCONS","GASDIES","I","KT","O4671","ENERGUSE","I","_Z","_Z","_Z","_Z","_Z","WEIGHT","_Z","KT","y"]
["FINCONS","GASDIES","I55","KT","O4671","ENERGUSE","I55","_Z","_Z","_Z","_Z","_Z","WEIGHT","_Z","KT","y"]
["FINCONS","GASDIES","I55_HEAT","KT","O4671","FC_OTH_CP_E_HEAT","I55","_Z","_Z","_Z","_Z","_Z","WEIGHT","_Z","KT","y"]
["FINCONS","GASDIES","I55_S_HEAT","KT","O4671","FC_OTH_CP_E_SH","I55","_Z","_Z","_Z","_Z","_Z","WEIGHT","_Z","KT","y"]
["FINCONS","GASDIES","I55_W_HEAT","KT","O4671","FC_OTH_CP_E_WH","I55","_Z","_Z","_Z","_Z","_Z","WEIGHT","_Z","KT","y"]
["FINCONS","GASDIES","I55_COOL","KT","O4671","FC_OTH_CP_E_CL","I55","_Z","_Z","_Z","_Z","_Z","WEIGHT","_Z","KT","y"]
["FINCONS","GASDIES","I55_S_COOL","KT","O4671","FC_OTH_CP_E_SC","I55","_Z","_Z","_Z","_Z","_Z","WEIGHT","_Z","KT","y"]
["FINCONS","GASDIES","I55_P_COOL","KT","O4671","FC_OTH_CP_E_PC","I55","_Z","_Z","_Z","_Z","_Z","WEIGHT","_Z","KT","y"]
["FINCONS","GASDIES","I55_LIGHT","KT","O4671","FC_OTH_CP_E_LOUT","I55","_Z","_Z","_Z","_Z","_Z","WEIGHT","_Z","KT","y"]
["FINCONS","GASDIES","I55_IN_LIGHT","KT","O4671","FC_OTH_CP_E_LINDRE","I55","_Z","_Z","_Z","_Z","_Z","WEIGHT","_Z","KT","y"]
["FINCONS","GASDIES","I55_OTH_BUILD","KT","O4671","FC_OTH_CP_E_OE_BLD","I55","_Z","_Z","_Z","_Z","_Z","WEIGHT","_Z","KT","y"]
["FINCONS","GASDIES","I55_OTH_NBUILD","KT","O4671","FC_OTH_CP_E_OE_NBLD","I55","_Z","_Z","_Z","_Z","_Z","WEIGHT","_Z","KT","y"]
["FINCONS","GASDIES","I551","KT","O4671","ENERGUSE","I551","_Z","_Z","_Z","_Z","_Z","WEIGHT","_Z","KT","y"]
["FINCONS","GASDIES","I552","KT","O4671","ENERGUSE","I552","_Z","_Z","_Z","_Z","_Z","WEIGHT","_Z","KT","y"]
["FINCONS","GASDIES","I553","KT","O4671","ENERGUSE","I553","_Z","_Z","_Z","_Z","_Z","WEIGHT","_Z","KT","y"]
["FINCONS","GASDIES","I559","KT","O4671","ENERGUSE","I559","_Z","_Z","_Z","_Z","_Z","WEIGHT","_Z","KT","y"]
["FINCONS","GASDIES","I56","KT","O4671","ENERGUSE","I56","_Z","_Z","_Z","_Z","_Z","WEIGHT","_Z","KT","y"]
["FINCONS","GASDIES","I56_HEAT","KT","O4671","FC_OTH_CP_E_HEAT","I56","_Z","_Z","_Z","_Z","_Z","WEIGHT","_Z","KT","y"]
["FINCONS","GASDIES","I56_S_HEAT","KT","O4671","FC_OTH_CP_E_SH","I56","_Z","_Z","_Z","_Z","_Z","WEIGHT","_Z","KT","y"]
["FINCONS","GASDIES","I56_W_HEAT","KT","O4671","FC_OTH_CP_E_WH","I56","_Z","_Z","_Z","_Z","_Z","WEIGHT","_Z","KT","y"]
["FINCONS","GASDIES","I56_COOL","KT","O4671","FC_OTH_CP_E_CL","I56","_Z","_Z","_Z","_Z","_Z","WEIGHT","_Z","KT","y"]
["FINCONS","GASDIES","I56_S_COOL","KT","O4671","FC_OTH_CP_E_SC","I56","_Z","_Z","_Z","_Z","_Z","WEIGHT","_Z","KT","y"]
["FINCONS","GASDIES","I56_P_COOL","KT","O4671","FC_OTH_CP_E_PC","I56","_Z","_Z","_Z","_Z","_Z","WEIGHT","_Z","KT","y"]
["FINCONS","GASDIES","I56_LIGHT","KT","O4671","FC_OTH_CP_E_LOUT","I56","_Z","_Z","_Z","_Z","_Z","WEIGHT","_Z","KT","y"]
["FINCONS","GASDIES","I56_IN_LIGHT","KT","O4671","FC_OTH_CP_E_LINDRE","I56","_Z","_Z","_Z","_Z","_Z","WEIGHT","_Z","KT","y"]
["FINCONS","GASDIES","I56_OTH_BUILD","KT","O4671","FC_OTH_CP_E_OE_BLD","I56","_Z","_Z","_Z","_Z","_Z","WEIGHT","_Z","KT","y"]
["FINCONS","GASDIES","I56_OTH_NBUILD","KT","O4671","FC_OTH_CP_E_OE_NBLD","I56","_Z","_Z","_Z","_Z","_Z","WEIGHT","_Z","KT","y"]
["FINCONS","GASDIES","I561","KT","O4671","ENERGUSE","I561","_Z","_Z","_Z","_Z","_Z","WEIGHT","_Z","KT","y"]
["FINCONS","GASDIES","I562","KT","O4671","ENERGUSE","I562","_Z","_Z","_Z","_Z","_Z","WEIGHT","_Z","KT","y"]
["FINCONS","GASDIES","I563","KT","O4671","ENERGUSE","I563","_Z","_Z","_Z","_Z","_Z","WEIGHT","_Z","KT","y"]
["FINCONS","GASDIES","J","KT","O4671","ENERGUSE","J","_Z","_Z","_Z","_Z","_Z","WEIGHT","_Z","KT","y"]
["FINCONS","GASDIES","J58","KT","O4671","ENERGUSE","J58","_Z","_Z","_Z","_Z","_Z","WEIGHT","_Z","KT","y"]
["FINCONS","GASDIES","J59_J60","KT","O4671","ENERGUSE","J59_J60","_Z","_Z","_Z","_Z","_Z","WEIGHT","_Z","KT","y"]
["FINCONS","GASDIES","J61","KT","O4671","ENERGUSE","J61","_Z","_Z","_Z","_Z","_Z","WEIGHT","_Z","KT","y"]
["FINCONS","GASDIES","J62_J63","KT","O4671","ENERGUSE","J62_J63","_Z","_Z","_Z","_Z","_Z","WEIGHT","_Z","KT","y"]
["FINCONS","GASDIES","J62","KT","O4671","ENERGUSE","J62","_Z","_Z","_Z","_Z","_Z","WEIGHT","_Z","KT","y"]
["FINCONS","GASDIES","J63","KT","O4671","ENERGUSE","J63","_Z","_Z","_Z","_Z","_Z","WEIGHT","_Z","KT","y"]
["FINCONS","GASDIES","K_L","KT","O4671","ENERGUSE","K_L","_Z","_Z","_Z","_Z","_Z","WEIGHT","_Z","KT","y"]
["FINCONS","GASDIES","K","KT","O4671","ENERGUSE","K","_Z","_Z","_Z","_Z","_Z","WEIGHT","_Z","KT","y"]
["FINCONS","GASDIES","L","KT","O4671","ENERGUSE","L","_Z","_Z","_Z","_Z","_Z","WEIGHT","_Z","KT","y"]
["FINCONS","GASDIES","M_S","KT","O4671","ENERGUSE","M_S","_Z","_Z","_Z","_Z","_Z","WEIGHT","_Z","KT","y"]
["FINCONS","GASDIES","M","KT","O4671","ENERGUSE","M","_Z","_Z","_Z","_Z","_Z","WEIGHT","_Z","KT","y"]
["FINCONS","GASDIES","M69_M70","KT","O4671","ENERGUSE","M69_M70","_Z","_Z","_Z","_Z","_Z","WEIGHT","_Z","KT","y"]
["FINCONS","GASDIES","M71","KT","O4671","ENERGUSE","M71","_Z","_Z","_Z","_Z","_Z","WEIGHT","_Z","KT","y"]
["FINCONS","GASDIES","M72","KT","O4671","ENERGUSE","M72","_Z","_Z","_Z","_Z","_Z","WEIGHT","_Z","KT","y"]
["FINCONS","GASDIES","M73","KT","O4671","ENERGUSE","M73","_Z","_Z","_Z","_Z","_Z","WEIGHT","_Z","KT","y"]
["FINCONS","GASDIES","M74_M75","KT","O4671","ENERGUSE","M74_M75","_Z","_Z","_Z","_Z","_Z","WEIGHT","_Z","KT","y"]
["FINCONS","GASDIES","N","KT","O4671","ENERGUSE","N","_Z","_Z","_Z","_Z","_Z","WEIGHT","_Z","KT","y"]
["FINCONS","GASDIES","N77","KT","O4671","ENERGUSE","N77","_Z","_Z","_Z","_Z","_Z","WEIGHT","_Z","KT","y"]
["FINCONS","GASDIES","N78","KT","O4671","ENERGUSE","N78","_Z","_Z","_Z","_Z","_Z","WEIGHT","_Z","KT","y"]
["FINCONS","GASDIES","N79","KT","O4671","ENERGUSE","N79","_Z","_Z","_Z","_Z","_Z","WEIGHT","_Z","KT","y"]
["FINCONS","GASDIES","N80-N82","KT","O4671","ENERGUSE","N80-N82","_Z","_Z","_Z","_Z","_Z","WEIGHT","_Z","KT","y"]
["FINCONS","GASDIES","O","KT","O4671","ENERGUSE","O","_Z","_Z","_Z","_Z","_Z","WEIGHT","_Z","KT","y"]
["FINCONS","GASDIES","O_HEAT","KT","O4671","FC_OTH_CP_E_HEAT","O","_Z","_Z","_Z","_Z","_Z","WEIGHT","_Z","KT","y"]
["FINCONS","GASDIES","O_S_HEAT","KT","O4671","FC_OTH_CP_E_SH","O","_Z","_Z","_Z","_Z","_Z","WEIGHT","_Z","KT","y"]
["FINCONS","GASDIES","O_W_HEAT","KT","O4671","FC_OTH_CP_E_WH","O","_Z","_Z","_Z","_Z","_Z","WEIGHT","_Z","KT","y"]
["FINCONS","GASDIES","O_COOL","KT","O4671","FC_OTH_CP_E_CL","O","_Z","_Z","_Z","_Z","_Z","WEIGHT","_Z","KT","y"]
["FINCONS","GASDIES","O_S_COOL","KT","O4671","FC_OTH_CP_E_SC","O","_Z","_Z","_Z","_Z","_Z","WEIGHT","_Z","KT","y"]
["FINCONS","GASDIES","O_P_COOL","KT","O4671","FC_OTH_CP_E_PC","O","_Z","_Z","_Z","_Z","_Z","WEIGHT","_Z","KT","y"]
["FINCONS","GASDIES","O_LIGHT","KT","O4671","FC_OTH_CP_E_LOUT","O","_Z","_Z","_Z","_Z","_Z","WEIGHT","_Z","KT","y"]
["FINCONS","GASDIES","O_IN_LIGHT","KT","O4671","FC_OTH_CP_E_LINDRE","O","_Z","_Z","_Z","_Z","_Z","WEIGHT","_Z","KT","y"]
["FINCONS","GASDIES","O_OTH_BUILD","KT","O4671","FC_OTH_CP_E_OE_BLD","O","_Z","_Z","_Z","_Z","_Z","WEIGHT","_Z","KT","y"]
["FINCONS","GASDIES","O_OTH_NBUILD","KT","O4671","FC_OTH_CP_E_OE_NBLD","O","_Z","_Z","_Z","_Z","_Z","WEIGHT","_Z","KT","y"]
["FINCONS","GASDIES","P","KT","O4671","ENERGUSE","P","_Z","_Z","_Z","_Z","_Z","WEIGHT","_Z","KT","y"]
["FINCONS","GASDIES","Q","KT","O4671","ENERGUSE","Q","_Z","_Z","_Z","_Z","_Z","WEIGHT","_Z","KT","y"]
["FINCONS","GASDIES","Q861","KT","O4671","ENERGUSE","Q861","_Z","_Z","_Z","_Z","_Z","WEIGHT","_Z","KT","y"]
["FINCONS","GASDIES","Q861_HEAT","KT","O4671","FC_OTH_CP_E_HEAT","Q861","_Z","_Z","_Z","_Z","_Z","WEIGHT","_Z","KT","y"]
["FINCONS","GASDIES","Q861_S_HEAT","KT","O4671","FC_OTH_CP_E_SH","Q861","_Z","_Z","_Z","_Z","_Z","WEIGHT","_Z","KT","y"]
["FINCONS","GASDIES","Q861_W_HEAT","KT","O4671","FC_OTH_CP_E_WH","Q861","_Z","_Z","_Z","_Z","_Z","WEIGHT","_Z","KT","y"]
["FINCONS","GASDIES","Q861_COOL","KT","O4671","FC_OTH_CP_E_CL","Q861","_Z","_Z","_Z","_Z","_Z","WEIGHT","_Z","KT","y"]
["FINCONS","GASDIES","Q861_S_COOL","KT","O4671","FC_OTH_CP_E_SC","Q861","_Z","_Z","_Z","_Z","_Z","WEIGHT","_Z","KT","y"]
["FINCONS","GASDIES","Q861_P_COOL","KT","O4671","FC_OTH_CP_E_PC","Q861","_Z","_Z","_Z","_Z","_Z","WEIGHT","_Z","KT","y"]
["FINCONS","GASDIES","Q861_LIGHT","KT","O4671","FC_OTH_CP_E_LOUT","Q861","_Z","_Z","_Z","_Z","_Z","WEIGHT","_Z","KT","y"]
["FINCONS","GASDIES","Q861_IN_LIGHT","KT","O4671","FC_OTH_CP_E_LINDRE","Q861","_Z","_Z","_Z","_Z","_Z","WEIGHT","_Z","KT","y"]
["FINCONS","GASDIES","Q861_OTH_BUILD","KT","O4671","FC_OTH_CP_E_OE_BLD","Q861","_Z","_Z","_Z","_Z","_Z","WEIGHT","_Z","KT","y"]
["FINCONS","GASDIES","Q861_OTH_NBUILD","KT","O4671","FC_OTH_CP_E_OE_NBLD","Q861","_Z","_Z","_Z","_Z","_Z","WEIGHT","_Z","KT","y"]
["FINCONS","GASDIES","R","KT","O4671","ENERGUSE","R","_Z","_Z","_Z","_Z","_Z","WEIGHT","_Z","KT","y"]
["FINCONS","GASDIES","R90-R92","KT","O4671","ENERGUSE","R90-R92","_Z","_Z","_Z","_Z","_Z","WEIGHT","_Z","KT","y"]
["FINCONS","GASDIES","R93","KT","O4671","ENERGUSE","R93","_Z","_Z","_Z","_Z","_Z","WEIGHT","_Z","KT","y"]
["FINCONS","GASDIES","S","KT","O4671","ENERGUSE","S","_Z","_Z","_Z","_Z","_Z","WEIGHT","_Z","KT","y"]
["FINCONS","GASDIES","U","KT","O4671","ENERGUSE","U","_Z","_Z","_Z","_Z","_Z","WEIGHT","_Z","KT","y"]
["FINCONS","GASDIES","DATAC","KT","O4671","ENERGUSE","DATAC","_Z","_Z","_Z","_Z","_Z","WEIGHT","_Z","KT","y"]
["FINCONS","GASDIES","TOTSER","KT","O4671","ENERGUSE","_T","_Z","_Z","_Z","_Z","_Z","WEIGHT","_Z","KT","y"]
["FINCONS","REN","C33","TJ_NCV","RA000","ENERGUSE","C33","_Z","_Z","_Z","_Z","_Z","ENERGY","_Z","TJ_NCV","y"]
["FINCONS","REN","E","TJ_NCV","RA000","ENERGUSE","E","_Z","_Z","_Z","_Z","_Z","ENERGY","_Z","TJ_NCV","y"]
["FINCONS","REN","E36","TJ_NCV","RA000","ENERGUSE","E36","_Z","_Z","_Z","_Z","_Z","ENERGY","_Z","TJ_NCV","y"]
["FINCONS","REN","E37-E39","TJ_NCV","RA000","ENERGUSE","E37-E39","_Z","_Z","_Z","_Z","_Z","ENERGY","_Z","TJ_NCV","y"]
["FINCONS","REN","E37","TJ_NCV","RA000","ENERGUSE","E37","_Z","_Z","_Z","_Z","_Z","ENERGY","_Z","TJ_NCV","y"]
["FINCONS","REN","E38","TJ_NCV","RA000","ENERGUSE","E38","_Z","_Z","_Z","_Z","_Z","ENERGY","_Z","TJ_NCV","y"]
["FINCONS","REN","E39","TJ_NCV","RA000","ENERGUSE","E39","_Z","_Z","_Z","_Z","_Z","ENERGY","_Z","TJ_NCV","y"]
["FINCONS","REN","G","TJ_NCV","RA000","ENERGUSE","G","_Z","_Z","_Z","_Z","_Z","ENERGY","_Z","TJ_NCV","y"]
["FINCONS","REN","G_HEAT","TJ_NCV","RA000","FC_OTH_CP_E_HEAT","G","_Z","_Z","_Z","_Z","_Z","ENERGY","_Z","TJ_NCV","y"]
["FINCONS","REN","G_S_HEAT","TJ_NCV","RA000","FC_OTH_CP_E_SH","G","_Z","_Z","_Z","_Z","_Z","ENERGY","_Z","TJ_NCV","y"]
["FINCONS","REN","G_W_HEAT","TJ_NCV","RA000","FC_OTH_CP_E_WH","G","_Z","_Z","_Z","_Z","_Z","ENERGY","_Z","TJ_NCV","y"]
["FINCONS","REN","G_COOL","TJ_NCV","RA000","FC_OTH_CP_E_CL","G","_Z","_Z","_Z","_Z","_Z","ENERGY","_Z","TJ_NCV","y"]
["FINCONS","REN","G_S_COOL","TJ_NCV","RA000","FC_OTH_CP_E_SC","G","_Z","_Z","_Z","_Z","_Z","ENERGY","_Z","TJ_NCV","y"]
["FINCONS","REN","G_P_COOL","TJ_NCV","RA000","FC_OTH_CP_E_PC","G","_Z","_Z","_Z","_Z","_Z","ENERGY","_Z","TJ_NCV","y"]
["FINCONS","REN","G_LIGHT","TJ_NCV","RA000","FC_OTH_CP_E_LOUT","G","_Z","_Z","_Z","_Z","_Z","ENERGY","_Z","TJ_NCV","y"]
["FINCONS","REN","G_IN_LIGHT","TJ_NCV","RA000","FC_OTH_CP_E_LINDRE","G","_Z","_Z","_Z","_Z","_Z","ENERGY","_Z","TJ_NCV","y"]
["FINCONS","REN","G_OTH_BUILD","TJ_NCV","RA000","FC_OTH_CP_E_OE_BLD","G","_Z","_Z","_Z","_Z","_Z","ENERGY","_Z","TJ_NCV","y"]
["FINCONS","REN","G_OTH_NBUILD","TJ_NCV","RA000","FC_OTH_CP_E_OE_NBLD","G","_Z","_Z","_Z","_Z","_Z","ENERGY","_Z","TJ_NCV","y"]
["FINCONS","REN","G45","TJ_NCV","RA000","ENERGUSE","G45","_Z","_Z","_Z","_Z","_Z","ENERGY","_Z","TJ_NCV","y"]
["FINCONS","REN","G46","TJ_NCV","RA000","ENERGUSE","G46","_Z","_Z","_Z","_Z","_Z","ENERGY","_Z","TJ_NCV","y"]
["FINCONS","REN","G47","TJ_NCV","RA000","ENERGUSE","G47","_Z","_Z","_Z","_Z","_Z","ENERGY","_Z","TJ_NCV","y"]
["FINCONS","REN","G471","TJ_NCV","RA000","ENERGUSE","G471","_Z","_Z","_Z","_Z","_Z","ENERGY","_Z","TJ_NCV","y"]
["FINCONS","REN","G47_X_G471","TJ_NCV","RA000","ENERGUSE","G47_X_G471","_Z","_Z","_Z","_Z","_Z","ENERGY","_Z","TJ_NCV","y"]
["FINCONS","REN","H52","TJ_NCV","RA000","ENERGUSE","H52","_Z","_Z","_Z","_Z","_Z","ENERGY","_Z","TJ_NCV","y"]
["FINCONS","REN","H52_STL","TJ_NCV","RA000","ENERGUSE","H52_STL","_Z","_Z","_Z","_Z","_Z","ENERGY","_Z","TJ_NCV","y"]
["FINCONS","REN","H53","TJ_NCV","RA000","ENERGUSE","H53","_Z","_Z","_Z","_Z","_Z","ENERGY","_Z","TJ_NCV","y"]
["FINCONS","REN","I","TJ_NCV","RA000","ENERGUSE","I","_Z","_Z","_Z","_Z","_Z","ENERGY","_Z","TJ_NCV","y"]
["FINCONS","REN","I55","TJ_NCV","RA000","ENERGUSE","I55","_Z","_Z","_Z","_Z","_Z","ENERGY","_Z","TJ_NCV","y"]
["FINCONS","REN","I55_HEAT","TJ_NCV","RA000","FC_OTH_CP_E_HEAT","I55","_Z","_Z","_Z","_Z","_Z","ENERGY","_Z","TJ_NCV","y"]
["FINCONS","REN","I55_S_HEAT","TJ_NCV","RA000","FC_OTH_CP_E_SH","I55","_Z","_Z","_Z","_Z","_Z","ENERGY","_Z","TJ_NCV","y"]
["FINCONS","REN","I55_W_HEAT","TJ_NCV","RA000","FC_OTH_CP_E_WH","I55","_Z","_Z","_Z","_Z","_Z","ENERGY","_Z","TJ_NCV","y"]
["FINCONS","REN","I55_COOL","TJ_NCV","RA000","FC_OTH_CP_E_CL","I55","_Z","_Z","_Z","_Z","_Z","ENERGY","_Z","TJ_NCV","y"]
["FINCONS","REN","I55_S_COOL","TJ_NCV","RA000","FC_OTH_CP_E_SC","I55","_Z","_Z","_Z","_Z","_Z","ENERGY","_Z","TJ_NCV","y"]
["FINCONS","REN","I55_P_COOL","TJ_NCV","RA000","FC_OTH_CP_E_PC","I55","_Z","_Z","_Z","_Z","_Z","ENERGY","_Z","TJ_NCV","y"]
["FINCONS","REN","I55_LIGHT","TJ_NCV","RA000","FC_OTH_CP_E_LOUT","I55","_Z","_Z","_Z","_Z","_Z","ENERGY","_Z","TJ_NCV","y"]
["FINCONS","REN","I55_IN_LIGHT","TJ_NCV","RA000","FC_OTH_CP_E_LINDRE","I55","_Z","_Z","_Z","_Z","_Z","ENERGY","_Z","TJ_NCV","y"]
["FINCONS","REN","I55_OTH_BUILD","TJ_NCV","RA000","FC_OTH_CP_E_OE_BLD","I55","_Z","_Z","_Z","_Z","_Z","ENERGY","_Z","TJ_NCV","y"]
["FINCONS","REN","I55_OTH_NBUILD","TJ_NCV","RA000","FC_OTH_CP_E_OE_NBLD","I55","_Z","_Z","_Z","_Z","_Z","ENERGY","_Z","TJ_NCV","y"]
["FINCONS","REN","I551","TJ_NCV","RA000","ENERGUSE","I551","_Z","_Z","_Z","_Z","_Z","ENERGY","_Z","TJ_NCV","y"]
["FINCONS","REN","I552","TJ_NCV","RA000","ENERGUSE","I552","_Z","_Z","_Z","_Z","_Z","ENERGY","_Z","TJ_NCV","y"]
["FINCONS","REN","I553","TJ_NCV","RA000","ENERGUSE","I553","_Z","_Z","_Z","_Z","_Z","ENERGY","_Z","TJ_NCV","y"]
["FINCONS","REN","I559","TJ_NCV","RA000","ENERGUSE","I559","_Z","_Z","_Z","_Z","_Z","ENERGY","_Z","TJ_NCV","y"]
["FINCONS","REN","I56","TJ_NCV","RA000","ENERGUSE","I56","_Z","_Z","_Z","_Z","_Z","ENERGY","_Z","TJ_NCV","y"]
["FINCONS","REN","I56_HEAT","TJ_NCV","RA000","FC_OTH_CP_E_HEAT","I56","_Z","_Z","_Z","_Z","_Z","ENERGY","_Z","TJ_NCV","y"]
["FINCONS","REN","I56_S_HEAT","TJ_NCV","RA000","FC_OTH_CP_E_SH","I56","_Z","_Z","_Z","_Z","_Z","ENERGY","_Z","TJ_NCV","y"]
["FINCONS","REN","I56_W_HEAT","TJ_NCV","RA000","FC_OTH_CP_E_WH","I56","_Z","_Z","_Z","_Z","_Z","ENERGY","_Z","TJ_NCV","y"]
["FINCONS","REN","I56_COOL","TJ_NCV","RA000","FC_OTH_CP_E_CL","I56","_Z","_Z","_Z","_Z","_Z","ENERGY","_Z","TJ_NCV","y"]
["FINCONS","REN","I56_S_COOL","TJ_NCV","RA000","FC_OTH_CP_E_SC","I56","_Z","_Z","_Z","_Z","_Z","ENERGY","_Z","TJ_NCV","y"]
["FINCONS","REN","I56_P_COOL","TJ_NCV","RA000","FC_OTH_CP_E_PC","I56","_Z","_Z","_Z","_Z","_Z","ENERGY","_Z","TJ_NCV","y"]
["FINCONS","REN","I56_LIGHT","TJ_NCV","RA000","FC_OTH_CP_E_LOUT","I56","_Z","_Z","_Z","_Z","_Z","ENERGY","_Z","TJ_NCV","y"]
["FINCONS","REN","I56_IN_LIGHT","TJ_NCV","RA000","FC_OTH_CP_E_LINDRE","I56","_Z","_Z","_Z","_Z","_Z","ENERGY","_Z","TJ_NCV","y"]
["FINCONS","REN","I56_OTH_BUILD","TJ_NCV","RA000","FC_OTH_CP_E_OE_BLD","I56","_Z","_Z","_Z","_Z","_Z","ENERGY","_Z","TJ_NCV","y"]
["FINCONS","REN","I56_OTH_NBUILD","TJ_NCV","RA000","FC_OTH_CP_E_OE_NBLD","I56","_Z","_Z","_Z","_Z","_Z","ENERGY","_Z","TJ_NCV","y"]
["FINCONS","REN","I561","TJ_NCV","RA000","ENERGUSE","I561","_Z","_Z","_Z","_Z","_Z","ENERGY","_Z","TJ_NCV","y"]
["FINCONS","REN","I562","TJ_NCV","RA000","ENERGUSE","I562","_Z","_Z","_Z","_Z","_Z","ENERGY","_Z","TJ_NCV","y"]
["FINCONS","REN","I563","TJ_NCV","RA000","ENERGUSE","I563","_Z","_Z","_Z","_Z","_Z","ENERGY","_Z","TJ_NCV","y"]
["FINCONS","REN","J","TJ_NCV","RA000","ENERGUSE","J","_Z","_Z","_Z","_Z","_Z","ENERGY","_Z","TJ_NCV","y"]
["FINCONS","REN","J58","TJ_NCV","RA000","ENERGUSE","J58","_Z","_Z","_Z","_Z","_Z","ENERGY","_Z","TJ_NCV","y"]
["FINCONS","REN","J59_J60","TJ_NCV","RA000","ENERGUSE","J59_J60","_Z","_Z","_Z","_Z","_Z","ENERGY","_Z","TJ_NCV","y"]
["FINCONS","REN","J61","TJ_NCV","RA000","ENERGUSE","J61","_Z","_Z","_Z","_Z","_Z","ENERGY","_Z","TJ_NCV","y"]
["FINCONS","REN","J62_J63","TJ_NCV","RA000","ENERGUSE","J62_J63","_Z","_Z","_Z","_Z","_Z","ENERGY","_Z","TJ_NCV","y"]
["FINCONS","REN","J62","TJ_NCV","RA000","ENERGUSE","J62","_Z","_Z","_Z","_Z","_Z","ENERGY","_Z","TJ_NCV","y"]
["FINCONS","REN","J63","TJ_NCV","RA000","ENERGUSE","J63","_Z","_Z","_Z","_Z","_Z","ENERGY","_Z","TJ_NCV","y"]
["FINCONS","REN","K_L","TJ_NCV","RA000","ENERGUSE","K_L","_Z","_Z","_Z","_Z","_Z","ENERGY","_Z","TJ_NCV","y"]
["FINCONS","REN","K","TJ_NCV","RA000","ENERGUSE","K","_Z","_Z","_Z","_Z","_Z","ENERGY","_Z","TJ_NCV","y"]
["FINCONS","REN","L","TJ_NCV","RA000","ENERGUSE","L","_Z","_Z","_Z","_Z","_Z","ENERGY","_Z","TJ_NCV","y"]
["FINCONS","REN","M_S","TJ_NCV","RA000","ENERGUSE","M_S","_Z","_Z","_Z","_Z","_Z","ENERGY","_Z","TJ_NCV","y"]
["FINCONS","REN","M","TJ_NCV","RA000","ENERGUSE","M","_Z","_Z","_Z","_Z","_Z","ENERGY","_Z","TJ_NCV","y"]
["FINCONS","REN","M69_M70","TJ_NCV","RA000","ENERGUSE","M69_M70","_Z","_Z","_Z","_Z","_Z","ENERGY","_Z","TJ_NCV","y"]
["FINCONS","REN","M71","TJ_NCV","RA000","ENERGUSE","M71","_Z","_Z","_Z","_Z","_Z","ENERGY","_Z","TJ_NCV","y"]
["FINCONS","REN","M72","TJ_NCV","RA000","ENERGUSE","M72","_Z","_Z","_Z","_Z","_Z","ENERGY","_Z","TJ_NCV","y"]
["FINCONS","REN","M73","TJ_NCV","RA000","ENERGUSE","M73","_Z","_Z","_Z","_Z","_Z","ENERGY","_Z","TJ_NCV","y"]
["FINCONS","REN","M74_M75","TJ_NCV","RA000","ENERGUSE","M74_M75","_Z","_Z","_Z","_Z","_Z","ENERGY","_Z","TJ_NCV","y"]
["FINCONS","REN","N","TJ_NCV","RA000","ENERGUSE","N","_Z","_Z","_Z","_Z","_Z","ENERGY","_Z","TJ_NCV","y"]
["FINCONS","REN","N77","TJ_NCV","RA000","ENERGUSE","N77","_Z","_Z","_Z","_Z","_Z","ENERGY","_Z","TJ_NCV","y"]
["FINCONS","REN","N78","TJ_NCV","RA000","ENERGUSE","N78","_Z","_Z","_Z","_Z","_Z","ENERGY","_Z","TJ_NCV","y"]
["FINCONS","REN","N79","TJ_NCV","RA000","ENERGUSE","N79","_Z","_Z","_Z","_Z","_Z","ENERGY","_Z","TJ_NCV","y"]
["FINCONS","REN","N80-N82","TJ_NCV","RA000","ENERGUSE","N80-N82","_Z","_Z","_Z","_Z","_Z","ENERGY","_Z","TJ_NCV","y"]
["FINCONS","REN","O","TJ_NCV","RA000","ENERGUSE","O","_Z","_Z","_Z","_Z","_Z","ENERGY","_Z","TJ_NCV","y"]
["FINCONS","REN","O_HEAT","TJ_NCV","RA000","FC_OTH_CP_E_HEAT","O","_Z","_Z","_Z","_Z","_Z","ENERGY","_Z","TJ_NCV","y"]
["FINCONS","REN","O_S_HEAT","TJ_NCV","RA000","FC_OTH_CP_E_SH","O","_Z","_Z","_Z","_Z","_Z","ENERGY","_Z","TJ_NCV","y"]
["FINCONS","REN","O_W_HEAT","TJ_NCV","RA000","FC_OTH_CP_E_WH","O","_Z","_Z","_Z","_Z","_Z","ENERGY","_Z","TJ_NCV","y"]
["FINCONS","REN","O_COOL","TJ_NCV","RA000","FC_OTH_CP_E_CL","O","_Z","_Z","_Z","_Z","_Z","ENERGY","_Z","TJ_NCV","y"]
["FINCONS","REN","O_S_COOL","TJ_NCV","RA000","FC_OTH_CP_E_SC","O","_Z","_Z","_Z","_Z","_Z","ENERGY","_Z","TJ_NCV","y"]
["FINCONS","REN","O_P_COOL","TJ_NCV","RA000","FC_OTH_CP_E_PC","O","_Z","_Z","_Z","_Z","_Z","ENERGY","_Z","TJ_NCV","y"]
["FINCONS","REN","O_LIGHT","TJ_NCV","RA000","FC_OTH_CP_E_LOUT","O","_Z","_Z","_Z","_Z","_Z","ENERGY","_Z","TJ_NCV","y"]
["FINCONS","REN","O_IN_LIGHT","TJ_NCV","RA000","FC_OTH_CP_E_LINDRE","O","_Z","_Z","_Z","_Z","_Z","ENERGY","_Z","TJ_NCV","y"]
["FINCONS","REN","O_OTH_BUILD","TJ_NCV","RA000","FC_OTH_CP_E_OE_BLD","O","_Z","_Z","_Z","_Z","_Z","ENERGY","_Z","TJ_NCV","y"]
["FINCONS","REN","O_OTH_NBUILD","TJ_NCV","RA000","FC_OTH_CP_E_OE_NBLD","O","_Z","_Z","_Z","_Z","_Z","ENERGY","_Z","TJ_NCV","y"]
["FINCONS","REN","P","TJ_NCV","RA000","ENERGUSE","P","_Z","_Z","_Z","_Z","_Z","ENERGY","_Z","TJ_NCV","y"]
["FINCONS","REN","Q","TJ_NCV","RA000","ENERGUSE","Q","_Z","_Z","_Z","_Z","_Z","ENERGY","_Z","TJ_NCV","y"]
["FINCONS","REN","Q861","TJ_NCV","RA000","ENERGUSE","Q861","_Z","_Z","_Z","_Z","_Z","ENERGY","_Z","TJ_NCV","y"]
["FINCONS","REN","Q861_HEAT","TJ_NCV","RA000","FC_OTH_CP_E_HEAT","Q861","_Z","_Z","_Z","_Z","_Z","ENERGY","_Z","TJ_NCV","y"]
["FINCONS","REN","Q861_S_HEAT","TJ_NCV","RA000","FC_OTH_CP_E_SH","Q861","_Z","_Z","_Z","_Z","_Z","ENERGY","_Z","TJ_NCV","y"]
["FINCONS","REN","Q861_W_HEAT","TJ_NCV","RA000","FC_OTH_CP_E_WH","Q861","_Z","_Z","_Z","_Z","_Z","ENERGY","_Z","TJ_NCV","y"]
["FINCONS","REN","Q861_COOL","TJ_NCV","RA000","FC_OTH_CP_E_CL","Q861","_Z","_Z","_Z","_Z","_Z","ENERGY","_Z","TJ_NCV","y"]
["FINCONS","REN","Q861_S_COOL","TJ_NCV","RA000","FC_OTH_CP_E_SC","Q861","_Z","_Z","_Z","_Z","_Z","ENERGY","_Z","TJ_NCV","y"]
["FINCONS","REN","Q861_P_COOL","TJ_NCV","RA000","FC_OTH_CP_E_PC","Q861","_Z","_Z","_Z","_Z","_Z","ENERGY","_Z","TJ_NCV","y"]
["FINCONS","REN","Q861_LIGHT","TJ_NCV","RA000","FC_OTH_CP_E_LOUT","Q861","_Z","_Z","_Z","_Z","_Z","ENERGY","_Z","TJ_NCV","y"]
["FINCONS","REN","Q861_IN_LIGHT","TJ_NCV","RA000","FC_OTH_CP_E_LINDRE","Q861","_Z","_Z","_Z","_Z","_Z","ENERGY","_Z","TJ_NCV","y"]
["FINCONS","REN","Q861_OTH_BUILD","TJ_NCV","RA000","FC_OTH_CP_E_OE_BLD","Q861","_Z","_Z","_Z","_Z","_Z","ENERGY","_Z","TJ_NCV","y"]
["FINCONS","REN","Q861_OTH_NBUILD","TJ_NCV","RA000","FC_OTH_CP_E_OE_NBLD","Q861","_Z","_Z","_Z","_Z","_Z","ENERGY","_Z","TJ_NCV","y"]
["FINCONS","REN","R","TJ_NCV","RA000","ENERGUSE","R","_Z","_Z","_Z","_Z","_Z","ENERGY","_Z","TJ_NCV","y"]
["FINCONS","REN","R90-R92","TJ_NCV","RA000","ENERGUSE","R90-R92","_Z","_Z","_Z","_Z","_Z","ENERGY","_Z","TJ_NCV","y"]
["FINCONS","REN","R93","TJ_NCV","RA000","ENERGUSE","R93","_Z","_Z","_Z","_Z","_Z","ENERGY","_Z","TJ_NCV","y"]
["FINCONS","REN","S","TJ_NCV","RA000","ENERGUSE","S","_Z","_Z","_Z","_Z","_Z","ENERGY","_Z","TJ_NCV","y"]
["FINCONS","REN","U","TJ_NCV","RA000","ENERGUSE","U","_Z","_Z","_Z","_Z","_Z","ENERGY","_Z","TJ_NCV","y"]
["FINCONS","REN","DATAC","TJ_NCV","RA000","ENERGUSE","DATAC","_Z","_Z","_Z","_Z","_Z","ENERGY","_Z","TJ_NCV","y"]
["FINCONS","REN","TOTSER","TJ_NCV","RA000","ENERGUSE","_T","_Z","_Z","_Z","_Z","_Z","ENERGY","_Z","TJ_NCV","y"]
["FINCONS","SOLARTH","C33","TJ_NCV","RA410","ENERGUSE","C33","_Z","_Z","_Z","_Z","_Z","ENERGY","_Z","TJ_NCV","y"]
["FINCONS","SOLARTH","E","TJ_NCV","RA410","ENERGUSE","E","_Z","_Z","_Z","_Z","_Z","ENERGY","_Z","TJ_NCV","y"]
["FINCONS","SOLARTH","E36","TJ_NCV","RA410","ENERGUSE","E36","_Z","_Z","_Z","_Z","_Z","ENERGY","_Z","TJ_NCV","y"]
["FINCONS","SOLARTH","E37-E39","TJ_NCV","RA410","ENERGUSE","E37-E39","_Z","_Z","_Z","_Z","_Z","ENERGY","_Z","TJ_NCV","y"]
["FINCONS","SOLARTH","E37","TJ_NCV","RA410","ENERGUSE","E37","_Z","_Z","_Z","_Z","_Z","ENERGY","_Z","TJ_NCV","y"]
["FINCONS","SOLARTH","E38","TJ_NCV","RA410","ENERGUSE","E38","_Z","_Z","_Z","_Z","_Z","ENERGY","_Z","TJ_NCV","y"]
["FINCONS","SOLARTH","E39","TJ_NCV","RA410","ENERGUSE","E39","_Z","_Z","_Z","_Z","_Z","ENERGY","_Z","TJ_NCV","y"]
["FINCONS","SOLARTH","G","TJ_NCV","RA410","ENERGUSE","G","_Z","_Z","_Z","_Z","_Z","ENERGY","_Z","TJ_NCV","y"]
["FINCONS","SOLARTH","G_HEAT","TJ_NCV","RA410","FC_OTH_CP_E_HEAT","G","_Z","_Z","_Z","_Z","_Z","ENERGY","_Z","TJ_NCV","y"]
["FINCONS","SOLARTH","G_S_HEAT","TJ_NCV","RA410","FC_OTH_CP_E_SH","G","_Z","_Z","_Z","_Z","_Z","ENERGY","_Z","TJ_NCV","y"]
["FINCONS","SOLARTH","G_W_HEAT","TJ_NCV","RA410","FC_OTH_CP_E_WH","G","_Z","_Z","_Z","_Z","_Z","ENERGY","_Z","TJ_NCV","y"]
["FINCONS","SOLARTH","G_COOL","TJ_NCV","RA410","FC_OTH_CP_E_CL","G","_Z","_Z","_Z","_Z","_Z","ENERGY","_Z","TJ_NCV","y"]
["FINCONS","SOLARTH","G_S_COOL","TJ_NCV","RA410","FC_OTH_CP_E_SC","G","_Z","_Z","_Z","_Z","_Z","ENERGY","_Z","TJ_NCV","y"]
["FINCONS","SOLARTH","G_P_COOL","TJ_NCV","RA410","FC_OTH_CP_E_PC","G","_Z","_Z","_Z","_Z","_Z","ENERGY","_Z","TJ_NCV","y"]
["FINCONS","SOLARTH","G_LIGHT","TJ_NCV","RA410","FC_OTH_CP_E_LOUT","G","_Z","_Z","_Z","_Z","_Z","ENERGY","_Z","TJ_NCV","y"]
["FINCONS","SOLARTH","G_IN_LIGHT","TJ_NCV","RA410","FC_OTH_CP_E_LINDRE","G","_Z","_Z","_Z","_Z","_Z","ENERGY","_Z","TJ_NCV","y"]
["FINCONS","SOLARTH","G_OTH_BUILD","TJ_NCV","RA410","FC_OTH_CP_E_OE_BLD","G","_Z","_Z","_Z","_Z","_Z","ENERGY","_Z","TJ_NCV","y"]
["FINCONS","SOLARTH","G_OTH_NBUILD","TJ_NCV","RA410","FC_OTH_CP_E_OE_NBLD","G","_Z","_Z","_Z","_Z","_Z","ENERGY","_Z","TJ_NCV","y"]
["FINCONS","SOLARTH","G45","TJ_NCV","RA410","ENERGUSE","G45","_Z","_Z","_Z","_Z","_Z","ENERGY","_Z","TJ_NCV","y"]
["FINCONS","SOLARTH","G46","TJ_NCV","RA410","ENERGUSE","G46","_Z","_Z","_Z","_Z","_Z","ENERGY","_Z","TJ_NCV","y"]
["FINCONS","SOLARTH","G47","TJ_NCV","RA410","ENERGUSE","G47","_Z","_Z","_Z","_Z","_Z","ENERGY","_Z","TJ_NCV","y"]
["FINCONS","SOLARTH","G471","TJ_NCV","RA410","ENERGUSE","G471","_Z","_Z","_Z","_Z","_Z","ENERGY","_Z","TJ_NCV","y"]
["FINCONS","SOLARTH","G47_X_G471","TJ_NCV","RA410","ENERGUSE","G47_X_G471","_Z","_Z","_Z","_Z","_Z","ENERGY","_Z","TJ_NCV","y"]
["FINCONS","SOLARTH","H52","TJ_NCV","RA410","ENERGUSE","H52","_Z","_Z","_Z","_Z","_Z","ENERGY","_Z","TJ_NCV","y"]
["FINCONS","SOLARTH","H52_STL","TJ_NCV","RA410","ENERGUSE","H52_STL","_Z","_Z","_Z","_Z","_Z","ENERGY","_Z","TJ_NCV","y"]
["FINCONS","SOLARTH","H53","TJ_NCV","RA410","ENERGUSE","H53","_Z","_Z","_Z","_Z","_Z","ENERGY","_Z","TJ_NCV","y"]
["FINCONS","SOLARTH","I","TJ_NCV","RA410","ENERGUSE","I","_Z","_Z","_Z","_Z","_Z","ENERGY","_Z","TJ_NCV","y"]
["FINCONS","SOLARTH","I55","TJ_NCV","RA410","ENERGUSE","I55","_Z","_Z","_Z","_Z","_Z","ENERGY","_Z","TJ_NCV","y"]
["FINCONS","SOLARTH","I55_HEAT","TJ_NCV","RA410","FC_OTH_CP_E_HEAT","I55","_Z","_Z","_Z","_Z","_Z","ENERGY","_Z","TJ_NCV","y"]
["FINCONS","SOLARTH","I55_S_HEAT","TJ_NCV","RA410","FC_OTH_CP_E_SH","I55","_Z","_Z","_Z","_Z","_Z","ENERGY","_Z","TJ_NCV","y"]
["FINCONS","SOLARTH","I55_W_HEAT","TJ_NCV","RA410","FC_OTH_CP_E_WH","I55","_Z","_Z","_Z","_Z","_Z","ENERGY","_Z","TJ_NCV","y"]
["FINCONS","SOLARTH","I55_COOL","TJ_NCV","RA410","FC_OTH_CP_E_CL","I55","_Z","_Z","_Z","_Z","_Z","ENERGY","_Z","TJ_NCV","y"]
["FINCONS","SOLARTH","I55_S_COOL","TJ_NCV","RA410","FC_OTH_CP_E_SC","I55","_Z","_Z","_Z","_Z","_Z","ENERGY","_Z","TJ_NCV","y"]
["FINCONS","SOLARTH","I55_P_COOL","TJ_NCV","RA410","FC_OTH_CP_E_PC","I55","_Z","_Z","_Z","_Z","_Z","ENERGY","_Z","TJ_NCV","y"]
["FINCONS","SOLARTH","I55_LIGHT","TJ_NCV","RA410","FC_OTH_CP_E_LOUT","I55","_Z","_Z","_Z","_Z","_Z","ENERGY","_Z","TJ_NCV","y"]
["FINCONS","SOLARTH","I55_IN_LIGHT","TJ_NCV","RA410","FC_OTH_CP_E_LINDRE","I55","_Z","_Z","_Z","_Z","_Z","ENERGY","_Z","TJ_NCV","y"]
["FINCONS","SOLARTH","I55_OTH_BUILD","TJ_NCV","RA410","FC_OTH_CP_E_OE_BLD","I55","_Z","_Z","_Z","_Z","_Z","ENERGY","_Z","TJ_NCV","y"]
["FINCONS","SOLARTH","I55_OTH_NBUILD","TJ_NCV","RA410","FC_OTH_CP_E_OE_NBLD","I55","_Z","_Z","_Z","_Z","_Z","ENERGY","_Z","TJ_NCV","y"]
["FINCONS","SOLARTH","I551","TJ_NCV","RA410","ENERGUSE","I551","_Z","_Z","_Z","_Z","_Z","ENERGY","_Z","TJ_NCV","y"]
["FINCONS","SOLARTH","I552","TJ_NCV","RA410","ENERGUSE","I552","_Z","_Z","_Z","_Z","_Z","ENERGY","_Z","TJ_NCV","y"]
["FINCONS","SOLARTH","I553","TJ_NCV","RA410","ENERGUSE","I553","_Z","_Z","_Z","_Z","_Z","ENERGY","_Z","TJ_NCV","y"]
["FINCONS","SOLARTH","I559","TJ_NCV","RA410","ENERGUSE","I559","_Z","_Z","_Z","_Z","_Z","ENERGY","_Z","TJ_NCV","y"]
["FINCONS","SOLARTH","I56","TJ_NCV","RA410","ENERGUSE","I56","_Z","_Z","_Z","_Z","_Z","ENERGY","_Z","TJ_NCV","y"]
["FINCONS","SOLARTH","I56_HEAT","TJ_NCV","RA410","FC_OTH_CP_E_HEAT","I56","_Z","_Z","_Z","_Z","_Z","ENERGY","_Z","TJ_NCV","y"]
["FINCONS","SOLARTH","I56_S_HEAT","TJ_NCV","RA410","FC_OTH_CP_E_SH","I56","_Z","_Z","_Z","_Z","_Z","ENERGY","_Z","TJ_NCV","y"]
["FINCONS","SOLARTH","I56_W_HEAT","TJ_NCV","RA410","FC_OTH_CP_E_WH","I56","_Z","_Z","_Z","_Z","_Z","ENERGY","_Z","TJ_NCV","y"]
["FINCONS","SOLARTH","I56_COOL","TJ_NCV","RA410","FC_OTH_CP_E_CL","I56","_Z","_Z","_Z","_Z","_Z","ENERGY","_Z","TJ_NCV","y"]
["FINCONS","SOLARTH","I56_S_COOL","TJ_NCV","RA410","FC_OTH_CP_E_SC","I56","_Z","_Z","_Z","_Z","_Z","ENERGY","_Z","TJ_NCV","y"]
["FINCONS","SOLARTH","I56_P_COOL","TJ_NCV","RA410","FC_OTH_CP_E_PC","I56","_Z","_Z","_Z","_Z","_Z","ENERGY","_Z","TJ_NCV","y"]
["FINCONS","SOLARTH","I56_LIGHT","TJ_NCV","RA410","FC_OTH_CP_E_LOUT","I56","_Z","_Z","_Z","_Z","_Z","ENERGY","_Z","TJ_NCV","y"]
["FINCONS","SOLARTH","I56_IN_LIGHT","TJ_NCV","RA410","FC_OTH_CP_E_LINDRE","I56","_Z","_Z","_Z","_Z","_Z","ENERGY","_Z","TJ_NCV","y"]
["FINCONS","SOLARTH","I56_OTH_BUILD","TJ_NCV","RA410","FC_OTH_CP_E_OE_BLD","I56","_Z","_Z","_Z","_Z","_Z","ENERGY","_Z","TJ_NCV","y"]
["FINCONS","SOLARTH","I56_OTH_NBUILD","TJ_NCV","RA410","FC_OTH_CP_E_OE_NBLD","I56","_Z","_Z","_Z","_Z","_Z","ENERGY","_Z","TJ_NCV","y"]
["FINCONS","SOLARTH","I561","TJ_NCV","RA410","ENERGUSE","I561","_Z","_Z","_Z","_Z","_Z","ENERGY","_Z","TJ_NCV","y"]
["FINCONS","SOLARTH","I562","TJ_NCV","RA410","ENERGUSE","I562","_Z","_Z","_Z","_Z","_Z","ENERGY","_Z","TJ_NCV","y"]
["FINCONS","SOLARTH","I563","TJ_NCV","RA410","ENERGUSE","I563","_Z","_Z","_Z","_Z","_Z","ENERGY","_Z","TJ_NCV","y"]
["FINCONS","SOLARTH","J","TJ_NCV","RA410","ENERGUSE","J","_Z","_Z","_Z","_Z","_Z","ENERGY","_Z","TJ_NCV","y"]
["FINCONS","SOLARTH","J58","TJ_NCV","RA410","ENERGUSE","J58","_Z","_Z","_Z","_Z","_Z","ENERGY","_Z","TJ_NCV","y"]
["FINCONS","SOLARTH","J59_J60","TJ_NCV","RA410","ENERGUSE","J59_J60","_Z","_Z","_Z","_Z","_Z","ENERGY","_Z","TJ_NCV","y"]
["FINCONS","SOLARTH","J61","TJ_NCV","RA410","ENERGUSE","J61","_Z","_Z","_Z","_Z","_Z","ENERGY","_Z","TJ_NCV","y"]
["FINCONS","SOLARTH","J62_J63","TJ_NCV","RA410","ENERGUSE","J62_J63","_Z","_Z","_Z","_Z","_Z","ENERGY","_Z","TJ_NCV","y"]
["FINCONS","SOLARTH","J62","TJ_NCV","RA410","ENERGUSE","J62","_Z","_Z","_Z","_Z","_Z","ENERGY","_Z","TJ_NCV","y"]
["FINCONS","SOLARTH","J63","TJ_NCV","RA410","ENERGUSE","J63","_Z","_Z","_Z","_Z","_Z","ENERGY","_Z","TJ_NCV","y"]
["FINCONS","SOLARTH","K_L","TJ_NCV","RA410","ENERGUSE","K_L","_Z","_Z","_Z","_Z","_Z","ENERGY","_Z","TJ_NCV","y"]
["FINCONS","SOLARTH","K","TJ_NCV","RA410","ENERGUSE","K","_Z","_Z","_Z","_Z","_Z","ENERGY","_Z","TJ_NCV","y"]
["FINCONS","SOLARTH","L","TJ_NCV","RA410","ENERGUSE","L","_Z","_Z","_Z","_Z","_Z","ENERGY","_Z","TJ_NCV","y"]
["FINCONS","SOLARTH","M_S","TJ_NCV","RA410","ENERGUSE","M_S","_Z","_Z","_Z","_Z","_Z","ENERGY","_Z","TJ_NCV","y"]
["FINCONS","SOLARTH","M","TJ_NCV","RA410","ENERGUSE","M","_Z","_Z","_Z","_Z","_Z","ENERGY","_Z","TJ_NCV","y"]
["FINCONS","SOLARTH","M69_M70","TJ_NCV","RA410","ENERGUSE","M69_M70","_Z","_Z","_Z","_Z","_Z","ENERGY","_Z","TJ_NCV","y"]
["FINCONS","SOLARTH","M71","TJ_NCV","RA410","ENERGUSE","M71","_Z","_Z","_Z","_Z","_Z","ENERGY","_Z","TJ_NCV","y"]
["FINCONS","SOLARTH","M72","TJ_NCV","RA410","ENERGUSE","M72","_Z","_Z","_Z","_Z","_Z","ENERGY","_Z","TJ_NCV","y"]
["FINCONS","SOLARTH","M73","TJ_NCV","RA410","ENERGUSE","M73","_Z","_Z","_Z","_Z","_Z","ENERGY","_Z","TJ_NCV","y"]
["FINCONS","SOLARTH","M74_M75","TJ_NCV","RA410","ENERGUSE","M74_M75","_Z","_Z","_Z","_Z","_Z","ENERGY","_Z","TJ_NCV","y"]
["FINCONS","SOLARTH","N","TJ_NCV","RA410","ENERGUSE","N","_Z","_Z","_Z","_Z","_Z","ENERGY","_Z","TJ_NCV","y"]
["FINCONS","SOLARTH","N77","TJ_NCV","RA410","ENERGUSE","N77","_Z","_Z","_Z","_Z","_Z","ENERGY","_Z","TJ_NCV","y"]
["FINCONS","SOLARTH","N78","TJ_NCV","RA410","ENERGUSE","N78","_Z","_Z","_Z","_Z","_Z","ENERGY","_Z","TJ_NCV","y"]
["FINCONS","SOLARTH","N79","TJ_NCV","RA410","ENERGUSE","N79","_Z","_Z","_Z","_Z","_Z","ENERGY","_Z","TJ_NCV","y"]
["FINCONS","SOLARTH","N80-N82","TJ_NCV","RA410","ENERGUSE","N80-N82","_Z","_Z","_Z","_Z","_Z","ENERGY","_Z","TJ_NCV","y"]
["FINCONS","SOLARTH","O","TJ_NCV","RA410","ENERGUSE","O","_Z","_Z","_Z","_Z","_Z","ENERGY","_Z","TJ_NCV","y"]
["FINCONS","SOLARTH","O_HEAT","TJ_NCV","RA410","FC_OTH_CP_E_HEAT","O","_Z","_Z","_Z","_Z","_Z","ENERGY","_Z","TJ_NCV","y"]
["FINCONS","SOLARTH","O_S_HEAT","TJ_NCV","RA410","FC_OTH_CP_E_SH","O","_Z","_Z","_Z","_Z","_Z","ENERGY","_Z","TJ_NCV","y"]
["FINCONS","SOLARTH","O_W_HEAT","TJ_NCV","RA410","FC_OTH_CP_E_WH","O","_Z","_Z","_Z","_Z","_Z","ENERGY","_Z","TJ_NCV","y"]
["FINCONS","SOLARTH","O_COOL","TJ_NCV","RA410","FC_OTH_CP_E_CL","O","_Z","_Z","_Z","_Z","_Z","ENERGY","_Z","TJ_NCV","y"]
["FINCONS","SOLARTH","O_S_COOL","TJ_NCV","RA410","FC_OTH_CP_E_SC","O","_Z","_Z","_Z","_Z","_Z","ENERGY","_Z","TJ_NCV","y"]
["FINCONS","SOLARTH","O_P_COOL","TJ_NCV","RA410","FC_OTH_CP_E_PC","O","_Z","_Z","_Z","_Z","_Z","ENERGY","_Z","TJ_NCV","y"]
["FINCONS","SOLARTH","O_LIGHT","TJ_NCV","RA410","FC_OTH_CP_E_LOUT","O","_Z","_Z","_Z","_Z","_Z","ENERGY","_Z","TJ_NCV","y"]
["FINCONS","SOLARTH","O_IN_LIGHT","TJ_NCV","RA410","FC_OTH_CP_E_LINDRE","O","_Z","_Z","_Z","_Z","_Z","ENERGY","_Z","TJ_NCV","y"]
["FINCONS","SOLARTH","O_OTH_BUILD","TJ_NCV","RA410","FC_OTH_CP_E_OE_BLD","O","_Z","_Z","_Z","_Z","_Z","ENERGY","_Z","TJ_NCV","y"]
["FINCONS","SOLARTH","O_OTH_NBUILD","TJ_NCV","RA410","FC_OTH_CP_E_OE_NBLD","O","_Z","_Z","_Z","_Z","_Z","ENERGY","_Z","TJ_NCV","y"]
["FINCONS","SOLARTH","P","TJ_NCV","RA410","ENERGUSE","P","_Z","_Z","_Z","_Z","_Z","ENERGY","_Z","TJ_NCV","y"]
["FINCONS","SOLARTH","Q","TJ_NCV","RA410","ENERGUSE","Q","_Z","_Z","_Z","_Z","_Z","ENERGY","_Z","TJ_NCV","y"]
["FINCONS","SOLARTH","Q861","TJ_NCV","RA410","ENERGUSE","Q861","_Z","_Z","_Z","_Z","_Z","ENERGY","_Z","TJ_NCV","y"]
["FINCONS","SOLARTH","Q861_HEAT","TJ_NCV","RA410","FC_OTH_CP_E_HEAT","Q861","_Z","_Z","_Z","_Z","_Z","ENERGY","_Z","TJ_NCV","y"]
["FINCONS","SOLARTH","Q861_S_HEAT","TJ_NCV","RA410","FC_OTH_CP_E_SH","Q861","_Z","_Z","_Z","_Z","_Z","ENERGY","_Z","TJ_NCV","y"]
["FINCONS","SOLARTH","Q861_W_HEAT","TJ_NCV","RA410","FC_OTH_CP_E_WH","Q861","_Z","_Z","_Z","_Z","_Z","ENERGY","_Z","TJ_NCV","y"]
["FINCONS","SOLARTH","Q861_COOL","TJ_NCV","RA410","FC_OTH_CP_E_CL","Q861","_Z","_Z","_Z","_Z","_Z","ENERGY","_Z","TJ_NCV","y"]
["FINCONS","SOLARTH","Q861_S_COOL","TJ_NCV","RA410","FC_OTH_CP_E_SC","Q861","_Z","_Z","_Z","_Z","_Z","ENERGY","_Z","TJ_NCV","y"]
["FINCONS","SOLARTH","Q861_P_COOL","TJ_NCV","RA410","FC_OTH_CP_E_PC","Q861","_Z","_Z","_Z","_Z","_Z","ENERGY","_Z","TJ_NCV","y"]
["FINCONS","SOLARTH","Q861_LIGHT","TJ_NCV","RA410","FC_OTH_CP_E_LOUT","Q861","_Z","_Z","_Z","_Z","_Z","ENERGY","_Z","TJ_NCV","y"]
["FINCONS","SOLARTH","Q861_IN_LIGHT","TJ_NCV","RA410","FC_OTH_CP_E_LINDRE","Q861","_Z","_Z","_Z","_Z","_Z","ENERGY","_Z","TJ_NCV","y"]
["FINCONS","SOLARTH","Q861_OTH_BUILD","TJ_NCV","RA410","FC_OTH_CP_E_OE_BLD","Q861","_Z","_Z","_Z","_Z","_Z","ENERGY","_Z","TJ_NCV","y"]
["FINCONS","SOLARTH","Q861_OTH_NBUILD","TJ_NCV","RA410","FC_OTH_CP_E_OE_NBLD","Q861","_Z","_Z","_Z","_Z","_Z","ENERGY","_Z","TJ_NCV","y"]
["FINCONS","SOLARTH","R","TJ_NCV","RA410","ENERGUSE","R","_Z","_Z","_Z","_Z","_Z","ENERGY","_Z","TJ_NCV","y"]
["FINCONS","SOLARTH","R90-R92","TJ_NCV","RA410","ENERGUSE","R90-R92","_Z","_Z","_Z","_Z","_Z","ENERGY","_Z","TJ_NCV","y"]
["FINCONS","SOLARTH","R93","TJ_NCV","RA410","ENERGUSE","R93","_Z","_Z","_Z","_Z","_Z","ENERGY","_Z","TJ_NCV","y"]
["FINCONS","SOLARTH","S","TJ_NCV","RA410","ENERGUSE","S","_Z","_Z","_Z","_Z","_Z","ENERGY","_Z","TJ_NCV","y"]
["FINCONS","SOLARTH","U","TJ_NCV","RA410","ENERGUSE","U","_Z","_Z","_Z","_Z","_Z","ENERGY","_Z","TJ_NCV","y"]
["FINCONS","SOLARTH","DATAC","TJ_NCV","RA410","ENERGUSE","DATAC","_Z","_Z","_Z","_Z","_Z","ENERGY","_Z","TJ_NCV","y"]
["FINCONS","SOLARTH","TOTSER","TJ_NCV","RA410","ENERGUSE","_T","_Z","_Z","_Z","_Z","_Z","ENERGY","_Z","TJ_NCV","y"]
["FINCONS","PRIMSBIO","C33","TJ_NCV","R510C","ENERGUSE","C33","_Z","_Z","_Z","_Z","_Z","ENERGY","_Z","TJ_NCV","y"]
["FINCONS","PRIMSBIO","E","TJ_NCV","R510C","ENERGUSE","E","_Z","_Z","_Z","_Z","_Z","ENERGY","_Z","TJ_NCV","y"]
["FINCONS","PRIMSBIO","E36","TJ_NCV","R510C","ENERGUSE","E36","_Z","_Z","_Z","_Z","_Z","ENERGY","_Z","TJ_NCV","y"]
["FINCONS","PRIMSBIO","E37-E39","TJ_NCV","R510C","ENERGUSE","E37-E39","_Z","_Z","_Z","_Z","_Z","ENERGY","_Z","TJ_NCV","y"]
["FINCONS","PRIMSBIO","E37","TJ_NCV","R510C","ENERGUSE","E37","_Z","_Z","_Z","_Z","_Z","ENERGY","_Z","TJ_NCV","y"]
["FINCONS","PRIMSBIO","E38","TJ_NCV","R510C","ENERGUSE","E38","_Z","_Z","_Z","_Z","_Z","ENERGY","_Z","TJ_NCV","y"]
["FINCONS","PRIMSBIO","E39","TJ_NCV","R510C","ENERGUSE","E39","_Z","_Z","_Z","_Z","_Z","ENERGY","_Z","TJ_NCV","y"]
["FINCONS","PRIMSBIO","G","TJ_NCV","R510C","ENERGUSE","G","_Z","_Z","_Z","_Z","_Z","ENERGY","_Z","TJ_NCV","y"]
["FINCONS","PRIMSBIO","G_HEAT","TJ_NCV","R510C","FC_OTH_CP_E_HEAT","G","_Z","_Z","_Z","_Z","_Z","ENERGY","_Z","TJ_NCV","y"]
["FINCONS","PRIMSBIO","G_S_HEAT","TJ_NCV","R510C","FC_OTH_CP_E_SH","G","_Z","_Z","_Z","_Z","_Z","ENERGY","_Z","TJ_NCV","y"]
["FINCONS","PRIMSBIO","G_W_HEAT","TJ_NCV","R510C","FC_OTH_CP_E_WH","G","_Z","_Z","_Z","_Z","_Z","ENERGY","_Z","TJ_NCV","y"]
["FINCONS","PRIMSBIO","G_COOL","TJ_NCV","R510C","FC_OTH_CP_E_CL","G","_Z","_Z","_Z","_Z","_Z","ENERGY","_Z","TJ_NCV","y"]
["FINCONS","PRIMSBIO","G_S_COOL","TJ_NCV","R510C","FC_OTH_CP_E_SC","G","_Z","_Z","_Z","_Z","_Z","ENERGY","_Z","TJ_NCV","y"]
["FINCONS","PRIMSBIO","G_P_COOL","TJ_NCV","R510C","FC_OTH_CP_E_PC","G","_Z","_Z","_Z","_Z","_Z","ENERGY","_Z","TJ_NCV","y"]
["FINCONS","PRIMSBIO","G_LIGHT","TJ_NCV","R510C","FC_OTH_CP_E_LOUT","G","_Z","_Z","_Z","_Z","_Z","ENERGY","_Z","TJ_NCV","y"]
["FINCONS","PRIMSBIO","G_IN_LIGHT","TJ_NCV","R510C","FC_OTH_CP_E_LINDRE","G","_Z","_Z","_Z","_Z","_Z","ENERGY","_Z","TJ_NCV","y"]
["FINCONS","PRIMSBIO","G_OTH_BUILD","TJ_NCV","R510C","FC_OTH_CP_E_OE_BLD","G","_Z","_Z","_Z","_Z","_Z","ENERGY","_Z","TJ_NCV","y"]
["FINCONS","PRIMSBIO","G_OTH_NBUILD","TJ_NCV","R510C","FC_OTH_CP_E_OE_NBLD","G","_Z","_Z","_Z","_Z","_Z","ENERGY","_Z","TJ_NCV","y"]
["FINCONS","PRIMSBIO","G45","TJ_NCV","R510C","ENERGUSE","G45","_Z","_Z","_Z","_Z","_Z","ENERGY","_Z","TJ_NCV","y"]
["FINCONS","PRIMSBIO","G46","TJ_NCV","R510C","ENERGUSE","G46","_Z","_Z","_Z","_Z","_Z","ENERGY","_Z","TJ_NCV","y"]
["FINCONS","PRIMSBIO","G47","TJ_NCV","R510C","ENERGUSE","G47","_Z","_Z","_Z","_Z","_Z","ENERGY","_Z","TJ_NCV","y"]
["FINCONS","PRIMSBIO","G471","TJ_NCV","R510C","ENERGUSE","G471","_Z","_Z","_Z","_Z","_Z","ENERGY","_Z","TJ_NCV","y"]
["FINCONS","PRIMSBIO","G47_X_G471","TJ_NCV","R510C","ENERGUSE","G47_X_G471","_Z","_Z","_Z","_Z","_Z","ENERGY","_Z","TJ_NCV","y"]
["FINCONS","PRIMSBIO","H52","TJ_NCV","R510C","ENERGUSE","H52","_Z","_Z","_Z","_Z","_Z","ENERGY","_Z","TJ_NCV","y"]
["FINCONS","PRIMSBIO","H52_STL","TJ_NCV","R510C","ENERGUSE","H52_STL","_Z","_Z","_Z","_Z","_Z","ENERGY","_Z","TJ_NCV","y"]
["FINCONS","PRIMSBIO","H53","TJ_NCV","R510C","ENERGUSE","H53","_Z","_Z","_Z","_Z","_Z","ENERGY","_Z","TJ_NCV","y"]
["FINCONS","PRIMSBIO","I","TJ_NCV","R510C","ENERGUSE","I","_Z","_Z","_Z","_Z","_Z","ENERGY","_Z","TJ_NCV","y"]
["FINCONS","PRIMSBIO","I55","TJ_NCV","R510C","ENERGUSE","I55","_Z","_Z","_Z","_Z","_Z","ENERGY","_Z","TJ_NCV","y"]
["FINCONS","PRIMSBIO","I55_HEAT","TJ_NCV","R510C","FC_OTH_CP_E_HEAT","I55","_Z","_Z","_Z","_Z","_Z","ENERGY","_Z","TJ_NCV","y"]
["FINCONS","PRIMSBIO","I55_S_HEAT","TJ_NCV","R510C","FC_OTH_CP_E_SH","I55","_Z","_Z","_Z","_Z","_Z","ENERGY","_Z","TJ_NCV","y"]
["FINCONS","PRIMSBIO","I55_W_HEAT","TJ_NCV","R510C","FC_OTH_CP_E_WH","I55","_Z","_Z","_Z","_Z","_Z","ENERGY","_Z","TJ_NCV","y"]
["FINCONS","PRIMSBIO","I55_COOL","TJ_NCV","R510C","FC_OTH_CP_E_CL","I55","_Z","_Z","_Z","_Z","_Z","ENERGY","_Z","TJ_NCV","y"]
["FINCONS","PRIMSBIO","I55_S_COOL","TJ_NCV","R510C","FC_OTH_CP_E_SC","I55","_Z","_Z","_Z","_Z","_Z","ENERGY","_Z","TJ_NCV","y"]
["FINCONS","PRIMSBIO","I55_P_COOL","TJ_NCV","R510C","FC_OTH_CP_E_PC","I55","_Z","_Z","_Z","_Z","_Z","ENERGY","_Z","TJ_NCV","y"]
["FINCONS","PRIMSBIO","I55_LIGHT","TJ_NCV","R510C","FC_OTH_CP_E_LOUT","I55","_Z","_Z","_Z","_Z","_Z","ENERGY","_Z","TJ_NCV","y"]
["FINCONS","PRIMSBIO","I55_IN_LIGHT","TJ_NCV","R510C","FC_OTH_CP_E_LINDRE","I55","_Z","_Z","_Z","_Z","_Z","ENERGY","_Z","TJ_NCV","y"]
["FINCONS","PRIMSBIO","I55_OTH_BUILD","TJ_NCV","R510C","FC_OTH_CP_E_OE_BLD","I55","_Z","_Z","_Z","_Z","_Z","ENERGY","_Z","TJ_NCV","y"]
["FINCONS","PRIMSBIO","I55_OTH_NBUILD","TJ_NCV","R510C","FC_OTH_CP_E_OE_NBLD","I55","_Z","_Z","_Z","_Z","_Z","ENERGY","_Z","TJ_NCV","y"]
["FINCONS","PRIMSBIO","I551","TJ_NCV","R510C","ENERGUSE","I551","_Z","_Z","_Z","_Z","_Z","ENERGY","_Z","TJ_NCV","y"]
["FINCONS","PRIMSBIO","I552","TJ_NCV","R510C","ENERGUSE","I552","_Z","_Z","_Z","_Z","_Z","ENERGY","_Z","TJ_NCV","y"]
["FINCONS","PRIMSBIO","I553","TJ_NCV","R510C","ENERGUSE","I553","_Z","_Z","_Z","_Z","_Z","ENERGY","_Z","TJ_NCV","y"]
["FINCONS","PRIMSBIO","I559","TJ_NCV","R510C","ENERGUSE","I559","_Z","_Z","_Z","_Z","_Z","ENERGY","_Z","TJ_NCV","y"]
["FINCONS","PRIMSBIO","I56","TJ_NCV","R510C","ENERGUSE","I56","_Z","_Z","_Z","_Z","_Z","ENERGY","_Z","TJ_NCV","y"]
["FINCONS","PRIMSBIO","I56_HEAT","TJ_NCV","R510C","FC_OTH_CP_E_HEAT","I56","_Z","_Z","_Z","_Z","_Z","ENERGY","_Z","TJ_NCV","y"]
["FINCONS","PRIMSBIO","I56_S_HEAT","TJ_NCV","R510C","FC_OTH_CP_E_SH","I56","_Z","_Z","_Z","_Z","_Z","ENERGY","_Z","TJ_NCV","y"]
["FINCONS","PRIMSBIO","I56_W_HEAT","TJ_NCV","R510C","FC_OTH_CP_E_WH","I56","_Z","_Z","_Z","_Z","_Z","ENERGY","_Z","TJ_NCV","y"]
["FINCONS","PRIMSBIO","I56_COOL","TJ_NCV","R510C","FC_OTH_CP_E_CL","I56","_Z","_Z","_Z","_Z","_Z","ENERGY","_Z","TJ_NCV","y"]
["FINCONS","PRIMSBIO","I56_S_COOL","TJ_NCV","R510C","FC_OTH_CP_E_SC","I56","_Z","_Z","_Z","_Z","_Z","ENERGY","_Z","TJ_NCV","y"]
["FINCONS","PRIMSBIO","I56_P_COOL","TJ_NCV","R510C","FC_OTH_CP_E_PC","I56","_Z","_Z","_Z","_Z","_Z","ENERGY","_Z","TJ_NCV","y"]
["FINCONS","PRIMSBIO","I56_LIGHT","TJ_NCV","R510C","FC_OTH_CP_E_LOUT","I56","_Z","_Z","_Z","_Z","_Z","ENERGY","_Z","TJ_NCV","y"]
["FINCONS","PRIMSBIO","I56_IN_LIGHT","TJ_NCV","R510C","FC_OTH_CP_E_LINDRE","I56","_Z","_Z","_Z","_Z","_Z","ENERGY","_Z","TJ_NCV","y"]
["FINCONS","PRIMSBIO","I56_OTH_BUILD","TJ_NCV","R510C","FC_OTH_CP_E_OE_BLD","I56","_Z","_Z","_Z","_Z","_Z","ENERGY","_Z","TJ_NCV","y"]
["FINCONS","PRIMSBIO","I56_OTH_NBUILD","TJ_NCV","R510C","FC_OTH_CP_E_OE_NBLD","I56","_Z","_Z","_Z","_Z","_Z","ENERGY","_Z","TJ_NCV","y"]
["FINCONS","PRIMSBIO","I561","TJ_NCV","R510C","ENERGUSE","I561","_Z","_Z","_Z","_Z","_Z","ENERGY","_Z","TJ_NCV","y"]
["FINCONS","PRIMSBIO","I562","TJ_NCV","R510C","ENERGUSE","I562","_Z","_Z","_Z","_Z","_Z","ENERGY","_Z","TJ_NCV","y"]
["FINCONS","PRIMSBIO","I563","TJ_NCV","R510C","ENERGUSE","I563","_Z","_Z","_Z","_Z","_Z","ENERGY","_Z","TJ_NCV","y"]
["FINCONS","PRIMSBIO","J","TJ_NCV","R510C","ENERGUSE","J","_Z","_Z","_Z","_Z","_Z","ENERGY","_Z","TJ_NCV","y"]
["FINCONS","PRIMSBIO","J58","TJ_NCV","R510C","ENERGUSE","J58","_Z","_Z","_Z","_Z","_Z","ENERGY","_Z","TJ_NCV","y"]
["FINCONS","PRIMSBIO","J59_J60","TJ_NCV","R510C","ENERGUSE","J59_J60","_Z","_Z","_Z","_Z","_Z","ENERGY","_Z","TJ_NCV","y"]
["FINCONS","PRIMSBIO","J61","TJ_NCV","R510C","ENERGUSE","J61","_Z","_Z","_Z","_Z","_Z","ENERGY","_Z","TJ_NCV","y"]
["FINCONS","PRIMSBIO","J62_J63","TJ_NCV","R510C","ENERGUSE","J62_J63","_Z","_Z","_Z","_Z","_Z","ENERGY","_Z","TJ_NCV","y"]
["FINCONS","PRIMSBIO","J62","TJ_NCV","R510C","ENERGUSE","J62","_Z","_Z","_Z","_Z","_Z","ENERGY","_Z","TJ_NCV","y"]
["FINCONS","PRIMSBIO","J63","TJ_NCV","R510C","ENERGUSE","J63","_Z","_Z","_Z","_Z","_Z","ENERGY","_Z","TJ_NCV","y"]
["FINCONS","PRIMSBIO","K_L","TJ_NCV","R510C","ENERGUSE","K_L","_Z","_Z","_Z","_Z","_Z","ENERGY","_Z","TJ_NCV","y"]
["FINCONS","PRIMSBIO","K","TJ_NCV","R510C","ENERGUSE","K","_Z","_Z","_Z","_Z","_Z","ENERGY","_Z","TJ_NCV","y"]
["FINCONS","PRIMSBIO","L","TJ_NCV","R510C","ENERGUSE","L","_Z","_Z","_Z","_Z","_Z","ENERGY","_Z","TJ_NCV","y"]
["FINCONS","PRIMSBIO","M_S","TJ_NCV","R510C","ENERGUSE","M_S","_Z","_Z","_Z","_Z","_Z","ENERGY","_Z","TJ_NCV","y"]
["FINCONS","PRIMSBIO","M","TJ_NCV","R510C","ENERGUSE","M","_Z","_Z","_Z","_Z","_Z","ENERGY","_Z","TJ_NCV","y"]
["FINCONS","PRIMSBIO","M69_M70","TJ_NCV","R510C","ENERGUSE","M69_M70","_Z","_Z","_Z","_Z","_Z","ENERGY","_Z","TJ_NCV","y"]
["FINCONS","PRIMSBIO","M71","TJ_NCV","R510C","ENERGUSE","M71","_Z","_Z","_Z","_Z","_Z","ENERGY","_Z","TJ_NCV","y"]
["FINCONS","PRIMSBIO","M72","TJ_NCV","R510C","ENERGUSE","M72","_Z","_Z","_Z","_Z","_Z","ENERGY","_Z","TJ_NCV","y"]
["FINCONS","PRIMSBIO","M73","TJ_NCV","R510C","ENERGUSE","M73","_Z","_Z","_Z","_Z","_Z","ENERGY","_Z","TJ_NCV","y"]
["FINCONS","PRIMSBIO","M74_M75","TJ_NCV","R510C","ENERGUSE","M74_M75","_Z","_Z","_Z","_Z","_Z","ENERGY","_Z","TJ_NCV","y"]
["FINCONS","PRIMSBIO","N","TJ_NCV","R510C","ENERGUSE","N","_Z","_Z","_Z","_Z","_Z","ENERGY","_Z","TJ_NCV","y"]
["FINCONS","PRIMSBIO","N77","TJ_NCV","R510C","ENERGUSE","N77","_Z","_Z","_Z","_Z","_Z","ENERGY","_Z","TJ_NCV","y"]
["FINCONS","PRIMSBIO","N78","TJ_NCV","R510C","ENERGUSE","N78","_Z","_Z","_Z","_Z","_Z","ENERGY","_Z","TJ_NCV","y"]
["FINCONS","PRIMSBIO","N79","TJ_NCV","R510C","ENERGUSE","N79","_Z","_Z","_Z","_Z","_Z","ENERGY","_Z","TJ_NCV","y"]
["FINCONS","PRIMSBIO","N80-N82","TJ_NCV","R510C","ENERGUSE","N80-N82","_Z","_Z","_Z","_Z","_Z","ENERGY","_Z","TJ_NCV","y"]
["FINCONS","PRIMSBIO","O","TJ_NCV","R510C","ENERGUSE","O","_Z","_Z","_Z","_Z","_Z","ENERGY","_Z","TJ_NCV","y"]
["FINCONS","PRIMSBIO","O_HEAT","TJ_NCV","R510C","FC_OTH_CP_E_HEAT","O","_Z","_Z","_Z","_Z","_Z","ENERGY","_Z","TJ_NCV","y"]
["FINCONS","PRIMSBIO","O_S_HEAT","TJ_NCV","R510C","FC_OTH_CP_E_SH","O","_Z","_Z","_Z","_Z","_Z","ENERGY","_Z","TJ_NCV","y"]
["FINCONS","PRIMSBIO","O_W_HEAT","TJ_NCV","R510C","FC_OTH_CP_E_WH","O","_Z","_Z","_Z","_Z","_Z","ENERGY","_Z","TJ_NCV","y"]
["FINCONS","PRIMSBIO","O_COOL","TJ_NCV","R510C","FC_OTH_CP_E_CL","O","_Z","_Z","_Z","_Z","_Z","ENERGY","_Z","TJ_NCV","y"]
["FINCONS","PRIMSBIO","O_S_COOL","TJ_NCV","R510C","FC_OTH_CP_E_SC","O","_Z","_Z","_Z","_Z","_Z","ENERGY","_Z","TJ_NCV","y"]
["FINCONS","PRIMSBIO","O_P_COOL","TJ_NCV","R510C","FC_OTH_CP_E_PC","O","_Z","_Z","_Z","_Z","_Z","ENERGY","_Z","TJ_NCV","y"]
["FINCONS","PRIMSBIO","O_LIGHT","TJ_NCV","R510C","FC_OTH_CP_E_LOUT","O","_Z","_Z","_Z","_Z","_Z","ENERGY","_Z","TJ_NCV","y"]
["FINCONS","PRIMSBIO","O_IN_LIGHT","TJ_NCV","R510C","FC_OTH_CP_E_LINDRE","O","_Z","_Z","_Z","_Z","_Z","ENERGY","_Z","TJ_NCV","y"]
["FINCONS","PRIMSBIO","O_OTH_BUILD","TJ_NCV","R510C","FC_OTH_CP_E_OE_BLD","O","_Z","_Z","_Z","_Z","_Z","ENERGY","_Z","TJ_NCV","y"]
["FINCONS","PRIMSBIO","O_OTH_NBUILD","TJ_NCV","R510C","FC_OTH_CP_E_OE_NBLD","O","_Z","_Z","_Z","_Z","_Z","ENERGY","_Z","TJ_NCV","y"]
["FINCONS","PRIMSBIO","P","TJ_NCV","R510C","ENERGUSE","P","_Z","_Z","_Z","_Z","_Z","ENERGY","_Z","TJ_NCV","y"]
["FINCONS","PRIMSBIO","Q","TJ_NCV","R510C","ENERGUSE","Q","_Z","_Z","_Z","_Z","_Z","ENERGY","_Z","TJ_NCV","y"]
["FINCONS","PRIMSBIO","Q861","TJ_NCV","R510C","ENERGUSE","Q861","_Z","_Z","_Z","_Z","_Z","ENERGY","_Z","TJ_NCV","y"]
["FINCONS","PRIMSBIO","Q861_HEAT","TJ_NCV","R510C","FC_OTH_CP_E_HEAT","Q861","_Z","_Z","_Z","_Z","_Z","ENERGY","_Z","TJ_NCV","y"]
["FINCONS","PRIMSBIO","Q861_S_HEAT","TJ_NCV","R510C","FC_OTH_CP_E_SH","Q861","_Z","_Z","_Z","_Z","_Z","ENERGY","_Z","TJ_NCV","y"]
["FINCONS","PRIMSBIO","Q861_W_HEAT","TJ_NCV","R510C","FC_OTH_CP_E_WH","Q861","_Z","_Z","_Z","_Z","_Z","ENERGY","_Z","TJ_NCV","y"]
["FINCONS","PRIMSBIO","Q861_COOL","TJ_NCV","R510C","FC_OTH_CP_E_CL","Q861","_Z","_Z","_Z","_Z","_Z","ENERGY","_Z","TJ_NCV","y"]
["FINCONS","PRIMSBIO","Q861_S_COOL","TJ_NCV","R510C","FC_OTH_CP_E_SC","Q861","_Z","_Z","_Z","_Z","_Z","ENERGY","_Z","TJ_NCV","y"]
["FINCONS","PRIMSBIO","Q861_P_COOL","TJ_NCV","R510C","FC_OTH_CP_E_PC","Q861","_Z","_Z","_Z","_Z","_Z","ENERGY","_Z","TJ_NCV","y"]
["FINCONS","PRIMSBIO","Q861_LIGHT","TJ_NCV","R510C","FC_OTH_CP_E_LOUT","Q861","_Z","_Z","_Z","_Z","_Z","ENERGY","_Z","TJ_NCV","y"]
["FINCONS","PRIMSBIO","Q861_IN_LIGHT","TJ_NCV","R510C","FC_OTH_CP_E_LINDRE","Q861","_Z","_Z","_Z","_Z","_Z","ENERGY","_Z","TJ_NCV","y"]
["FINCONS","PRIMSBIO","Q861_OTH_BUILD","TJ_NCV","R510C","FC_OTH_CP_E_OE_BLD","Q861","_Z","_Z","_Z","_Z","_Z","ENERGY","_Z","TJ_NCV","y"]
["FINCONS","PRIMSBIO","Q861_OTH_NBUILD","TJ_NCV","R510C","FC_OTH_CP_E_OE_NBLD","Q861","_Z","_Z","_Z","_Z","_Z","ENERGY","_Z","TJ_NCV","y"]
["FINCONS","PRIMSBIO","R","TJ_NCV","R510C","ENERGUSE","R","_Z","_Z","_Z","_Z","_Z","ENERGY","_Z","TJ_NCV","y"]
["FINCONS","PRIMSBIO","R90-R92","TJ_NCV","R510C","ENERGUSE","R90-R92","_Z","_Z","_Z","_Z","_Z","ENERGY","_Z","TJ_NCV","y"]
["FINCONS","PRIMSBIO","R93","TJ_NCV","R510C","ENERGUSE","R93","_Z","_Z","_Z","_Z","_Z","ENERGY","_Z","TJ_NCV","y"]
["FINCONS","PRIMSBIO","S","TJ_NCV","R510C","ENERGUSE","S","_Z","_Z","_Z","_Z","_Z","ENERGY","_Z","TJ_NCV","y"]
["FINCONS","PRIMSBIO","U","TJ_NCV","R510C","ENERGUSE","U","_Z","_Z","_Z","_Z","_Z","ENERGY","_Z","TJ_NCV","y"]
["FINCONS","PRIMSBIO","DATAC","TJ_NCV","R510C","ENERGUSE","DATAC","_Z","_Z","_Z","_Z","_Z","ENERGY","_Z","TJ_NCV","y"]
["FINCONS","PRIMSBIO","TOTSER","TJ_NCV","R510C","ENERGUSE","_T","_Z","_Z","_Z","_Z","_Z","ENERGY","_Z","TJ_NCV","y"]
["FINCONS","BIOGASES","C33","TJ_NCV","R5300","ENERGUSE","C33","_Z","_Z","_Z","_Z","_Z","ENERGY","_Z","TJ_NCV","y"]
["FINCONS","BIOGASES","E","TJ_NCV","R5300","ENERGUSE","E","_Z","_Z","_Z","_Z","_Z","ENERGY","_Z","TJ_NCV","y"]
["FINCONS","BIOGASES","E36","TJ_NCV","R5300","ENERGUSE","E36","_Z","_Z","_Z","_Z","_Z","ENERGY","_Z","TJ_NCV","y"]
["FINCONS","BIOGASES","E37-E39","TJ_NCV","R5300","ENERGUSE","E37-E39","_Z","_Z","_Z","_Z","_Z","ENERGY","_Z","TJ_NCV","y"]
["FINCONS","BIOGASES","E37","TJ_NCV","R5300","ENERGUSE","E37","_Z","_Z","_Z","_Z","_Z","ENERGY","_Z","TJ_NCV","y"]
["FINCONS","BIOGASES","E38","TJ_NCV","R5300","ENERGUSE","E38","_Z","_Z","_Z","_Z","_Z","ENERGY","_Z","TJ_NCV","y"]
["FINCONS","BIOGASES","E39","TJ_NCV","R5300","ENERGUSE","E39","_Z","_Z","_Z","_Z","_Z","ENERGY","_Z","TJ_NCV","y"]
["FINCONS","BIOGASES","G","TJ_NCV","R5300","ENERGUSE","G","_Z","_Z","_Z","_Z","_Z","ENERGY","_Z","TJ_NCV","y"]
["FINCONS","BIOGASES","G_HEAT","TJ_NCV","R5300","FC_OTH_CP_E_HEAT","G","_Z","_Z","_Z","_Z","_Z","ENERGY","_Z","TJ_NCV","y"]
["FINCONS","BIOGASES","G_S_HEAT","TJ_NCV","R5300","FC_OTH_CP_E_SH","G","_Z","_Z","_Z","_Z","_Z","ENERGY","_Z","TJ_NCV","y"]
["FINCONS","BIOGASES","G_W_HEAT","TJ_NCV","R5300","FC_OTH_CP_E_WH","G","_Z","_Z","_Z","_Z","_Z","ENERGY","_Z","TJ_NCV","y"]
["FINCONS","BIOGASES","G_COOL","TJ_NCV","R5300","FC_OTH_CP_E_CL","G","_Z","_Z","_Z","_Z","_Z","ENERGY","_Z","TJ_NCV","y"]
["FINCONS","BIOGASES","G_S_COOL","TJ_NCV","R5300","FC_OTH_CP_E_SC","G","_Z","_Z","_Z","_Z","_Z","ENERGY","_Z","TJ_NCV","y"]
["FINCONS","BIOGASES","G_P_COOL","TJ_NCV","R5300","FC_OTH_CP_E_PC","G","_Z","_Z","_Z","_Z","_Z","ENERGY","_Z","TJ_NCV","y"]
["FINCONS","BIOGASES","G_LIGHT","TJ_NCV","R5300","FC_OTH_CP_E_LOUT","G","_Z","_Z","_Z","_Z","_Z","ENERGY","_Z","TJ_NCV","y"]
["FINCONS","BIOGASES","G_IN_LIGHT","TJ_NCV","R5300","FC_OTH_CP_E_LINDRE","G","_Z","_Z","_Z","_Z","_Z","ENERGY","_Z","TJ_NCV","y"]
["FINCONS","BIOGASES","G_OTH_BUILD","TJ_NCV","R5300","FC_OTH_CP_E_OE_BLD","G","_Z","_Z","_Z","_Z","_Z","ENERGY","_Z","TJ_NCV","y"]
["FINCONS","BIOGASES","G_OTH_NBUILD","TJ_NCV","R5300","FC_OTH_CP_E_OE_NBLD","G","_Z","_Z","_Z","_Z","_Z","ENERGY","_Z","TJ_NCV","y"]
["FINCONS","BIOGASES","G45","TJ_NCV","R5300","ENERGUSE","G45","_Z","_Z","_Z","_Z","_Z","ENERGY","_Z","TJ_NCV","y"]
["FINCONS","BIOGASES","G46","TJ_NCV","R5300","ENERGUSE","G46","_Z","_Z","_Z","_Z","_Z","ENERGY","_Z","TJ_NCV","y"]
["FINCONS","BIOGASES","G47","TJ_NCV","R5300","ENERGUSE","G47","_Z","_Z","_Z","_Z","_Z","ENERGY","_Z","TJ_NCV","y"]
["FINCONS","BIOGASES","G471","TJ_NCV","R5300","ENERGUSE","G471","_Z","_Z","_Z","_Z","_Z","ENERGY","_Z","TJ_NCV","y"]
["FINCONS","BIOGASES","G47_X_G471","TJ_NCV","R5300","ENERGUSE","G47_X_G471","_Z","_Z","_Z","_Z","_Z","ENERGY","_Z","TJ_NCV","y"]
["FINCONS","BIOGASES","H52","TJ_NCV","R5300","ENERGUSE","H52","_Z","_Z","_Z","_Z","_Z","ENERGY","_Z","TJ_NCV","y"]
["FINCONS","BIOGASES","H52_STL","TJ_NCV","R5300","ENERGUSE","H52_STL","_Z","_Z","_Z","_Z","_Z","ENERGY","_Z","TJ_NCV","y"]
["FINCONS","BIOGASES","H53","TJ_NCV","R5300","ENERGUSE","H53","_Z","_Z","_Z","_Z","_Z","ENERGY","_Z","TJ_NCV","y"]
["FINCONS","BIOGASES","I","TJ_NCV","R5300","ENERGUSE","I","_Z","_Z","_Z","_Z","_Z","ENERGY","_Z","TJ_NCV","y"]
["FINCONS","BIOGASES","I55","TJ_NCV","R5300","ENERGUSE","I55","_Z","_Z","_Z","_Z","_Z","ENERGY","_Z","TJ_NCV","y"]
["FINCONS","BIOGASES","I55_HEAT","TJ_NCV","R5300","FC_OTH_CP_E_HEAT","I55","_Z","_Z","_Z","_Z","_Z","ENERGY","_Z","TJ_NCV","y"]
["FINCONS","BIOGASES","I55_S_HEAT","TJ_NCV","R5300","FC_OTH_CP_E_SH","I55","_Z","_Z","_Z","_Z","_Z","ENERGY","_Z","TJ_NCV","y"]
["FINCONS","BIOGASES","I55_W_HEAT","TJ_NCV","R5300","FC_OTH_CP_E_WH","I55","_Z","_Z","_Z","_Z","_Z","ENERGY","_Z","TJ_NCV","y"]
["FINCONS","BIOGASES","I55_COOL","TJ_NCV","R5300","FC_OTH_CP_E_CL","I55","_Z","_Z","_Z","_Z","_Z","ENERGY","_Z","TJ_NCV","y"]
["FINCONS","BIOGASES","I55_S_COOL","TJ_NCV","R5300","FC_OTH_CP_E_SC","I55","_Z","_Z","_Z","_Z","_Z","ENERGY","_Z","TJ_NCV","y"]
["FINCONS","BIOGASES","I55_P_COOL","TJ_NCV","R5300","FC_OTH_CP_E_PC","I55","_Z","_Z","_Z","_Z","_Z","ENERGY","_Z","TJ_NCV","y"]
["FINCONS","BIOGASES","I55_LIGHT","TJ_NCV","R5300","FC_OTH_CP_E_LOUT","I55","_Z","_Z","_Z","_Z","_Z","ENERGY","_Z","TJ_NCV","y"]
["FINCONS","BIOGASES","I55_IN_LIGHT","TJ_NCV","R5300","FC_OTH_CP_E_LINDRE","I55","_Z","_Z","_Z","_Z","_Z","ENERGY","_Z","TJ_NCV","y"]
["FINCONS","BIOGASES","I55_OTH_BUILD","TJ_NCV","R5300","FC_OTH_CP_E_OE_BLD","I55","_Z","_Z","_Z","_Z","_Z","ENERGY","_Z","TJ_NCV","y"]
["FINCONS","BIOGASES","I55_OTH_NBUILD","TJ_NCV","R5300","FC_OTH_CP_E_OE_NBLD","I55","_Z","_Z","_Z","_Z","_Z","ENERGY","_Z","TJ_NCV","y"]
["FINCONS","BIOGASES","I551","TJ_NCV","R5300","ENERGUSE","I551","_Z","_Z","_Z","_Z","_Z","ENERGY","_Z","TJ_NCV","y"]
["FINCONS","BIOGASES","I552","TJ_NCV","R5300","ENERGUSE","I552","_Z","_Z","_Z","_Z","_Z","ENERGY","_Z","TJ_NCV","y"]
["FINCONS","BIOGASES","I553","TJ_NCV","R5300","ENERGUSE","I553","_Z","_Z","_Z","_Z","_Z","ENERGY","_Z","TJ_NCV","y"]
["FINCONS","BIOGASES","I559","TJ_NCV","R5300","ENERGUSE","I559","_Z","_Z","_Z","_Z","_Z","ENERGY","_Z","TJ_NCV","y"]
["FINCONS","BIOGASES","I56","TJ_NCV","R5300","ENERGUSE","I56","_Z","_Z","_Z","_Z","_Z","ENERGY","_Z","TJ_NCV","y"]
["FINCONS","BIOGASES","I56_HEAT","TJ_NCV","R5300","FC_OTH_CP_E_HEAT","I56","_Z","_Z","_Z","_Z","_Z","ENERGY","_Z","TJ_NCV","y"]
["FINCONS","BIOGASES","I56_S_HEAT","TJ_NCV","R5300","FC_OTH_CP_E_SH","I56","_Z","_Z","_Z","_Z","_Z","ENERGY","_Z","TJ_NCV","y"]
["FINCONS","BIOGASES","I56_W_HEAT","TJ_NCV","R5300","FC_OTH_CP_E_WH","I56","_Z","_Z","_Z","_Z","_Z","ENERGY","_Z","TJ_NCV","y"]
["FINCONS","BIOGASES","I56_COOL","TJ_NCV","R5300","FC_OTH_CP_E_CL","I56","_Z","_Z","_Z","_Z","_Z","ENERGY","_Z","TJ_NCV","y"]
["FINCONS","BIOGASES","I56_S_COOL","TJ_NCV","R5300","FC_OTH_CP_E_SC","I56","_Z","_Z","_Z","_Z","_Z","ENERGY","_Z","TJ_NCV","y"]
["FINCONS","BIOGASES","I56_P_COOL","TJ_NCV","R5300","FC_OTH_CP_E_PC","I56","_Z","_Z","_Z","_Z","_Z","ENERGY","_Z","TJ_NCV","y"]
["FINCONS","BIOGASES","I56_LIGHT","TJ_NCV","R5300","FC_OTH_CP_E_LOUT","I56","_Z","_Z","_Z","_Z","_Z","ENERGY","_Z","TJ_NCV","y"]
["FINCONS","BIOGASES","I56_IN_LIGHT","TJ_NCV","R5300","FC_OTH_CP_E_LINDRE","I56","_Z","_Z","_Z","_Z","_Z","ENERGY","_Z","TJ_NCV","y"]
["FINCONS","BIOGASES","I56_OTH_BUILD","TJ_NCV","R5300","FC_OTH_CP_E_OE_BLD","I56","_Z","_Z","_Z","_Z","_Z","ENERGY","_Z","TJ_NCV","y"]
["FINCONS","BIOGASES","I56_OTH_NBUILD","TJ_NCV","R5300","FC_OTH_CP_E_OE_NBLD","I56","_Z","_Z","_Z","_Z","_Z","ENERGY","_Z","TJ_NCV","y"]
["FINCONS","BIOGASES","I561","TJ_NCV","R5300","ENERGUSE","I561","_Z","_Z","_Z","_Z","_Z","ENERGY","_Z","TJ_NCV","y"]
["FINCONS","BIOGASES","I562","TJ_NCV","R5300","ENERGUSE","I562","_Z","_Z","_Z","_Z","_Z","ENERGY","_Z","TJ_NCV","y"]
["FINCONS","BIOGASES","I563","TJ_NCV","R5300","ENERGUSE","I563","_Z","_Z","_Z","_Z","_Z","ENERGY","_Z","TJ_NCV","y"]
["FINCONS","BIOGASES","J","TJ_NCV","R5300","ENERGUSE","J","_Z","_Z","_Z","_Z","_Z","ENERGY","_Z","TJ_NCV","y"]
["FINCONS","BIOGASES","J58","TJ_NCV","R5300","ENERGUSE","J58","_Z","_Z","_Z","_Z","_Z","ENERGY","_Z","TJ_NCV","y"]
["FINCONS","BIOGASES","J59_J60","TJ_NCV","R5300","ENERGUSE","J59_J60","_Z","_Z","_Z","_Z","_Z","ENERGY","_Z","TJ_NCV","y"]
["FINCONS","BIOGASES","J61","TJ_NCV","R5300","ENERGUSE","J61","_Z","_Z","_Z","_Z","_Z","ENERGY","_Z","TJ_NCV","y"]
["FINCONS","BIOGASES","J62_J63","TJ_NCV","R5300","ENERGUSE","J62_J63","_Z","_Z","_Z","_Z","_Z","ENERGY","_Z","TJ_NCV","y"]
["FINCONS","BIOGASES","J62","TJ_NCV","R5300","ENERGUSE","J62","_Z","_Z","_Z","_Z","_Z","ENERGY","_Z","TJ_NCV","y"]
["FINCONS","BIOGASES","J63","TJ_NCV","R5300","ENERGUSE","J63","_Z","_Z","_Z","_Z","_Z","ENERGY","_Z","TJ_NCV","y"]
["FINCONS","BIOGASES","K_L","TJ_NCV","R5300","ENERGUSE","K_L","_Z","_Z","_Z","_Z","_Z","ENERGY","_Z","TJ_NCV","y"]
["FINCONS","BIOGASES","K","TJ_NCV","R5300","ENERGUSE","K","_Z","_Z","_Z","_Z","_Z","ENERGY","_Z","TJ_NCV","y"]
["FINCONS","BIOGASES","L","TJ_NCV","R5300","ENERGUSE","L","_Z","_Z","_Z","_Z","_Z","ENERGY","_Z","TJ_NCV","y"]
["FINCONS","BIOGASES","M_S","TJ_NCV","R5300","ENERGUSE","M_S","_Z","_Z","_Z","_Z","_Z","ENERGY","_Z","TJ_NCV","y"]
["FINCONS","BIOGASES","M","TJ_NCV","R5300","ENERGUSE","M","_Z","_Z","_Z","_Z","_Z","ENERGY","_Z","TJ_NCV","y"]
["FINCONS","BIOGASES","M69_M70","TJ_NCV","R5300","ENERGUSE","M69_M70","_Z","_Z","_Z","_Z","_Z","ENERGY","_Z","TJ_NCV","y"]
["FINCONS","BIOGASES","M71","TJ_NCV","R5300","ENERGUSE","M71","_Z","_Z","_Z","_Z","_Z","ENERGY","_Z","TJ_NCV","y"]
["FINCONS","BIOGASES","M72","TJ_NCV","R5300","ENERGUSE","M72","_Z","_Z","_Z","_Z","_Z","ENERGY","_Z","TJ_NCV","y"]
["FINCONS","BIOGASES","M73","TJ_NCV","R5300","ENERGUSE","M73","_Z","_Z","_Z","_Z","_Z","ENERGY","_Z","TJ_NCV","y"]
["FINCONS","BIOGASES","M74_M75","TJ_NCV","R5300","ENERGUSE","M74_M75","_Z","_Z","_Z","_Z","_Z","ENERGY","_Z","TJ_NCV","y"]
["FINCONS","BIOGASES","N","TJ_NCV","R5300","ENERGUSE","N","_Z","_Z","_Z","_Z","_Z","ENERGY","_Z","TJ_NCV","y"]
["FINCONS","BIOGASES","N77","TJ_NCV","R5300","ENERGUSE","N77","_Z","_Z","_Z","_Z","_Z","ENERGY","_Z","TJ_NCV","y"]
["FINCONS","BIOGASES","N78","TJ_NCV","R5300","ENERGUSE","N78","_Z","_Z","_Z","_Z","_Z","ENERGY","_Z","TJ_NCV","y"]
["FINCONS","BIOGASES","N79","TJ_NCV","R5300","ENERGUSE","N79","_Z","_Z","_Z","_Z","_Z","ENERGY","_Z","TJ_NCV","y"]
["FINCONS","BIOGASES","N80-N82","TJ_NCV","R5300","ENERGUSE","N80-N82","_Z","_Z","_Z","_Z","_Z","ENERGY","_Z","TJ_NCV","y"]
["FINCONS","BIOGASES","O","TJ_NCV","R5300","ENERGUSE","O","_Z","_Z","_Z","_Z","_Z","ENERGY","_Z","TJ_NCV","y"]
["FINCONS","BIOGASES","O_HEAT","TJ_NCV","R5300","FC_OTH_CP_E_HEAT","O","_Z","_Z","_Z","_Z","_Z","ENERGY","_Z","TJ_NCV","y"]
["FINCONS","BIOGASES","O_S_HEAT","TJ_NCV","R5300","FC_OTH_CP_E_SH","O","_Z","_Z","_Z","_Z","_Z","ENERGY","_Z","TJ_NCV","y"]
["FINCONS","BIOGASES","O_W_HEAT","TJ_NCV","R5300","FC_OTH_CP_E_WH","O","_Z","_Z","_Z","_Z","_Z","ENERGY","_Z","TJ_NCV","y"]
["FINCONS","BIOGASES","O_COOL","TJ_NCV","R5300","FC_OTH_CP_E_CL","O","_Z","_Z","_Z","_Z","_Z","ENERGY","_Z","TJ_NCV","y"]
["FINCONS","BIOGASES","O_S_COOL","TJ_NCV","R5300","FC_OTH_CP_E_SC","O","_Z","_Z","_Z","_Z","_Z","ENERGY","_Z","TJ_NCV","y"]
["FINCONS","BIOGASES","O_P_COOL","TJ_NCV","R5300","FC_OTH_CP_E_PC","O","_Z","_Z","_Z","_Z","_Z","ENERGY","_Z","TJ_NCV","y"]
["FINCONS","BIOGASES","O_LIGHT","TJ_NCV","R5300","FC_OTH_CP_E_LOUT","O","_Z","_Z","_Z","_Z","_Z","ENERGY","_Z","TJ_NCV","y"]
["FINCONS","BIOGASES","O_IN_LIGHT","TJ_NCV","R5300","FC_OTH_CP_E_LINDRE","O","_Z","_Z","_Z","_Z","_Z","ENERGY","_Z","TJ_NCV","y"]
["FINCONS","BIOGASES","O_OTH_BUILD","TJ_NCV","R5300","FC_OTH_CP_E_OE_BLD","O","_Z","_Z","_Z","_Z","_Z","ENERGY","_Z","TJ_NCV","y"]
["FINCONS","BIOGASES","O_OTH_NBUILD","TJ_NCV","R5300","FC_OTH_CP_E_OE_NBLD","O","_Z","_Z","_Z","_Z","_Z","ENERGY","_Z","TJ_NCV","y"]
["FINCONS","BIOGASES","P","TJ_NCV","R5300","ENERGUSE","P","_Z","_Z","_Z","_Z","_Z","ENERGY","_Z","TJ_NCV","y"]
["FINCONS","BIOGASES","Q","TJ_NCV","R5300","ENERGUSE","Q","_Z","_Z","_Z","_Z","_Z","ENERGY","_Z","TJ_NCV","y"]
["FINCONS","BIOGASES","Q861","TJ_NCV","R5300","ENERGUSE","Q861","_Z","_Z","_Z","_Z","_Z","ENERGY","_Z","TJ_NCV","y"]
["FINCONS","BIOGASES","Q861_HEAT","TJ_NCV","R5300","FC_OTH_CP_E_HEAT","Q861","_Z","_Z","_Z","_Z","_Z","ENERGY","_Z","TJ_NCV","y"]
["FINCONS","BIOGASES","Q861_S_HEAT","TJ_NCV","R5300","FC_OTH_CP_E_SH","Q861","_Z","_Z","_Z","_Z","_Z","ENERGY","_Z","TJ_NCV","y"]
["FINCONS","BIOGASES","Q861_W_HEAT","TJ_NCV","R5300","FC_OTH_CP_E_WH","Q861","_Z","_Z","_Z","_Z","_Z","ENERGY","_Z","TJ_NCV","y"]
["FINCONS","BIOGASES","Q861_COOL","TJ_NCV","R5300","FC_OTH_CP_E_CL","Q861","_Z","_Z","_Z","_Z","_Z","ENERGY","_Z","TJ_NCV","y"]
["FINCONS","BIOGASES","Q861_S_COOL","TJ_NCV","R5300","FC_OTH_CP_E_SC","Q861","_Z","_Z","_Z","_Z","_Z","ENERGY","_Z","TJ_NCV","y"]
["FINCONS","BIOGASES","Q861_P_COOL","TJ_NCV","R5300","FC_OTH_CP_E_PC","Q861","_Z","_Z","_Z","_Z","_Z","ENERGY","_Z","TJ_NCV","y"]
["FINCONS","BIOGASES","Q861_LIGHT","TJ_NCV","R5300","FC_OTH_CP_E_LOUT","Q861","_Z","_Z","_Z","_Z","_Z","ENERGY","_Z","TJ_NCV","y"]
["FINCONS","BIOGASES","Q861_IN_LIGHT","TJ_NCV","R5300","FC_OTH_CP_E_LINDRE","Q861","_Z","_Z","_Z","_Z","_Z","ENERGY","_Z","TJ_NCV","y"]
["FINCONS","BIOGASES","Q861_OTH_BUILD","TJ_NCV","R5300","FC_OTH_CP_E_OE_BLD","Q861","_Z","_Z","_Z","_Z","_Z","ENERGY","_Z","TJ_NCV","y"]
["FINCONS","BIOGASES","Q861_OTH_NBUILD","TJ_NCV","R5300","FC_OTH_CP_E_OE_NBLD","Q861","_Z","_Z","_Z","_Z","_Z","ENERGY","_Z","TJ_NCV","y"]
["FINCONS","BIOGASES","R","TJ_NCV","R5300","ENERGUSE","R","_Z","_Z","_Z","_Z","_Z","ENERGY","_Z","TJ_NCV","y"]
["FINCONS","BIOGASES","R90-R92","TJ_NCV","R5300","ENERGUSE","R90-R92","_Z","_Z","_Z","_Z","_Z","ENERGY","_Z","TJ_NCV","y"]
["FINCONS","BIOGASES","R93","TJ_NCV","R5300","ENERGUSE","R93","_Z","_Z","_Z","_Z","_Z","ENERGY","_Z","TJ_NCV","y"]
["FINCONS","BIOGASES","S","TJ_NCV","R5300","ENERGUSE","S","_Z","_Z","_Z","_Z","_Z","ENERGY","_Z","TJ_NCV","y"]
["FINCONS","BIOGASES","U","TJ_NCV","R5300","ENERGUSE","U","_Z","_Z","_Z","_Z","_Z","ENERGY","_Z","TJ_NCV","y"]
["FINCONS","BIOGASES","DATAC","TJ_NCV","R5300","ENERGUSE","DATAC","_Z","_Z","_Z","_Z","_Z","ENERGY","_Z","TJ_NCV","y"]
["FINCONS","BIOGASES","TOTSER","TJ_NCV","R5300","ENERGUSE","_T","_Z","_Z","_Z","_Z","_Z","ENERGY","_Z","TJ_NCV","y"]
["FINCONS","GEOTHERM","C33","TJ_NCV","RA200","ENERGUSE","C33","_Z","_Z","_Z","_Z","_Z","ENERGY","_Z","TJ_NCV","y"]
["FINCONS","GEOTHERM","E","TJ_NCV","RA200","ENERGUSE","E","_Z","_Z","_Z","_Z","_Z","ENERGY","_Z","TJ_NCV","y"]
["FINCONS","GEOTHERM","E36","TJ_NCV","RA200","ENERGUSE","E36","_Z","_Z","_Z","_Z","_Z","ENERGY","_Z","TJ_NCV","y"]
["FINCONS","GEOTHERM","E37-E39","TJ_NCV","RA200","ENERGUSE","E37-E39","_Z","_Z","_Z","_Z","_Z","ENERGY","_Z","TJ_NCV","y"]
["FINCONS","GEOTHERM","E37","TJ_NCV","RA200","ENERGUSE","E37","_Z","_Z","_Z","_Z","_Z","ENERGY","_Z","TJ_NCV","y"]
["FINCONS","GEOTHERM","E38","TJ_NCV","RA200","ENERGUSE","E38","_Z","_Z","_Z","_Z","_Z","ENERGY","_Z","TJ_NCV","y"]
["FINCONS","GEOTHERM","E39","TJ_NCV","RA200","ENERGUSE","E39","_Z","_Z","_Z","_Z","_Z","ENERGY","_Z","TJ_NCV","y"]
["FINCONS","GEOTHERM","G","TJ_NCV","RA200","ENERGUSE","G","_Z","_Z","_Z","_Z","_Z","ENERGY","_Z","TJ_NCV","y"]
["FINCONS","GEOTHERM","G_HEAT","TJ_NCV","RA200","FC_OTH_CP_E_HEAT","G","_Z","_Z","_Z","_Z","_Z","ENERGY","_Z","TJ_NCV","y"]
["FINCONS","GEOTHERM","G_S_HEAT","TJ_NCV","RA200","FC_OTH_CP_E_SH","G","_Z","_Z","_Z","_Z","_Z","ENERGY","_Z","TJ_NCV","y"]
["FINCONS","GEOTHERM","G_W_HEAT","TJ_NCV","RA200","FC_OTH_CP_E_WH","G","_Z","_Z","_Z","_Z","_Z","ENERGY","_Z","TJ_NCV","y"]
["FINCONS","GEOTHERM","G_COOL","TJ_NCV","RA200","FC_OTH_CP_E_CL","G","_Z","_Z","_Z","_Z","_Z","ENERGY","_Z","TJ_NCV","y"]
["FINCONS","GEOTHERM","G_S_COOL","TJ_NCV","RA200","FC_OTH_CP_E_SC","G","_Z","_Z","_Z","_Z","_Z","ENERGY","_Z","TJ_NCV","y"]
["FINCONS","GEOTHERM","G_P_COOL","TJ_NCV","RA200","FC_OTH_CP_E_PC","G","_Z","_Z","_Z","_Z","_Z","ENERGY","_Z","TJ_NCV","y"]
["FINCONS","GEOTHERM","G_LIGHT","TJ_NCV","RA200","FC_OTH_CP_E_LOUT","G","_Z","_Z","_Z","_Z","_Z","ENERGY","_Z","TJ_NCV","y"]
["FINCONS","GEOTHERM","G_IN_LIGHT","TJ_NCV","RA200","FC_OTH_CP_E_LINDRE","G","_Z","_Z","_Z","_Z","_Z","ENERGY","_Z","TJ_NCV","y"]
["FINCONS","GEOTHERM","G_OTH_BUILD","TJ_NCV","RA200","FC_OTH_CP_E_OE_BLD","G","_Z","_Z","_Z","_Z","_Z","ENERGY","_Z","TJ_NCV","y"]
["FINCONS","GEOTHERM","G_OTH_NBUILD","TJ_NCV","RA200","FC_OTH_CP_E_OE_NBLD","G","_Z","_Z","_Z","_Z","_Z","ENERGY","_Z","TJ_NCV","y"]
["FINCONS","GEOTHERM","G45","TJ_NCV","RA200","ENERGUSE","G45","_Z","_Z","_Z","_Z","_Z","ENERGY","_Z","TJ_NCV","y"]
["FINCONS","GEOTHERM","G46","TJ_NCV","RA200","ENERGUSE","G46","_Z","_Z","_Z","_Z","_Z","ENERGY","_Z","TJ_NCV","y"]
["FINCONS","GEOTHERM","G47","TJ_NCV","RA200","ENERGUSE","G47","_Z","_Z","_Z","_Z","_Z","ENERGY","_Z","TJ_NCV","y"]
["FINCONS","GEOTHERM","G471","TJ_NCV","RA200","ENERGUSE","G471","_Z","_Z","_Z","_Z","_Z","ENERGY","_Z","TJ_NCV","y"]
["FINCONS","GEOTHERM","G47_X_G471","TJ_NCV","RA200","ENERGUSE","G47_X_G471","_Z","_Z","_Z","_Z","_Z","ENERGY","_Z","TJ_NCV","y"]
["FINCONS","GEOTHERM","H52","TJ_NCV","RA200","ENERGUSE","H52","_Z","_Z","_Z","_Z","_Z","ENERGY","_Z","TJ_NCV","y"]
["FINCONS","GEOTHERM","H52_STL","TJ_NCV","RA200","ENERGUSE","H52_STL","_Z","_Z","_Z","_Z","_Z","ENERGY","_Z","TJ_NCV","y"]
["FINCONS","GEOTHERM","H53","TJ_NCV","RA200","ENERGUSE","H53","_Z","_Z","_Z","_Z","_Z","ENERGY","_Z","TJ_NCV","y"]
["FINCONS","GEOTHERM","I","TJ_NCV","RA200","ENERGUSE","I","_Z","_Z","_Z","_Z","_Z","ENERGY","_Z","TJ_NCV","y"]
["FINCONS","GEOTHERM","I55","TJ_NCV","RA200","ENERGUSE","I55","_Z","_Z","_Z","_Z","_Z","ENERGY","_Z","TJ_NCV","y"]
["FINCONS","GEOTHERM","I55_HEAT","TJ_NCV","RA200","FC_OTH_CP_E_HEAT","I55","_Z","_Z","_Z","_Z","_Z","ENERGY","_Z","TJ_NCV","y"]
["FINCONS","GEOTHERM","I55_S_HEAT","TJ_NCV","RA200","FC_OTH_CP_E_SH","I55","_Z","_Z","_Z","_Z","_Z","ENERGY","_Z","TJ_NCV","y"]
["FINCONS","GEOTHERM","I55_W_HEAT","TJ_NCV","RA200","FC_OTH_CP_E_WH","I55","_Z","_Z","_Z","_Z","_Z","ENERGY","_Z","TJ_NCV","y"]
["FINCONS","GEOTHERM","I55_COOL","TJ_NCV","RA200","FC_OTH_CP_E_CL","I55","_Z","_Z","_Z","_Z","_Z","ENERGY","_Z","TJ_NCV","y"]
["FINCONS","GEOTHERM","I55_S_COOL","TJ_NCV","RA200","FC_OTH_CP_E_SC","I55","_Z","_Z","_Z","_Z","_Z","ENERGY","_Z","TJ_NCV","y"]
["FINCONS","GEOTHERM","I55_P_COOL","TJ_NCV","RA200","FC_OTH_CP_E_PC","I55","_Z","_Z","_Z","_Z","_Z","ENERGY","_Z","TJ_NCV","y"]
["FINCONS","GEOTHERM","I55_LIGHT","TJ_NCV","RA200","FC_OTH_CP_E_LOUT","I55","_Z","_Z","_Z","_Z","_Z","ENERGY","_Z","TJ_NCV","y"]
["FINCONS","GEOTHERM","I55_IN_LIGHT","TJ_NCV","RA200","FC_OTH_CP_E_LINDRE","I55","_Z","_Z","_Z","_Z","_Z","ENERGY","_Z","TJ_NCV","y"]
["FINCONS","GEOTHERM","I55_OTH_BUILD","TJ_NCV","RA200","FC_OTH_CP_E_OE_BLD","I55","_Z","_Z","_Z","_Z","_Z","ENERGY","_Z","TJ_NCV","y"]
["FINCONS","GEOTHERM","I55_OTH_NBUILD","TJ_NCV","RA200","FC_OTH_CP_E_OE_NBLD","I55","_Z","_Z","_Z","_Z","_Z","ENERGY","_Z","TJ_NCV","y"]
["FINCONS","GEOTHERM","I551","TJ_NCV","RA200","ENERGUSE","I551","_Z","_Z","_Z","_Z","_Z","ENERGY","_Z","TJ_NCV","y"]
["FINCONS","GEOTHERM","I552","TJ_NCV","RA200","ENERGUSE","I552","_Z","_Z","_Z","_Z","_Z","ENERGY","_Z","TJ_NCV","y"]
["FINCONS","GEOTHERM","I553","TJ_NCV","RA200","ENERGUSE","I553","_Z","_Z","_Z","_Z","_Z","ENERGY","_Z","TJ_NCV","y"]
["FINCONS","GEOTHERM","I559","TJ_NCV","RA200","ENERGUSE","I559","_Z","_Z","_Z","_Z","_Z","ENERGY","_Z","TJ_NCV","y"]
["FINCONS","GEOTHERM","I56","TJ_NCV","RA200","ENERGUSE","I56","_Z","_Z","_Z","_Z","_Z","ENERGY","_Z","TJ_NCV","y"]
["FINCONS","GEOTHERM","I56_HEAT","TJ_NCV","RA200","FC_OTH_CP_E_HEAT","I56","_Z","_Z","_Z","_Z","_Z","ENERGY","_Z","TJ_NCV","y"]
["FINCONS","GEOTHERM","I56_S_HEAT","TJ_NCV","RA200","FC_OTH_CP_E_SH","I56","_Z","_Z","_Z","_Z","_Z","ENERGY","_Z","TJ_NCV","y"]
["FINCONS","GEOTHERM","I56_W_HEAT","TJ_NCV","RA200","FC_OTH_CP_E_WH","I56","_Z","_Z","_Z","_Z","_Z","ENERGY","_Z","TJ_NCV","y"]
["FINCONS","GEOTHERM","I56_COOL","TJ_NCV","RA200","FC_OTH_CP_E_CL","I56","_Z","_Z","_Z","_Z","_Z","ENERGY","_Z","TJ_NCV","y"]
["FINCONS","GEOTHERM","I56_S_COOL","TJ_NCV","RA200","FC_OTH_CP_E_SC","I56","_Z","_Z","_Z","_Z","_Z","ENERGY","_Z","TJ_NCV","y"]
["FINCONS","GEOTHERM","I56_P_COOL","TJ_NCV","RA200","FC_OTH_CP_E_PC","I56","_Z","_Z","_Z","_Z","_Z","ENERGY","_Z","TJ_NCV","y"]
["FINCONS","GEOTHERM","I56_LIGHT","TJ_NCV","RA200","FC_OTH_CP_E_LOUT","I56","_Z","_Z","_Z","_Z","_Z","ENERGY","_Z","TJ_NCV","y"]
["FINCONS","GEOTHERM","I56_IN_LIGHT","TJ_NCV","RA200","FC_OTH_CP_E_LINDRE","I56","_Z","_Z","_Z","_Z","_Z","ENERGY","_Z","TJ_NCV","y"]
["FINCONS","GEOTHERM","I56_OTH_BUILD","TJ_NCV","RA200","FC_OTH_CP_E_OE_BLD","I56","_Z","_Z","_Z","_Z","_Z","ENERGY","_Z","TJ_NCV","y"]
["FINCONS","GEOTHERM","I56_OTH_NBUILD","TJ_NCV","RA200","FC_OTH_CP_E_OE_NBLD","I56","_Z","_Z","_Z","_Z","_Z","ENERGY","_Z","TJ_NCV","y"]
["FINCONS","GEOTHERM","I561","TJ_NCV","RA200","ENERGUSE","I561","_Z","_Z","_Z","_Z","_Z","ENERGY","_Z","TJ_NCV","y"]
["FINCONS","GEOTHERM","I562","TJ_NCV","RA200","ENERGUSE","I562","_Z","_Z","_Z","_Z","_Z","ENERGY","_Z","TJ_NCV","y"]
["FINCONS","GEOTHERM","I563","TJ_NCV","RA200","ENERGUSE","I563","_Z","_Z","_Z","_Z","_Z","ENERGY","_Z","TJ_NCV","y"]
["FINCONS","GEOTHERM","J","TJ_NCV","RA200","ENERGUSE","J","_Z","_Z","_Z","_Z","_Z","ENERGY","_Z","TJ_NCV","y"]
["FINCONS","GEOTHERM","J58","TJ_NCV","RA200","ENERGUSE","J58","_Z","_Z","_Z","_Z","_Z","ENERGY","_Z","TJ_NCV","y"]
["FINCONS","GEOTHERM","J59_J60","TJ_NCV","RA200","ENERGUSE","J59_J60","_Z","_Z","_Z","_Z","_Z","ENERGY","_Z","TJ_NCV","y"]
["FINCONS","GEOTHERM","J61","TJ_NCV","RA200","ENERGUSE","J61","_Z","_Z","_Z","_Z","_Z","ENERGY","_Z","TJ_NCV","y"]
["FINCONS","GEOTHERM","J62_J63","TJ_NCV","RA200","ENERGUSE","J62_J63","_Z","_Z","_Z","_Z","_Z","ENERGY","_Z","TJ_NCV","y"]
["FINCONS","GEOTHERM","J62","TJ_NCV","RA200","ENERGUSE","J62","_Z","_Z","_Z","_Z","_Z","ENERGY","_Z","TJ_NCV","y"]
["FINCONS","GEOTHERM","J63","TJ_NCV","RA200","ENERGUSE","J63","_Z","_Z","_Z","_Z","_Z","ENERGY","_Z","TJ_NCV","y"]
["FINCONS","GEOTHERM","K_L","TJ_NCV","RA200","ENERGUSE","K_L","_Z","_Z","_Z","_Z","_Z","ENERGY","_Z","TJ_NCV","y"]
["FINCONS","GEOTHERM","K","TJ_NCV","RA200","ENERGUSE","K","_Z","_Z","_Z","_Z","_Z","ENERGY","_Z","TJ_NCV","y"]
["FINCONS","GEOTHERM","L","TJ_NCV","RA200","ENERGUSE","L","_Z","_Z","_Z","_Z","_Z","ENERGY","_Z","TJ_NCV","y"]
["FINCONS","GEOTHERM","M_S","TJ_NCV","RA200","ENERGUSE","M_S","_Z","_Z","_Z","_Z","_Z","ENERGY","_Z","TJ_NCV","y"]
["FINCONS","GEOTHERM","M","TJ_NCV","RA200","ENERGUSE","M","_Z","_Z","_Z","_Z","_Z","ENERGY","_Z","TJ_NCV","y"]
["FINCONS","GEOTHERM","M69_M70","TJ_NCV","RA200","ENERGUSE","M69_M70","_Z","_Z","_Z","_Z","_Z","ENERGY","_Z","TJ_NCV","y"]
["FINCONS","GEOTHERM","M71","TJ_NCV","RA200","ENERGUSE","M71","_Z","_Z","_Z","_Z","_Z","ENERGY","_Z","TJ_NCV","y"]
["FINCONS","GEOTHERM","M72","TJ_NCV","RA200","ENERGUSE","M72","_Z","_Z","_Z","_Z","_Z","ENERGY","_Z","TJ_NCV","y"]
["FINCONS","GEOTHERM","M73","TJ_NCV","RA200","ENERGUSE","M73","_Z","_Z","_Z","_Z","_Z","ENERGY","_Z","TJ_NCV","y"]
["FINCONS","GEOTHERM","M74_M75","TJ_NCV","RA200","ENERGUSE","M74_M75","_Z","_Z","_Z","_Z","_Z","ENERGY","_Z","TJ_NCV","y"]
["FINCONS","GEOTHERM","N","TJ_NCV","RA200","ENERGUSE","N","_Z","_Z","_Z","_Z","_Z","ENERGY","_Z","TJ_NCV","y"]
["FINCONS","GEOTHERM","N77","TJ_NCV","RA200","ENERGUSE","N77","_Z","_Z","_Z","_Z","_Z","ENERGY","_Z","TJ_NCV","y"]
["FINCONS","GEOTHERM","N78","TJ_NCV","RA200","ENERGUSE","N78","_Z","_Z","_Z","_Z","_Z","ENERGY","_Z","TJ_NCV","y"]
["FINCONS","GEOTHERM","N79","TJ_NCV","RA200","ENERGUSE","N79","_Z","_Z","_Z","_Z","_Z","ENERGY","_Z","TJ_NCV","y"]
["FINCONS","GEOTHERM","N80-N82","TJ_NCV","RA200","ENERGUSE","N80-N82","_Z","_Z","_Z","_Z","_Z","ENERGY","_Z","TJ_NCV","y"]
["FINCONS","GEOTHERM","O","TJ_NCV","RA200","ENERGUSE","O","_Z","_Z","_Z","_Z","_Z","ENERGY","_Z","TJ_NCV","y"]
["FINCONS","GEOTHERM","O_HEAT","TJ_NCV","RA200","FC_OTH_CP_E_HEAT","O","_Z","_Z","_Z","_Z","_Z","ENERGY","_Z","TJ_NCV","y"]
["FINCONS","GEOTHERM","O_S_HEAT","TJ_NCV","RA200","FC_OTH_CP_E_SH","O","_Z","_Z","_Z","_Z","_Z","ENERGY","_Z","TJ_NCV","y"]
["FINCONS","GEOTHERM","O_W_HEAT","TJ_NCV","RA200","FC_OTH_CP_E_WH","O","_Z","_Z","_Z","_Z","_Z","ENERGY","_Z","TJ_NCV","y"]
["FINCONS","GEOTHERM","O_COOL","TJ_NCV","RA200","FC_OTH_CP_E_CL","O","_Z","_Z","_Z","_Z","_Z","ENERGY","_Z","TJ_NCV","y"]
["FINCONS","GEOTHERM","O_S_COOL","TJ_NCV","RA200","FC_OTH_CP_E_SC","O","_Z","_Z","_Z","_Z","_Z","ENERGY","_Z","TJ_NCV","y"]
["FINCONS","GEOTHERM","O_P_COOL","TJ_NCV","RA200","FC_OTH_CP_E_PC","O","_Z","_Z","_Z","_Z","_Z","ENERGY","_Z","TJ_NCV","y"]
["FINCONS","GEOTHERM","O_LIGHT","TJ_NCV","RA200","FC_OTH_CP_E_LOUT","O","_Z","_Z","_Z","_Z","_Z","ENERGY","_Z","TJ_NCV","y"]
["FINCONS","GEOTHERM","O_IN_LIGHT","TJ_NCV","RA200","FC_OTH_CP_E_LINDRE","O","_Z","_Z","_Z","_Z","_Z","ENERGY","_Z","TJ_NCV","y"]
["FINCONS","GEOTHERM","O_OTH_BUILD","TJ_NCV","RA200","FC_OTH_CP_E_OE_BLD","O","_Z","_Z","_Z","_Z","_Z","ENERGY","_Z","TJ_NCV","y"]
["FINCONS","GEOTHERM","O_OTH_NBUILD","TJ_NCV","RA200","FC_OTH_CP_E_OE_NBLD","O","_Z","_Z","_Z","_Z","_Z","ENERGY","_Z","TJ_NCV","y"]
["FINCONS","GEOTHERM","P","TJ_NCV","RA200","ENERGUSE","P","_Z","_Z","_Z","_Z","_Z","ENERGY","_Z","TJ_NCV","y"]
["FINCONS","GEOTHERM","Q","TJ_NCV","RA200","ENERGUSE","Q","_Z","_Z","_Z","_Z","_Z","ENERGY","_Z","TJ_NCV","y"]
["FINCONS","GEOTHERM","Q861","TJ_NCV","RA200","ENERGUSE","Q861","_Z","_Z","_Z","_Z","_Z","ENERGY","_Z","TJ_NCV","y"]
["FINCONS","GEOTHERM","Q861_HEAT","TJ_NCV","RA200","FC_OTH_CP_E_HEAT","Q861","_Z","_Z","_Z","_Z","_Z","ENERGY","_Z","TJ_NCV","y"]
["FINCONS","GEOTHERM","Q861_S_HEAT","TJ_NCV","RA200","FC_OTH_CP_E_SH","Q861","_Z","_Z","_Z","_Z","_Z","ENERGY","_Z","TJ_NCV","y"]
["FINCONS","GEOTHERM","Q861_W_HEAT","TJ_NCV","RA200","FC_OTH_CP_E_WH","Q861","_Z","_Z","_Z","_Z","_Z","ENERGY","_Z","TJ_NCV","y"]
["FINCONS","GEOTHERM","Q861_COOL","TJ_NCV","RA200","FC_OTH_CP_E_CL","Q861","_Z","_Z","_Z","_Z","_Z","ENERGY","_Z","TJ_NCV","y"]
["FINCONS","GEOTHERM","Q861_S_COOL","TJ_NCV","RA200","FC_OTH_CP_E_SC","Q861","_Z","_Z","_Z","_Z","_Z","ENERGY","_Z","TJ_NCV","y"]
["FINCONS","GEOTHERM","Q861_P_COOL","TJ_NCV","RA200","FC_OTH_CP_E_PC","Q861","_Z","_Z","_Z","_Z","_Z","ENERGY","_Z","TJ_NCV","y"]
["FINCONS","GEOTHERM","Q861_LIGHT","TJ_NCV","RA200","FC_OTH_CP_E_LOUT","Q861","_Z","_Z","_Z","_Z","_Z","ENERGY","_Z","TJ_NCV","y"]
["FINCONS","GEOTHERM","Q861_IN_LIGHT","TJ_NCV","RA200","FC_OTH_CP_E_LINDRE","Q861","_Z","_Z","_Z","_Z","_Z","ENERGY","_Z","TJ_NCV","y"]
["FINCONS","GEOTHERM","Q861_OTH_BUILD","TJ_NCV","RA200","FC_OTH_CP_E_OE_BLD","Q861","_Z","_Z","_Z","_Z","_Z","ENERGY","_Z","TJ_NCV","y"]
["FINCONS","GEOTHERM","Q861_OTH_NBUILD","TJ_NCV","RA200","FC_OTH_CP_E_OE_NBLD","Q861","_Z","_Z","_Z","_Z","_Z","ENERGY","_Z","TJ_NCV","y"]
["FINCONS","GEOTHERM","R","TJ_NCV","RA200","ENERGUSE","R","_Z","_Z","_Z","_Z","_Z","ENERGY","_Z","TJ_NCV","y"]
["FINCONS","GEOTHERM","R90-R92","TJ_NCV","RA200","ENERGUSE","R90-R92","_Z","_Z","_Z","_Z","_Z","ENERGY","_Z","TJ_NCV","y"]
["FINCONS","GEOTHERM","R93","TJ_NCV","RA200","ENERGUSE","R93","_Z","_Z","_Z","_Z","_Z","ENERGY","_Z","TJ_NCV","y"]
["FINCONS","GEOTHERM","S","TJ_NCV","RA200","ENERGUSE","S","_Z","_Z","_Z","_Z","_Z","ENERGY","_Z","TJ_NCV","y"]
["FINCONS","GEOTHERM","U","TJ_NCV","RA200","ENERGUSE","U","_Z","_Z","_Z","_Z","_Z","ENERGY","_Z","TJ_NCV","y"]
["FINCONS","GEOTHERM","DATAC","TJ_NCV","RA200","ENERGUSE","DATAC","_Z","_Z","_Z","_Z","_Z","ENERGY","_Z","TJ_NCV","y"]
["FINCONS","GEOTHERM","TOTSER","TJ_NCV","RA200","ENERGUSE","_T","_Z","_Z","_Z","_Z","_Z","ENERGY","_Z","TJ_NCV","y"]
["FINCONS","HEATPUMP","C33","TJ_NCV","RA600","ENERGUSE","C33","_Z","_Z","_Z","_Z","_Z","ENERGY","_Z","TJ_NCV","y"]
["FINCONS","HEATPUMP","E","TJ_NCV","RA600","ENERGUSE","E","_Z","_Z","_Z","_Z","_Z","ENERGY","_Z","TJ_NCV","y"]
["FINCONS","HEATPUMP","E36","TJ_NCV","RA600","ENERGUSE","E36","_Z","_Z","_Z","_Z","_Z","ENERGY","_Z","TJ_NCV","y"]
["FINCONS","HEATPUMP","E37-E39","TJ_NCV","RA600","ENERGUSE","E37-E39","_Z","_Z","_Z","_Z","_Z","ENERGY","_Z","TJ_NCV","y"]
["FINCONS","HEATPUMP","E37","TJ_NCV","RA600","ENERGUSE","E37","_Z","_Z","_Z","_Z","_Z","ENERGY","_Z","TJ_NCV","y"]
["FINCONS","HEATPUMP","E38","TJ_NCV","RA600","ENERGUSE","E38","_Z","_Z","_Z","_Z","_Z","ENERGY","_Z","TJ_NCV","y"]
["FINCONS","HEATPUMP","E39","TJ_NCV","RA600","ENERGUSE","E39","_Z","_Z","_Z","_Z","_Z","ENERGY","_Z","TJ_NCV","y"]
["FINCONS","HEATPUMP","G","TJ_NCV","RA600","ENERGUSE","G","_Z","_Z","_Z","_Z","_Z","ENERGY","_Z","TJ_NCV","y"]
["FINCONS","HEATPUMP","G_HEAT","TJ_NCV","RA600","FC_OTH_CP_E_HEAT","G","_Z","_Z","_Z","_Z","_Z","ENERGY","_Z","TJ_NCV","y"]
["FINCONS","HEATPUMP","G_S_HEAT","TJ_NCV","RA600","FC_OTH_CP_E_SH","G","_Z","_Z","_Z","_Z","_Z","ENERGY","_Z","TJ_NCV","y"]
["FINCONS","HEATPUMP","G_W_HEAT","TJ_NCV","RA600","FC_OTH_CP_E_WH","G","_Z","_Z","_Z","_Z","_Z","ENERGY","_Z","TJ_NCV","y"]
["FINCONS","HEATPUMP","G_COOL","TJ_NCV","RA600","FC_OTH_CP_E_CL","G","_Z","_Z","_Z","_Z","_Z","ENERGY","_Z","TJ_NCV","y"]
["FINCONS","HEATPUMP","G_S_COOL","TJ_NCV","RA600","FC_OTH_CP_E_SC","G","_Z","_Z","_Z","_Z","_Z","ENERGY","_Z","TJ_NCV","y"]
["FINCONS","HEATPUMP","G_P_COOL","TJ_NCV","RA600","FC_OTH_CP_E_PC","G","_Z","_Z","_Z","_Z","_Z","ENERGY","_Z","TJ_NCV","y"]
["FINCONS","HEATPUMP","G_LIGHT","TJ_NCV","RA600","FC_OTH_CP_E_LOUT","G","_Z","_Z","_Z","_Z","_Z","ENERGY","_Z","TJ_NCV","y"]
["FINCONS","HEATPUMP","G_IN_LIGHT","TJ_NCV","RA600","FC_OTH_CP_E_LINDRE","G","_Z","_Z","_Z","_Z","_Z","ENERGY","_Z","TJ_NCV","y"]
["FINCONS","HEATPUMP","G_OTH_BUILD","TJ_NCV","RA600","FC_OTH_CP_E_OE_BLD","G","_Z","_Z","_Z","_Z","_Z","ENERGY","_Z","TJ_NCV","y"]
["FINCONS","HEATPUMP","G_OTH_NBUILD","TJ_NCV","RA600","FC_OTH_CP_E_OE_NBLD","G","_Z","_Z","_Z","_Z","_Z","ENERGY","_Z","TJ_NCV","y"]
["FINCONS","HEATPUMP","G45","TJ_NCV","RA600","ENERGUSE","G45","_Z","_Z","_Z","_Z","_Z","ENERGY","_Z","TJ_NCV","y"]
["FINCONS","HEATPUMP","G46","TJ_NCV","RA600","ENERGUSE","G46","_Z","_Z","_Z","_Z","_Z","ENERGY","_Z","TJ_NCV","y"]
["FINCONS","HEATPUMP","G47","TJ_NCV","RA600","ENERGUSE","G47","_Z","_Z","_Z","_Z","_Z","ENERGY","_Z","TJ_NCV","y"]
["FINCONS","HEATPUMP","G471","TJ_NCV","RA600","ENERGUSE","G471","_Z","_Z","_Z","_Z","_Z","ENERGY","_Z","TJ_NCV","y"]
["FINCONS","HEATPUMP","G47_X_G471","TJ_NCV","RA600","ENERGUSE","G47_X_G471","_Z","_Z","_Z","_Z","_Z","ENERGY","_Z","TJ_NCV","y"]
["FINCONS","HEATPUMP","H52","TJ_NCV","RA600","ENERGUSE","H52","_Z","_Z","_Z","_Z","_Z","ENERGY","_Z","TJ_NCV","y"]
["FINCONS","HEATPUMP","H52_STL","TJ_NCV","RA600","ENERGUSE","H52_STL","_Z","_Z","_Z","_Z","_Z","ENERGY","_Z","TJ_NCV","y"]
["FINCONS","HEATPUMP","H53","TJ_NCV","RA600","ENERGUSE","H53","_Z","_Z","_Z","_Z","_Z","ENERGY","_Z","TJ_NCV","y"]
["FINCONS","HEATPUMP","I","TJ_NCV","RA600","ENERGUSE","I","_Z","_Z","_Z","_Z","_Z","ENERGY","_Z","TJ_NCV","y"]
["FINCONS","HEATPUMP","I55","TJ_NCV","RA600","ENERGUSE","I55","_Z","_Z","_Z","_Z","_Z","ENERGY","_Z","TJ_NCV","y"]
["FINCONS","HEATPUMP","I55_HEAT","TJ_NCV","RA600","FC_OTH_CP_E_HEAT","I55","_Z","_Z","_Z","_Z","_Z","ENERGY","_Z","TJ_NCV","y"]
["FINCONS","HEATPUMP","I55_S_HEAT","TJ_NCV","RA600","FC_OTH_CP_E_SH","I55","_Z","_Z","_Z","_Z","_Z","ENERGY","_Z","TJ_NCV","y"]
["FINCONS","HEATPUMP","I55_W_HEAT","TJ_NCV","RA600","FC_OTH_CP_E_WH","I55","_Z","_Z","_Z","_Z","_Z","ENERGY","_Z","TJ_NCV","y"]
["FINCONS","HEATPUMP","I55_COOL","TJ_NCV","RA600","FC_OTH_CP_E_CL","I55","_Z","_Z","_Z","_Z","_Z","ENERGY","_Z","TJ_NCV","y"]
["FINCONS","HEATPUMP","I55_S_COOL","TJ_NCV","RA600","FC_OTH_CP_E_SC","I55","_Z","_Z","_Z","_Z","_Z","ENERGY","_Z","TJ_NCV","y"]
["FINCONS","HEATPUMP","I55_P_COOL","TJ_NCV","RA600","FC_OTH_CP_E_PC","I55","_Z","_Z","_Z","_Z","_Z","ENERGY","_Z","TJ_NCV","y"]
["FINCONS","HEATPUMP","I55_LIGHT","TJ_NCV","RA600","FC_OTH_CP_E_LOUT","I55","_Z","_Z","_Z","_Z","_Z","ENERGY","_Z","TJ_NCV","y"]
["FINCONS","HEATPUMP","I55_IN_LIGHT","TJ_NCV","RA600","FC_OTH_CP_E_LINDRE","I55","_Z","_Z","_Z","_Z","_Z","ENERGY","_Z","TJ_NCV","y"]
["FINCONS","HEATPUMP","I55_OTH_BUILD","TJ_NCV","RA600","FC_OTH_CP_E_OE_BLD","I55","_Z","_Z","_Z","_Z","_Z","ENERGY","_Z","TJ_NCV","y"]
["FINCONS","HEATPUMP","I55_OTH_NBUILD","TJ_NCV","RA600","FC_OTH_CP_E_OE_NBLD","I55","_Z","_Z","_Z","_Z","_Z","ENERGY","_Z","TJ_NCV","y"]
["FINCONS","HEATPUMP","I551","TJ_NCV","RA600","ENERGUSE","I551","_Z","_Z","_Z","_Z","_Z","ENERGY","_Z","TJ_NCV","y"]
["FINCONS","HEATPUMP","I552","TJ_NCV","RA600","ENERGUSE","I552","_Z","_Z","_Z","_Z","_Z","ENERGY","_Z","TJ_NCV","y"]
["FINCONS","HEATPUMP","I553","TJ_NCV","RA600","ENERGUSE","I553","_Z","_Z","_Z","_Z","_Z","ENERGY","_Z","TJ_NCV","y"]
["FINCONS","HEATPUMP","I559","TJ_NCV","RA600","ENERGUSE","I559","_Z","_Z","_Z","_Z","_Z","ENERGY","_Z","TJ_NCV","y"]
["FINCONS","HEATPUMP","I56","TJ_NCV","RA600","ENERGUSE","I56","_Z","_Z","_Z","_Z","_Z","ENERGY","_Z","TJ_NCV","y"]
["FINCONS","HEATPUMP","I56_HEAT","TJ_NCV","RA600","FC_OTH_CP_E_HEAT","I56","_Z","_Z","_Z","_Z","_Z","ENERGY","_Z","TJ_NCV","y"]
["FINCONS","HEATPUMP","I56_S_HEAT","TJ_NCV","RA600","FC_OTH_CP_E_SH","I56","_Z","_Z","_Z","_Z","_Z","ENERGY","_Z","TJ_NCV","y"]
["FINCONS","HEATPUMP","I56_W_HEAT","TJ_NCV","RA600","FC_OTH_CP_E_WH","I56","_Z","_Z","_Z","_Z","_Z","ENERGY","_Z","TJ_NCV","y"]
["FINCONS","HEATPUMP","I56_COOL","TJ_NCV","RA600","FC_OTH_CP_E_CL","I56","_Z","_Z","_Z","_Z","_Z","ENERGY","_Z","TJ_NCV","y"]
["FINCONS","HEATPUMP","I56_S_COOL","TJ_NCV","RA600","FC_OTH_CP_E_SC","I56","_Z","_Z","_Z","_Z","_Z","ENERGY","_Z","TJ_NCV","y"]
["FINCONS","HEATPUMP","I56_P_COOL","TJ_NCV","RA600","FC_OTH_CP_E_PC","I56","_Z","_Z","_Z","_Z","_Z","ENERGY","_Z","TJ_NCV","y"]
["FINCONS","HEATPUMP","I56_LIGHT","TJ_NCV","RA600","FC_OTH_CP_E_LOUT","I56","_Z","_Z","_Z","_Z","_Z","ENERGY","_Z","TJ_NCV","y"]
["FINCONS","HEATPUMP","I56_IN_LIGHT","TJ_NCV","RA600","FC_OTH_CP_E_LINDRE","I56","_Z","_Z","_Z","_Z","_Z","ENERGY","_Z","TJ_NCV","y"]
["FINCONS","HEATPUMP","I56_OTH_BUILD","TJ_NCV","RA600","FC_OTH_CP_E_OE_BLD","I56","_Z","_Z","_Z","_Z","_Z","ENERGY","_Z","TJ_NCV","y"]
["FINCONS","HEATPUMP","I56_OTH_NBUILD","TJ_NCV","RA600","FC_OTH_CP_E_OE_NBLD","I56","_Z","_Z","_Z","_Z","_Z","ENERGY","_Z","TJ_NCV","y"]
["FINCONS","HEATPUMP","I561","TJ_NCV","RA600","ENERGUSE","I561","_Z","_Z","_Z","_Z","_Z","ENERGY","_Z","TJ_NCV","y"]
["FINCONS","HEATPUMP","I562","TJ_NCV","RA600","ENERGUSE","I562","_Z","_Z","_Z","_Z","_Z","ENERGY","_Z","TJ_NCV","y"]
["FINCONS","HEATPUMP","I563","TJ_NCV","RA600","ENERGUSE","I563","_Z","_Z","_Z","_Z","_Z","ENERGY","_Z","TJ_NCV","y"]
["FINCONS","HEATPUMP","J","TJ_NCV","RA600","ENERGUSE","J","_Z","_Z","_Z","_Z","_Z","ENERGY","_Z","TJ_NCV","y"]
["FINCONS","HEATPUMP","J58","TJ_NCV","RA600","ENERGUSE","J58","_Z","_Z","_Z","_Z","_Z","ENERGY","_Z","TJ_NCV","y"]
["FINCONS","HEATPUMP","J59_J60","TJ_NCV","RA600","ENERGUSE","J59_J60","_Z","_Z","_Z","_Z","_Z","ENERGY","_Z","TJ_NCV","y"]
["FINCONS","HEATPUMP","J61","TJ_NCV","RA600","ENERGUSE","J61","_Z","_Z","_Z","_Z","_Z","ENERGY","_Z","TJ_NCV","y"]
["FINCONS","HEATPUMP","J62_J63","TJ_NCV","RA600","ENERGUSE","J62_J63","_Z","_Z","_Z","_Z","_Z","ENERGY","_Z","TJ_NCV","y"]
["FINCONS","HEATPUMP","J62","TJ_NCV","RA600","ENERGUSE","J62","_Z","_Z","_Z","_Z","_Z","ENERGY","_Z","TJ_NCV","y"]
["FINCONS","HEATPUMP","J63","TJ_NCV","RA600","ENERGUSE","J63","_Z","_Z","_Z","_Z","_Z","ENERGY","_Z","TJ_NCV","y"]
["FINCONS","HEATPUMP","K_L","TJ_NCV","RA600","ENERGUSE","K_L","_Z","_Z","_Z","_Z","_Z","ENERGY","_Z","TJ_NCV","y"]
["FINCONS","HEATPUMP","K","TJ_NCV","RA600","ENERGUSE","K","_Z","_Z","_Z","_Z","_Z","ENERGY","_Z","TJ_NCV","y"]
["FINCONS","HEATPUMP","L","TJ_NCV","RA600","ENERGUSE","L","_Z","_Z","_Z","_Z","_Z","ENERGY","_Z","TJ_NCV","y"]
["FINCONS","HEATPUMP","M_S","TJ_NCV","RA600","ENERGUSE","M_S","_Z","_Z","_Z","_Z","_Z","ENERGY","_Z","TJ_NCV","y"]
["FINCONS","HEATPUMP","M","TJ_NCV","RA600","ENERGUSE","M","_Z","_Z","_Z","_Z","_Z","ENERGY","_Z","TJ_NCV","y"]
["FINCONS","HEATPUMP","M69_M70","TJ_NCV","RA600","ENERGUSE","M69_M70","_Z","_Z","_Z","_Z","_Z","ENERGY","_Z","TJ_NCV","y"]
["FINCONS","HEATPUMP","M71","TJ_NCV","RA600","ENERGUSE","M71","_Z","_Z","_Z","_Z","_Z","ENERGY","_Z","TJ_NCV","y"]
["FINCONS","HEATPUMP","M72","TJ_NCV","RA600","ENERGUSE","M72","_Z","_Z","_Z","_Z","_Z","ENERGY","_Z","TJ_NCV","y"]
["FINCONS","HEATPUMP","M73","TJ_NCV","RA600","ENERGUSE","M73","_Z","_Z","_Z","_Z","_Z","ENERGY","_Z","TJ_NCV","y"]
["FINCONS","HEATPUMP","M74_M75","TJ_NCV","RA600","ENERGUSE","M74_M75","_Z","_Z","_Z","_Z","_Z","ENERGY","_Z","TJ_NCV","y"]
["FINCONS","HEATPUMP","N","TJ_NCV","RA600","ENERGUSE","N","_Z","_Z","_Z","_Z","_Z","ENERGY","_Z","TJ_NCV","y"]
["FINCONS","HEATPUMP","N77","TJ_NCV","RA600","ENERGUSE","N77","_Z","_Z","_Z","_Z","_Z","ENERGY","_Z","TJ_NCV","y"]
["FINCONS","HEATPUMP","N78","TJ_NCV","RA600","ENERGUSE","N78","_Z","_Z","_Z","_Z","_Z","ENERGY","_Z","TJ_NCV","y"]
["FINCONS","HEATPUMP","N79","TJ_NCV","RA600","ENERGUSE","N79","_Z","_Z","_Z","_Z","_Z","ENERGY","_Z","TJ_NCV","y"]
["FINCONS","HEATPUMP","N80-N82","TJ_NCV","RA600","ENERGUSE","N80-N82","_Z","_Z","_Z","_Z","_Z","ENERGY","_Z","TJ_NCV","y"]
["FINCONS","HEATPUMP","O","TJ_NCV","RA600","ENERGUSE","O","_Z","_Z","_Z","_Z","_Z","ENERGY","_Z","TJ_NCV","y"]
["FINCONS","HEATPUMP","O_HEAT","TJ_NCV","RA600","FC_OTH_CP_E_HEAT","O","_Z","_Z","_Z","_Z","_Z","ENERGY","_Z","TJ_NCV","y"]
["FINCONS","HEATPUMP","O_S_HEAT","TJ_NCV","RA600","FC_OTH_CP_E_SH","O","_Z","_Z","_Z","_Z","_Z","ENERGY","_Z","TJ_NCV","y"]
["FINCONS","HEATPUMP","O_W_HEAT","TJ_NCV","RA600","FC_OTH_CP_E_WH","O","_Z","_Z","_Z","_Z","_Z","ENERGY","_Z","TJ_NCV","y"]
["FINCONS","HEATPUMP","O_COOL","TJ_NCV","RA600","FC_OTH_CP_E_CL","O","_Z","_Z","_Z","_Z","_Z","ENERGY","_Z","TJ_NCV","y"]
["FINCONS","HEATPUMP","O_S_COOL","TJ_NCV","RA600","FC_OTH_CP_E_SC","O","_Z","_Z","_Z","_Z","_Z","ENERGY","_Z","TJ_NCV","y"]
["FINCONS","HEATPUMP","O_P_COOL","TJ_NCV","RA600","FC_OTH_CP_E_PC","O","_Z","_Z","_Z","_Z","_Z","ENERGY","_Z","TJ_NCV","y"]
["FINCONS","HEATPUMP","O_LIGHT","TJ_NCV","RA600","FC_OTH_CP_E_LOUT","O","_Z","_Z","_Z","_Z","_Z","ENERGY","_Z","TJ_NCV","y"]
["FINCONS","HEATPUMP","O_IN_LIGHT","TJ_NCV","RA600","FC_OTH_CP_E_LINDRE","O","_Z","_Z","_Z","_Z","_Z","ENERGY","_Z","TJ_NCV","y"]
["FINCONS","HEATPUMP","O_OTH_BUILD","TJ_NCV","RA600","FC_OTH_CP_E_OE_BLD","O","_Z","_Z","_Z","_Z","_Z","ENERGY","_Z","TJ_NCV","y"]
["FINCONS","HEATPUMP","O_OTH_NBUILD","TJ_NCV","RA600","FC_OTH_CP_E_OE_NBLD","O","_Z","_Z","_Z","_Z","_Z","ENERGY","_Z","TJ_NCV","y"]
["FINCONS","HEATPUMP","P","TJ_NCV","RA600","ENERGUSE","P","_Z","_Z","_Z","_Z","_Z","ENERGY","_Z","TJ_NCV","y"]
["FINCONS","HEATPUMP","Q","TJ_NCV","RA600","ENERGUSE","Q","_Z","_Z","_Z","_Z","_Z","ENERGY","_Z","TJ_NCV","y"]
["FINCONS","HEATPUMP","Q861","TJ_NCV","RA600","ENERGUSE","Q861","_Z","_Z","_Z","_Z","_Z","ENERGY","_Z","TJ_NCV","y"]
["FINCONS","HEATPUMP","Q861_HEAT","TJ_NCV","RA600","FC_OTH_CP_E_HEAT","Q861","_Z","_Z","_Z","_Z","_Z","ENERGY","_Z","TJ_NCV","y"]
["FINCONS","HEATPUMP","Q861_S_HEAT","TJ_NCV","RA600","FC_OTH_CP_E_SH","Q861","_Z","_Z","_Z","_Z","_Z","ENERGY","_Z","TJ_NCV","y"]
["FINCONS","HEATPUMP","Q861_W_HEAT","TJ_NCV","RA600","FC_OTH_CP_E_WH","Q861","_Z","_Z","_Z","_Z","_Z","ENERGY","_Z","TJ_NCV","y"]
["FINCONS","HEATPUMP","Q861_COOL","TJ_NCV","RA600","FC_OTH_CP_E_CL","Q861","_Z","_Z","_Z","_Z","_Z","ENERGY","_Z","TJ_NCV","y"]
["FINCONS","HEATPUMP","Q861_S_COOL","TJ_NCV","RA600","FC_OTH_CP_E_SC","Q861","_Z","_Z","_Z","_Z","_Z","ENERGY","_Z","TJ_NCV","y"]
["FINCONS","HEATPUMP","Q861_P_COOL","TJ_NCV","RA600","FC_OTH_CP_E_PC","Q861","_Z","_Z","_Z","_Z","_Z","ENERGY","_Z","TJ_NCV","y"]
["FINCONS","HEATPUMP","Q861_LIGHT","TJ_NCV","RA600","FC_OTH_CP_E_LOUT","Q861","_Z","_Z","_Z","_Z","_Z","ENERGY","_Z","TJ_NCV","y"]
["FINCONS","HEATPUMP","Q861_IN_LIGHT","TJ_NCV","RA600","FC_OTH_CP_E_LINDRE","Q861","_Z","_Z","_Z","_Z","_Z","ENERGY","_Z","TJ_NCV","y"]
["FINCONS","HEATPUMP","Q861_OTH_BUILD","TJ_NCV","RA600","FC_OTH_CP_E_OE_BLD","Q861","_Z","_Z","_Z","_Z","_Z","ENERGY","_Z","TJ_NCV","y"]
["FINCONS","HEATPUMP","Q861_OTH_NBUILD","TJ_NCV","RA600","FC_OTH_CP_E_OE_NBLD","Q861","_Z","_Z","_Z","_Z","_Z","ENERGY","_Z","TJ_NCV","y"]
["FINCONS","HEATPUMP","R","TJ_NCV","RA600","ENERGUSE","R","_Z","_Z","_Z","_Z","_Z","ENERGY","_Z","TJ_NCV","y"]
["FINCONS","HEATPUMP","R90-R92","TJ_NCV","RA600","ENERGUSE","R90-R92","_Z","_Z","_Z","_Z","_Z","ENERGY","_Z","TJ_NCV","y"]
["FINCONS","HEATPUMP","R93","TJ_NCV","RA600","ENERGUSE","R93","_Z","_Z","_Z","_Z","_Z","ENERGY","_Z","TJ_NCV","y"]
["FINCONS","HEATPUMP","S","TJ_NCV","RA600","ENERGUSE","S","_Z","_Z","_Z","_Z","_Z","ENERGY","_Z","TJ_NCV","y"]
["FINCONS","HEATPUMP","U","TJ_NCV","RA600","ENERGUSE","U","_Z","_Z","_Z","_Z","_Z","ENERGY","_Z","TJ_NCV","y"]
["FINCONS","HEATPUMP","DATAC","TJ_NCV","RA600","ENERGUSE","DATAC","_Z","_Z","_Z","_Z","_Z","ENERGY","_Z","TJ_NCV","y"]
["FINCONS","HEATPUMP","TOTSER","TJ_NCV","RA600","ENERGUSE","_T","_Z","_Z","_Z","_Z","_Z","ENERGY","_Z","TJ_NCV","y"]
["FINCONS","NONREN","C33","TJ_NCV","W60NR","ENERGUSE","C33","_Z","_Z","_Z","_Z","_Z","ENERGY","_Z","TJ_NCV","y"]
["FINCONS","NONREN","E","TJ_NCV","W60NR","ENERGUSE","E","_Z","_Z","_Z","_Z","_Z","ENERGY","_Z","TJ_NCV","y"]
["FINCONS","NONREN","E36","TJ_NCV","W60NR","ENERGUSE","E36","_Z","_Z","_Z","_Z","_Z","ENERGY","_Z","TJ_NCV","y"]
["FINCONS","NONREN","E37-E39","TJ_NCV","W60NR","ENERGUSE","E37-E39","_Z","_Z","_Z","_Z","_Z","ENERGY","_Z","TJ_NCV","y"]
["FINCONS","NONREN","E37","TJ_NCV","W60NR","ENERGUSE","E37","_Z","_Z","_Z","_Z","_Z","ENERGY","_Z","TJ_NCV","y"]
["FINCONS","NONREN","E38","TJ_NCV","W60NR","ENERGUSE","E38","_Z","_Z","_Z","_Z","_Z","ENERGY","_Z","TJ_NCV","y"]
["FINCONS","NONREN","E39","TJ_NCV","W60NR","ENERGUSE","E39","_Z","_Z","_Z","_Z","_Z","ENERGY","_Z","TJ_NCV","y"]
["FINCONS","NONREN","G","TJ_NCV","W60NR","ENERGUSE","G","_Z","_Z","_Z","_Z","_Z","ENERGY","_Z","TJ_NCV","y"]
["FINCONS","NONREN","G_HEAT","TJ_NCV","W60NR","FC_OTH_CP_E_HEAT","G","_Z","_Z","_Z","_Z","_Z","ENERGY","_Z","TJ_NCV","y"]
["FINCONS","NONREN","G_S_HEAT","TJ_NCV","W60NR","FC_OTH_CP_E_SH","G","_Z","_Z","_Z","_Z","_Z","ENERGY","_Z","TJ_NCV","y"]
["FINCONS","NONREN","G_W_HEAT","TJ_NCV","W60NR","FC_OTH_CP_E_WH","G","_Z","_Z","_Z","_Z","_Z","ENERGY","_Z","TJ_NCV","y"]
["FINCONS","NONREN","G_COOL","TJ_NCV","W60NR","FC_OTH_CP_E_CL","G","_Z","_Z","_Z","_Z","_Z","ENERGY","_Z","TJ_NCV","y"]
["FINCONS","NONREN","G_S_COOL","TJ_NCV","W60NR","FC_OTH_CP_E_SC","G","_Z","_Z","_Z","_Z","_Z","ENERGY","_Z","TJ_NCV","y"]
["FINCONS","NONREN","G_P_COOL","TJ_NCV","W60NR","FC_OTH_CP_E_PC","G","_Z","_Z","_Z","_Z","_Z","ENERGY","_Z","TJ_NCV","y"]
["FINCONS","NONREN","G_LIGHT","TJ_NCV","W60NR","FC_OTH_CP_E_LOUT","G","_Z","_Z","_Z","_Z","_Z","ENERGY","_Z","TJ_NCV","y"]
["FINCONS","NONREN","G_IN_LIGHT","TJ_NCV","W60NR","FC_OTH_CP_E_LINDRE","G","_Z","_Z","_Z","_Z","_Z","ENERGY","_Z","TJ_NCV","y"]
["FINCONS","NONREN","G_OTH_BUILD","TJ_NCV","W60NR","FC_OTH_CP_E_OE_BLD","G","_Z","_Z","_Z","_Z","_Z","ENERGY","_Z","TJ_NCV","y"]
["FINCONS","NONREN","G_OTH_NBUILD","TJ_NCV","W60NR","FC_OTH_CP_E_OE_NBLD","G","_Z","_Z","_Z","_Z","_Z","ENERGY","_Z","TJ_NCV","y"]
["FINCONS","NONREN","G45","TJ_NCV","W60NR","ENERGUSE","G45","_Z","_Z","_Z","_Z","_Z","ENERGY","_Z","TJ_NCV","y"]
["FINCONS","NONREN","G46","TJ_NCV","W60NR","ENERGUSE","G46","_Z","_Z","_Z","_Z","_Z","ENERGY","_Z","TJ_NCV","y"]
["FINCONS","NONREN","G47","TJ_NCV","W60NR","ENERGUSE","G47","_Z","_Z","_Z","_Z","_Z","ENERGY","_Z","TJ_NCV","y"]
["FINCONS","NONREN","G471","TJ_NCV","W60NR","ENERGUSE","G471","_Z","_Z","_Z","_Z","_Z","ENERGY","_Z","TJ_NCV","y"]
["FINCONS","NONREN","G47_X_G471","TJ_NCV","W60NR","ENERGUSE","G47_X_G471","_Z","_Z","_Z","_Z","_Z","ENERGY","_Z","TJ_NCV","y"]
["FINCONS","NONREN","H52","TJ_NCV","W60NR","ENERGUSE","H52","_Z","_Z","_Z","_Z","_Z","ENERGY","_Z","TJ_NCV","y"]
["FINCONS","NONREN","H52_STL","TJ_NCV","W60NR","ENERGUSE","H52_STL","_Z","_Z","_Z","_Z","_Z","ENERGY","_Z","TJ_NCV","y"]
["FINCONS","NONREN","H53","TJ_NCV","W60NR","ENERGUSE","H53","_Z","_Z","_Z","_Z","_Z","ENERGY","_Z","TJ_NCV","y"]
["FINCONS","NONREN","I","TJ_NCV","W60NR","ENERGUSE","I","_Z","_Z","_Z","_Z","_Z","ENERGY","_Z","TJ_NCV","y"]
["FINCONS","NONREN","I55","TJ_NCV","W60NR","ENERGUSE","I55","_Z","_Z","_Z","_Z","_Z","ENERGY","_Z","TJ_NCV","y"]
["FINCONS","NONREN","I55_HEAT","TJ_NCV","W60NR","FC_OTH_CP_E_HEAT","I55","_Z","_Z","_Z","_Z","_Z","ENERGY","_Z","TJ_NCV","y"]
["FINCONS","NONREN","I55_S_HEAT","TJ_NCV","W60NR","FC_OTH_CP_E_SH","I55","_Z","_Z","_Z","_Z","_Z","ENERGY","_Z","TJ_NCV","y"]
["FINCONS","NONREN","I55_W_HEAT","TJ_NCV","W60NR","FC_OTH_CP_E_WH","I55","_Z","_Z","_Z","_Z","_Z","ENERGY","_Z","TJ_NCV","y"]
["FINCONS","NONREN","I55_COOL","TJ_NCV","W60NR","FC_OTH_CP_E_CL","I55","_Z","_Z","_Z","_Z","_Z","ENERGY","_Z","TJ_NCV","y"]
["FINCONS","NONREN","I55_S_COOL","TJ_NCV","W60NR","FC_OTH_CP_E_SC","I55","_Z","_Z","_Z","_Z","_Z","ENERGY","_Z","TJ_NCV","y"]
["FINCONS","NONREN","I55_P_COOL","TJ_NCV","W60NR","FC_OTH_CP_E_PC","I55","_Z","_Z","_Z","_Z","_Z","ENERGY","_Z","TJ_NCV","y"]
["FINCONS","NONREN","I55_LIGHT","TJ_NCV","W60NR","FC_OTH_CP_E_LOUT","I55","_Z","_Z","_Z","_Z","_Z","ENERGY","_Z","TJ_NCV","y"]
["FINCONS","NONREN","I55_IN_LIGHT","TJ_NCV","W60NR","FC_OTH_CP_E_LINDRE","I55","_Z","_Z","_Z","_Z","_Z","ENERGY","_Z","TJ_NCV","y"]
["FINCONS","NONREN","I55_OTH_BUILD","TJ_NCV","W60NR","FC_OTH_CP_E_OE_BLD","I55","_Z","_Z","_Z","_Z","_Z","ENERGY","_Z","TJ_NCV","y"]
["FINCONS","NONREN","I55_OTH_NBUILD","TJ_NCV","W60NR","FC_OTH_CP_E_OE_NBLD","I55","_Z","_Z","_Z","_Z","_Z","ENERGY","_Z","TJ_NCV","y"]
["FINCONS","NONREN","I551","TJ_NCV","W60NR","ENERGUSE","I551","_Z","_Z","_Z","_Z","_Z","ENERGY","_Z","TJ_NCV","y"]
["FINCONS","NONREN","I552","TJ_NCV","W60NR","ENERGUSE","I552","_Z","_Z","_Z","_Z","_Z","ENERGY","_Z","TJ_NCV","y"]
["FINCONS","NONREN","I553","TJ_NCV","W60NR","ENERGUSE","I553","_Z","_Z","_Z","_Z","_Z","ENERGY","_Z","TJ_NCV","y"]
["FINCONS","NONREN","I559","TJ_NCV","W60NR","ENERGUSE","I559","_Z","_Z","_Z","_Z","_Z","ENERGY","_Z","TJ_NCV","y"]
["FINCONS","NONREN","I56","TJ_NCV","W60NR","ENERGUSE","I56","_Z","_Z","_Z","_Z","_Z","ENERGY","_Z","TJ_NCV","y"]
["FINCONS","NONREN","I56_HEAT","TJ_NCV","W60NR","FC_OTH_CP_E_HEAT","I56","_Z","_Z","_Z","_Z","_Z","ENERGY","_Z","TJ_NCV","y"]
["FINCONS","NONREN","I56_S_HEAT","TJ_NCV","W60NR","FC_OTH_CP_E_SH","I56","_Z","_Z","_Z","_Z","_Z","ENERGY","_Z","TJ_NCV","y"]
["FINCONS","NONREN","I56_W_HEAT","TJ_NCV","W60NR","FC_OTH_CP_E_WH","I56","_Z","_Z","_Z","_Z","_Z","ENERGY","_Z","TJ_NCV","y"]
["FINCONS","NONREN","I56_COOL","TJ_NCV","W60NR","FC_OTH_CP_E_CL","I56","_Z","_Z","_Z","_Z","_Z","ENERGY","_Z","TJ_NCV","y"]
["FINCONS","NONREN","I56_S_COOL","TJ_NCV","W60NR","FC_OTH_CP_E_SC","I56","_Z","_Z","_Z","_Z","_Z","ENERGY","_Z","TJ_NCV","y"]
["FINCONS","NONREN","I56_P_COOL","TJ_NCV","W60NR","FC_OTH_CP_E_PC","I56","_Z","_Z","_Z","_Z","_Z","ENERGY","_Z","TJ_NCV","y"]
["FINCONS","NONREN","I56_LIGHT","TJ_NCV","W60NR","FC_OTH_CP_E_LOUT","I56","_Z","_Z","_Z","_Z","_Z","ENERGY","_Z","TJ_NCV","y"]
["FINCONS","NONREN","I56_IN_LIGHT","TJ_NCV","W60NR","FC_OTH_CP_E_LINDRE","I56","_Z","_Z","_Z","_Z","_Z","ENERGY","_Z","TJ_NCV","y"]
["FINCONS","NONREN","I56_OTH_BUILD","TJ_NCV","W60NR","FC_OTH_CP_E_OE_BLD","I56","_Z","_Z","_Z","_Z","_Z","ENERGY","_Z","TJ_NCV","y"]
["FINCONS","NONREN","I56_OTH_NBUILD","TJ_NCV","W60NR","FC_OTH_CP_E_OE_NBLD","I56","_Z","_Z","_Z","_Z","_Z","ENERGY","_Z","TJ_NCV","y"]
["FINCONS","NONREN","I561","TJ_NCV","W60NR","ENERGUSE","I561","_Z","_Z","_Z","_Z","_Z","ENERGY","_Z","TJ_NCV","y"]
["FINCONS","NONREN","I562","TJ_NCV","W60NR","ENERGUSE","I562","_Z","_Z","_Z","_Z","_Z","ENERGY","_Z","TJ_NCV","y"]
["FINCONS","NONREN","I563","TJ_NCV","W60NR","ENERGUSE","I563","_Z","_Z","_Z","_Z","_Z","ENERGY","_Z","TJ_NCV","y"]
["FINCONS","NONREN","J","TJ_NCV","W60NR","ENERGUSE","J","_Z","_Z","_Z","_Z","_Z","ENERGY","_Z","TJ_NCV","y"]
["FINCONS","NONREN","J58","TJ_NCV","W60NR","ENERGUSE","J58","_Z","_Z","_Z","_Z","_Z","ENERGY","_Z","TJ_NCV","y"]
["FINCONS","NONREN","J59_J60","TJ_NCV","W60NR","ENERGUSE","J59_J60","_Z","_Z","_Z","_Z","_Z","ENERGY","_Z","TJ_NCV","y"]
["FINCONS","NONREN","J61","TJ_NCV","W60NR","ENERGUSE","J61","_Z","_Z","_Z","_Z","_Z","ENERGY","_Z","TJ_NCV","y"]
["FINCONS","NONREN","J62_J63","TJ_NCV","W60NR","ENERGUSE","J62_J63","_Z","_Z","_Z","_Z","_Z","ENERGY","_Z","TJ_NCV","y"]
["FINCONS","NONREN","J62","TJ_NCV","W60NR","ENERGUSE","J62","_Z","_Z","_Z","_Z","_Z","ENERGY","_Z","TJ_NCV","y"]
["FINCONS","NONREN","J63","TJ_NCV","W60NR","ENERGUSE","J63","_Z","_Z","_Z","_Z","_Z","ENERGY","_Z","TJ_NCV","y"]
["FINCONS","NONREN","K_L","TJ_NCV","W60NR","ENERGUSE","K_L","_Z","_Z","_Z","_Z","_Z","ENERGY","_Z","TJ_NCV","y"]
["FINCONS","NONREN","K","TJ_NCV","W60NR","ENERGUSE","K","_Z","_Z","_Z","_Z","_Z","ENERGY","_Z","TJ_NCV","y"]
["FINCONS","NONREN","L","TJ_NCV","W60NR","ENERGUSE","L","_Z","_Z","_Z","_Z","_Z","ENERGY","_Z","TJ_NCV","y"]
["FINCONS","NONREN","M_S","TJ_NCV","W60NR","ENERGUSE","M_S","_Z","_Z","_Z","_Z","_Z","ENERGY","_Z","TJ_NCV","y"]
["FINCONS","NONREN","M","TJ_NCV","W60NR","ENERGUSE","M","_Z","_Z","_Z","_Z","_Z","ENERGY","_Z","TJ_NCV","y"]
["FINCONS","NONREN","M69_M70","TJ_NCV","W60NR","ENERGUSE","M69_M70","_Z","_Z","_Z","_Z","_Z","ENERGY","_Z","TJ_NCV","y"]
["FINCONS","NONREN","M71","TJ_NCV","W60NR","ENERGUSE","M71","_Z","_Z","_Z","_Z","_Z","ENERGY","_Z","TJ_NCV","y"]
["FINCONS","NONREN","M72","TJ_NCV","W60NR","ENERGUSE","M72","_Z","_Z","_Z","_Z","_Z","ENERGY","_Z","TJ_NCV","y"]
["FINCONS","NONREN","M73","TJ_NCV","W60NR","ENERGUSE","M73","_Z","_Z","_Z","_Z","_Z","ENERGY","_Z","TJ_NCV","y"]
["FINCONS","NONREN","M74_M75","TJ_NCV","W60NR","ENERGUSE","M74_M75","_Z","_Z","_Z","_Z","_Z","ENERGY","_Z","TJ_NCV","y"]
["FINCONS","NONREN","N","TJ_NCV","W60NR","ENERGUSE","N","_Z","_Z","_Z","_Z","_Z","ENERGY","_Z","TJ_NCV","y"]
["FINCONS","NONREN","N77","TJ_NCV","W60NR","ENERGUSE","N77","_Z","_Z","_Z","_Z","_Z","ENERGY","_Z","TJ_NCV","y"]
["FINCONS","NONREN","N78","TJ_NCV","W60NR","ENERGUSE","N78","_Z","_Z","_Z","_Z","_Z","ENERGY","_Z","TJ_NCV","y"]
["FINCONS","NONREN","N79","TJ_NCV","W60NR","ENERGUSE","N79","_Z","_Z","_Z","_Z","_Z","ENERGY","_Z","TJ_NCV","y"]
["FINCONS","NONREN","N80-N82","TJ_NCV","W60NR","ENERGUSE","N80-N82","_Z","_Z","_Z","_Z","_Z","ENERGY","_Z","TJ_NCV","y"]
["FINCONS","NONREN","O","TJ_NCV","W60NR","ENERGUSE","O","_Z","_Z","_Z","_Z","_Z","ENERGY","_Z","TJ_NCV","y"]
["FINCONS","NONREN","O_HEAT","TJ_NCV","W60NR","FC_OTH_CP_E_HEAT","O","_Z","_Z","_Z","_Z","_Z","ENERGY","_Z","TJ_NCV","y"]
["FINCONS","NONREN","O_S_HEAT","TJ_NCV","W60NR","FC_OTH_CP_E_SH","O","_Z","_Z","_Z","_Z","_Z","ENERGY","_Z","TJ_NCV","y"]
["FINCONS","NONREN","O_W_HEAT","TJ_NCV","W60NR","FC_OTH_CP_E_WH","O","_Z","_Z","_Z","_Z","_Z","ENERGY","_Z","TJ_NCV","y"]
["FINCONS","NONREN","O_COOL","TJ_NCV","W60NR","FC_OTH_CP_E_CL","O","_Z","_Z","_Z","_Z","_Z","ENERGY","_Z","TJ_NCV","y"]
["FINCONS","NONREN","O_S_COOL","TJ_NCV","W60NR","FC_OTH_CP_E_SC","O","_Z","_Z","_Z","_Z","_Z","ENERGY","_Z","TJ_NCV","y"]
["FINCONS","NONREN","O_P_COOL","TJ_NCV","W60NR","FC_OTH_CP_E_PC","O","_Z","_Z","_Z","_Z","_Z","ENERGY","_Z","TJ_NCV","y"]
["FINCONS","NONREN","O_LIGHT","TJ_NCV","W60NR","FC_OTH_CP_E_LOUT","O","_Z","_Z","_Z","_Z","_Z","ENERGY","_Z","TJ_NCV","y"]
["FINCONS","NONREN","O_IN_LIGHT","TJ_NCV","W60NR","FC_OTH_CP_E_LINDRE","O","_Z","_Z","_Z","_Z","_Z","ENERGY","_Z","TJ_NCV","y"]
["FINCONS","NONREN","O_OTH_BUILD","TJ_NCV","W60NR","FC_OTH_CP_E_OE_BLD","O","_Z","_Z","_Z","_Z","_Z","ENERGY","_Z","TJ_NCV","y"]
["FINCONS","NONREN","O_OTH_NBUILD","TJ_NCV","W60NR","FC_OTH_CP_E_OE_NBLD","O","_Z","_Z","_Z","_Z","_Z","ENERGY","_Z","TJ_NCV","y"]
["FINCONS","NONREN","P","TJ_NCV","W60NR","ENERGUSE","P","_Z","_Z","_Z","_Z","_Z","ENERGY","_Z","TJ_NCV","y"]
["FINCONS","NONREN","Q","TJ_NCV","W60NR","ENERGUSE","Q","_Z","_Z","_Z","_Z","_Z","ENERGY","_Z","TJ_NCV","y"]
["FINCONS","NONREN","Q861","TJ_NCV","W60NR","ENERGUSE","Q861","_Z","_Z","_Z","_Z","_Z","ENERGY","_Z","TJ_NCV","y"]
["FINCONS","NONREN","Q861_HEAT","TJ_NCV","W60NR","FC_OTH_CP_E_HEAT","Q861","_Z","_Z","_Z","_Z","_Z","ENERGY","_Z","TJ_NCV","y"]
["FINCONS","NONREN","Q861_S_HEAT","TJ_NCV","W60NR","FC_OTH_CP_E_SH","Q861","_Z","_Z","_Z","_Z","_Z","ENERGY","_Z","TJ_NCV","y"]
["FINCONS","NONREN","Q861_W_HEAT","TJ_NCV","W60NR","FC_OTH_CP_E_WH","Q861","_Z","_Z","_Z","_Z","_Z","ENERGY","_Z","TJ_NCV","y"]
["FINCONS","NONREN","Q861_COOL","TJ_NCV","W60NR","FC_OTH_CP_E_CL","Q861","_Z","_Z","_Z","_Z","_Z","ENERGY","_Z","TJ_NCV","y"]
["FINCONS","NONREN","Q861_S_COOL","TJ_NCV","W60NR","FC_OTH_CP_E_SC","Q861","_Z","_Z","_Z","_Z","_Z","ENERGY","_Z","TJ_NCV","y"]
["FINCONS","NONREN","Q861_P_COOL","TJ_NCV","W60NR","FC_OTH_CP_E_PC","Q861","_Z","_Z","_Z","_Z","_Z","ENERGY","_Z","TJ_NCV","y"]
["FINCONS","NONREN","Q861_LIGHT","TJ_NCV","W60NR","FC_OTH_CP_E_LOUT","Q861","_Z","_Z","_Z","_Z","_Z","ENERGY","_Z","TJ_NCV","y"]
["FINCONS","NONREN","Q861_IN_LIGHT","TJ_NCV","W60NR","FC_OTH_CP_E_LINDRE","Q861","_Z","_Z","_Z","_Z","_Z","ENERGY","_Z","TJ_NCV","y"]
["FINCONS","NONREN","Q861_OTH_BUILD","TJ_NCV","W60NR","FC_OTH_CP_E_OE_BLD","Q861","_Z","_Z","_Z","_Z","_Z","ENERGY","_Z","TJ_NCV","y"]
["FINCONS","NONREN","Q861_OTH_NBUILD","TJ_NCV","W60NR","FC_OTH_CP_E_OE_NBLD","Q861","_Z","_Z","_Z","_Z","_Z","ENERGY","_Z","TJ_NCV","y"]
["FINCONS","NONREN","R","TJ_NCV","W60NR","ENERGUSE","R","_Z","_Z","_Z","_Z","_Z","ENERGY","_Z","TJ_NCV","y"]
["FINCONS","NONREN","R90-R92","TJ_NCV","W60NR","ENERGUSE","R90-R92","_Z","_Z","_Z","_Z","_Z","ENERGY","_Z","TJ_NCV","y"]
["FINCONS","NONREN","R93","TJ_NCV","W60NR","ENERGUSE","R93","_Z","_Z","_Z","_Z","_Z","ENERGY","_Z","TJ_NCV","y"]
["FINCONS","NONREN","S","TJ_NCV","W60NR","ENERGUSE","S","_Z","_Z","_Z","_Z","_Z","ENERGY","_Z","TJ_NCV","y"]
["FINCONS","NONREN","U","TJ_NCV","W60NR","ENERGUSE","U","_Z","_Z","_Z","_Z","_Z","ENERGY","_Z","TJ_NCV","y"]
["FINCONS","NONREN","DATAC","TJ_NCV","W60NR","ENERGUSE","DATAC","_Z","_Z","_Z","_Z","_Z","ENERGY","_Z","TJ_NCV","y"]
["FINCONS","NONREN","TOTSER","TJ_NCV","W60NR","ENERGUSE","_T","_Z","_Z","_Z","_Z","_Z","ENERGY","_Z","TJ_NCV","y"]
["FINCONS","HEAT","C33","TJ_NCV","H8000","ENERGUSE","C33","_Z","_Z","_Z","_Z","_Z","ENERGY","_Z","TJ_NCV","y"]
["FINCONS","HEAT","E","TJ_NCV","H8000","ENERGUSE","E","_Z","_Z","_Z","_Z","_Z","ENERGY","_Z","TJ_NCV","y"]
["FINCONS","HEAT","E36","TJ_NCV","H8000","ENERGUSE","E36","_Z","_Z","_Z","_Z","_Z","ENERGY","_Z","TJ_NCV","y"]
["FINCONS","HEAT","E37-E39","TJ_NCV","H8000","ENERGUSE","E37-E39","_Z","_Z","_Z","_Z","_Z","ENERGY","_Z","TJ_NCV","y"]
["FINCONS","HEAT","E37","TJ_NCV","H8000","ENERGUSE","E37","_Z","_Z","_Z","_Z","_Z","ENERGY","_Z","TJ_NCV","y"]
["FINCONS","HEAT","E38","TJ_NCV","H8000","ENERGUSE","E38","_Z","_Z","_Z","_Z","_Z","ENERGY","_Z","TJ_NCV","y"]
["FINCONS","HEAT","E39","TJ_NCV","H8000","ENERGUSE","E39","_Z","_Z","_Z","_Z","_Z","ENERGY","_Z","TJ_NCV","y"]
["FINCONS","HEAT","G","TJ_NCV","H8000","ENERGUSE","G","_Z","_Z","_Z","_Z","_Z","ENERGY","_Z","TJ_NCV","y"]
["FINCONS","HEAT","G_HEAT","TJ_NCV","H8000","FC_OTH_CP_E_HEAT","G","_Z","_Z","_Z","_Z","_Z","ENERGY","_Z","TJ_NCV","y"]
["FINCONS","HEAT","G_S_HEAT","TJ_NCV","H8000","FC_OTH_CP_E_SH","G","_Z","_Z","_Z","_Z","_Z","ENERGY","_Z","TJ_NCV","y"]
["FINCONS","HEAT","G_W_HEAT","TJ_NCV","H8000","FC_OTH_CP_E_WH","G","_Z","_Z","_Z","_Z","_Z","ENERGY","_Z","TJ_NCV","y"]
["FINCONS","HEAT","G_COOL","TJ_NCV","H8000","FC_OTH_CP_E_CL","G","_Z","_Z","_Z","_Z","_Z","ENERGY","_Z","TJ_NCV","y"]
["FINCONS","HEAT","G_S_COOL","TJ_NCV","H8000","FC_OTH_CP_E_SC","G","_Z","_Z","_Z","_Z","_Z","ENERGY","_Z","TJ_NCV","y"]
["FINCONS","HEAT","G_P_COOL","TJ_NCV","H8000","FC_OTH_CP_E_PC","G","_Z","_Z","_Z","_Z","_Z","ENERGY","_Z","TJ_NCV","y"]
["FINCONS","HEAT","G_LIGHT","TJ_NCV","H8000","FC_OTH_CP_E_LOUT","G","_Z","_Z","_Z","_Z","_Z","ENERGY","_Z","TJ_NCV","y"]
["FINCONS","HEAT","G_IN_LIGHT","TJ_NCV","H8000","FC_OTH_CP_E_LINDRE","G","_Z","_Z","_Z","_Z","_Z","ENERGY","_Z","TJ_NCV","y"]
["FINCONS","HEAT","G_OTH_BUILD","TJ_NCV","H8000","FC_OTH_CP_E_OE_BLD","G","_Z","_Z","_Z","_Z","_Z","ENERGY","_Z","TJ_NCV","y"]
["FINCONS","HEAT","G_OTH_NBUILD","TJ_NCV","H8000","FC_OTH_CP_E_OE_NBLD","G","_Z","_Z","_Z","_Z","_Z","ENERGY","_Z","TJ_NCV","y"]
["FINCONS","HEAT","G45","TJ_NCV","H8000","ENERGUSE","G45","_Z","_Z","_Z","_Z","_Z","ENERGY","_Z","TJ_NCV","y"]
["FINCONS","HEAT","G46","TJ_NCV","H8000","ENERGUSE","G46","_Z","_Z","_Z","_Z","_Z","ENERGY","_Z","TJ_NCV","y"]
["FINCONS","HEAT","G47","TJ_NCV","H8000","ENERGUSE","G47","_Z","_Z","_Z","_Z","_Z","ENERGY","_Z","TJ_NCV","y"]
["FINCONS","HEAT","G471","TJ_NCV","H8000","ENERGUSE","G471","_Z","_Z","_Z","_Z","_Z","ENERGY","_Z","TJ_NCV","y"]
["FINCONS","HEAT","G47_X_G471","TJ_NCV","H8000","ENERGUSE","G47_X_G471","_Z","_Z","_Z","_Z","_Z","ENERGY","_Z","TJ_NCV","y"]
["FINCONS","HEAT","H52","TJ_NCV","H8000","ENERGUSE","H52","_Z","_Z","_Z","_Z","_Z","ENERGY","_Z","TJ_NCV","y"]
["FINCONS","HEAT","H52_STL","TJ_NCV","H8000","ENERGUSE","H52_STL","_Z","_Z","_Z","_Z","_Z","ENERGY","_Z","TJ_NCV","y"]
["FINCONS","HEAT","H53","TJ_NCV","H8000","ENERGUSE","H53","_Z","_Z","_Z","_Z","_Z","ENERGY","_Z","TJ_NCV","y"]
["FINCONS","HEAT","I","TJ_NCV","H8000","ENERGUSE","I","_Z","_Z","_Z","_Z","_Z","ENERGY","_Z","TJ_NCV","y"]
["FINCONS","HEAT","I55","TJ_NCV","H8000","ENERGUSE","I55","_Z","_Z","_Z","_Z","_Z","ENERGY","_Z","TJ_NCV","y"]
["FINCONS","HEAT","I55_HEAT","TJ_NCV","H8000","FC_OTH_CP_E_HEAT","I55","_Z","_Z","_Z","_Z","_Z","ENERGY","_Z","TJ_NCV","y"]
["FINCONS","HEAT","I55_S_HEAT","TJ_NCV","H8000","FC_OTH_CP_E_SH","I55","_Z","_Z","_Z","_Z","_Z","ENERGY","_Z","TJ_NCV","y"]
["FINCONS","HEAT","I55_W_HEAT","TJ_NCV","H8000","FC_OTH_CP_E_WH","I55","_Z","_Z","_Z","_Z","_Z","ENERGY","_Z","TJ_NCV","y"]
["FINCONS","HEAT","I55_COOL","TJ_NCV","H8000","FC_OTH_CP_E_CL","I55","_Z","_Z","_Z","_Z","_Z","ENERGY","_Z","TJ_NCV","y"]
["FINCONS","HEAT","I55_S_COOL","TJ_NCV","H8000","FC_OTH_CP_E_SC","I55","_Z","_Z","_Z","_Z","_Z","ENERGY","_Z","TJ_NCV","y"]
["FINCONS","HEAT","I55_P_COOL","TJ_NCV","H8000","FC_OTH_CP_E_PC","I55","_Z","_Z","_Z","_Z","_Z","ENERGY","_Z","TJ_NCV","y"]
["FINCONS","HEAT","I55_LIGHT","TJ_NCV","H8000","FC_OTH_CP_E_LOUT","I55","_Z","_Z","_Z","_Z","_Z","ENERGY","_Z","TJ_NCV","y"]
["FINCONS","HEAT","I55_IN_LIGHT","TJ_NCV","H8000","FC_OTH_CP_E_LINDRE","I55","_Z","_Z","_Z","_Z","_Z","ENERGY","_Z","TJ_NCV","y"]
["FINCONS","HEAT","I55_OTH_BUILD","TJ_NCV","H8000","FC_OTH_CP_E_OE_BLD","I55","_Z","_Z","_Z","_Z","_Z","ENERGY","_Z","TJ_NCV","y"]
["FINCONS","HEAT","I55_OTH_NBUILD","TJ_NCV","H8000","FC_OTH_CP_E_OE_NBLD","I55","_Z","_Z","_Z","_Z","_Z","ENERGY","_Z","TJ_NCV","y"]
["FINCONS","HEAT","I551","TJ_NCV","H8000","ENERGUSE","I551","_Z","_Z","_Z","_Z","_Z","ENERGY","_Z","TJ_NCV","y"]
["FINCONS","HEAT","I552","TJ_NCV","H8000","ENERGUSE","I552","_Z","_Z","_Z","_Z","_Z","ENERGY","_Z","TJ_NCV","y"]
["FINCONS","HEAT","I553","TJ_NCV","H8000","ENERGUSE","I553","_Z","_Z","_Z","_Z","_Z","ENERGY","_Z","TJ_NCV","y"]
["FINCONS","HEAT","I559","TJ_NCV","H8000","ENERGUSE","I559","_Z","_Z","_Z","_Z","_Z","ENERGY","_Z","TJ_NCV","y"]
["FINCONS","HEAT","I56","TJ_NCV","H8000","ENERGUSE","I56","_Z","_Z","_Z","_Z","_Z","ENERGY","_Z","TJ_NCV","y"]
["FINCONS","HEAT","I56_HEAT","TJ_NCV","H8000","FC_OTH_CP_E_HEAT","I56","_Z","_Z","_Z","_Z","_Z","ENERGY","_Z","TJ_NCV","y"]
["FINCONS","HEAT","I56_S_HEAT","TJ_NCV","H8000","FC_OTH_CP_E_SH","I56","_Z","_Z","_Z","_Z","_Z","ENERGY","_Z","TJ_NCV","y"]
["FINCONS","HEAT","I56_W_HEAT","TJ_NCV","H8000","FC_OTH_CP_E_WH","I56","_Z","_Z","_Z","_Z","_Z","ENERGY","_Z","TJ_NCV","y"]
["FINCONS","HEAT","I56_COOL","TJ_NCV","H8000","FC_OTH_CP_E_CL","I56","_Z","_Z","_Z","_Z","_Z","ENERGY","_Z","TJ_NCV","y"]
["FINCONS","HEAT","I56_S_COOL","TJ_NCV","H8000","FC_OTH_CP_E_SC","I56","_Z","_Z","_Z","_Z","_Z","ENERGY","_Z","TJ_NCV","y"]
["FINCONS","HEAT","I56_P_COOL","TJ_NCV","H8000","FC_OTH_CP_E_PC","I56","_Z","_Z","_Z","_Z","_Z","ENERGY","_Z","TJ_NCV","y"]
["FINCONS","HEAT","I56_LIGHT","TJ_NCV","H8000","FC_OTH_CP_E_LOUT","I56","_Z","_Z","_Z","_Z","_Z","ENERGY","_Z","TJ_NCV","y"]
["FINCONS","HEAT","I56_IN_LIGHT","TJ_NCV","H8000","FC_OTH_CP_E_LINDRE","I56","_Z","_Z","_Z","_Z","_Z","ENERGY","_Z","TJ_NCV","y"]
["FINCONS","HEAT","I56_OTH_BUILD","TJ_NCV","H8000","FC_OTH_CP_E_OE_BLD","I56","_Z","_Z","_Z","_Z","_Z","ENERGY","_Z","TJ_NCV","y"]
["FINCONS","HEAT","I56_OTH_NBUILD","TJ_NCV","H8000","FC_OTH_CP_E_OE_NBLD","I56","_Z","_Z","_Z","_Z","_Z","ENERGY","_Z","TJ_NCV","y"]
["FINCONS","HEAT","I561","TJ_NCV","H8000","ENERGUSE","I561","_Z","_Z","_Z","_Z","_Z","ENERGY","_Z","TJ_NCV","y"]
["FINCONS","HEAT","I562","TJ_NCV","H8000","ENERGUSE","I562","_Z","_Z","_Z","_Z","_Z","ENERGY","_Z","TJ_NCV","y"]
["FINCONS","HEAT","I563","TJ_NCV","H8000","ENERGUSE","I563","_Z","_Z","_Z","_Z","_Z","ENERGY","_Z","TJ_NCV","y"]
["FINCONS","HEAT","J","TJ_NCV","H8000","ENERGUSE","J","_Z","_Z","_Z","_Z","_Z","ENERGY","_Z","TJ_NCV","y"]
["FINCONS","HEAT","J58","TJ_NCV","H8000","ENERGUSE","J58","_Z","_Z","_Z","_Z","_Z","ENERGY","_Z","TJ_NCV","y"]
["FINCONS","HEAT","J59_J60","TJ_NCV","H8000","ENERGUSE","J59_J60","_Z","_Z","_Z","_Z","_Z","ENERGY","_Z","TJ_NCV","y"]
["FINCONS","HEAT","J61","TJ_NCV","H8000","ENERGUSE","J61","_Z","_Z","_Z","_Z","_Z","ENERGY","_Z","TJ_NCV","y"]
["FINCONS","HEAT","J62_J63","TJ_NCV","H8000","ENERGUSE","J62_J63","_Z","_Z","_Z","_Z","_Z","ENERGY","_Z","TJ_NCV","y"]
["FINCONS","HEAT","J62","TJ_NCV","H8000","ENERGUSE","J62","_Z","_Z","_Z","_Z","_Z","ENERGY","_Z","TJ_NCV","y"]
["FINCONS","HEAT","J63","TJ_NCV","H8000","ENERGUSE","J63","_Z","_Z","_Z","_Z","_Z","ENERGY","_Z","TJ_NCV","y"]
["FINCONS","HEAT","K_L","TJ_NCV","H8000","ENERGUSE","K_L","_Z","_Z","_Z","_Z","_Z","ENERGY","_Z","TJ_NCV","y"]
["FINCONS","HEAT","K","TJ_NCV","H8000","ENERGUSE","K","_Z","_Z","_Z","_Z","_Z","ENERGY","_Z","TJ_NCV","y"]
["FINCONS","HEAT","L","TJ_NCV","H8000","ENERGUSE","L","_Z","_Z","_Z","_Z","_Z","ENERGY","_Z","TJ_NCV","y"]
["FINCONS","HEAT","M_S","TJ_NCV","H8000","ENERGUSE","M_S","_Z","_Z","_Z","_Z","_Z","ENERGY","_Z","TJ_NCV","y"]
["FINCONS","HEAT","M","TJ_NCV","H8000","ENERGUSE","M","_Z","_Z","_Z","_Z","_Z","ENERGY","_Z","TJ_NCV","y"]
["FINCONS","HEAT","M69_M70","TJ_NCV","H8000","ENERGUSE","M69_M70","_Z","_Z","_Z","_Z","_Z","ENERGY","_Z","TJ_NCV","y"]
["FINCONS","HEAT","M71","TJ_NCV","H8000","ENERGUSE","M71","_Z","_Z","_Z","_Z","_Z","ENERGY","_Z","TJ_NCV","y"]
["FINCONS","HEAT","M72","TJ_NCV","H8000","ENERGUSE","M72","_Z","_Z","_Z","_Z","_Z","ENERGY","_Z","TJ_NCV","y"]
["FINCONS","HEAT","M73","TJ_NCV","H8000","ENERGUSE","M73","_Z","_Z","_Z","_Z","_Z","ENERGY","_Z","TJ_NCV","y"]
["FINCONS","HEAT","M74_M75","TJ_NCV","H8000","ENERGUSE","M74_M75","_Z","_Z","_Z","_Z","_Z","ENERGY","_Z","TJ_NCV","y"]
["FINCONS","HEAT","N","TJ_NCV","H8000","ENERGUSE","N","_Z","_Z","_Z","_Z","_Z","ENERGY","_Z","TJ_NCV","y"]
["FINCONS","HEAT","N77","TJ_NCV","H8000","ENERGUSE","N77","_Z","_Z","_Z","_Z","_Z","ENERGY","_Z","TJ_NCV","y"]
["FINCONS","HEAT","N78","TJ_NCV","H8000","ENERGUSE","N78","_Z","_Z","_Z","_Z","_Z","ENERGY","_Z","TJ_NCV","y"]
["FINCONS","HEAT","N79","TJ_NCV","H8000","ENERGUSE","N79","_Z","_Z","_Z","_Z","_Z","ENERGY","_Z","TJ_NCV","y"]
["FINCONS","HEAT","N80-N82","TJ_NCV","H8000","ENERGUSE","N80-N82","_Z","_Z","_Z","_Z","_Z","ENERGY","_Z","TJ_NCV","y"]
["FINCONS","HEAT","O","TJ_NCV","H8000","ENERGUSE","O","_Z","_Z","_Z","_Z","_Z","ENERGY","_Z","TJ_NCV","y"]
["FINCONS","HEAT","O_HEAT","TJ_NCV","H8000","FC_OTH_CP_E_HEAT","O","_Z","_Z","_Z","_Z","_Z","ENERGY","_Z","TJ_NCV","y"]
["FINCONS","HEAT","O_S_HEAT","TJ_NCV","H8000","FC_OTH_CP_E_SH","O","_Z","_Z","_Z","_Z","_Z","ENERGY","_Z","TJ_NCV","y"]
["FINCONS","HEAT","O_W_HEAT","TJ_NCV","H8000","FC_OTH_CP_E_WH","O","_Z","_Z","_Z","_Z","_Z","ENERGY","_Z","TJ_NCV","y"]
["FINCONS","HEAT","O_COOL","TJ_NCV","H8000","FC_OTH_CP_E_CL","O","_Z","_Z","_Z","_Z","_Z","ENERGY","_Z","TJ_NCV","y"]
["FINCONS","HEAT","O_S_COOL","TJ_NCV","H8000","FC_OTH_CP_E_SC","O","_Z","_Z","_Z","_Z","_Z","ENERGY","_Z","TJ_NCV","y"]
["FINCONS","HEAT","O_P_COOL","TJ_NCV","H8000","FC_OTH_CP_E_PC","O","_Z","_Z","_Z","_Z","_Z","ENERGY","_Z","TJ_NCV","y"]
["FINCONS","HEAT","O_LIGHT","TJ_NCV","H8000","FC_OTH_CP_E_LOUT","O","_Z","_Z","_Z","_Z","_Z","ENERGY","_Z","TJ_NCV","y"]
["FINCONS","HEAT","O_IN_LIGHT","TJ_NCV","H8000","FC_OTH_CP_E_LINDRE","O","_Z","_Z","_Z","_Z","_Z","ENERGY","_Z","TJ_NCV","y"]
["FINCONS","HEAT","O_OTH_BUILD","TJ_NCV","H8000","FC_OTH_CP_E_OE_BLD","O","_Z","_Z","_Z","_Z","_Z","ENERGY","_Z","TJ_NCV","y"]
["FINCONS","HEAT","O_OTH_NBUILD","TJ_NCV","H8000","FC_OTH_CP_E_OE_NBLD","O","_Z","_Z","_Z","_Z","_Z","ENERGY","_Z","TJ_NCV","y"]
["FINCONS","HEAT","P","TJ_NCV","H8000","ENERGUSE","P","_Z","_Z","_Z","_Z","_Z","ENERGY","_Z","TJ_NCV","y"]
["FINCONS","HEAT","Q","TJ_NCV","H8000","ENERGUSE","Q","_Z","_Z","_Z","_Z","_Z","ENERGY","_Z","TJ_NCV","y"]
["FINCONS","HEAT","Q861","TJ_NCV","H8000","ENERGUSE","Q861","_Z","_Z","_Z","_Z","_Z","ENERGY","_Z","TJ_NCV","y"]
["FINCONS","HEAT","Q861_HEAT","TJ_NCV","H8000","FC_OTH_CP_E_HEAT","Q861","_Z","_Z","_Z","_Z","_Z","ENERGY","_Z","TJ_NCV","y"]
["FINCONS","HEAT","Q861_S_HEAT","TJ_NCV","H8000","FC_OTH_CP_E_SH","Q861","_Z","_Z","_Z","_Z","_Z","ENERGY","_Z","TJ_NCV","y"]
["FINCONS","HEAT","Q861_W_HEAT","TJ_NCV","H8000","FC_OTH_CP_E_WH","Q861","_Z","_Z","_Z","_Z","_Z","ENERGY","_Z","TJ_NCV","y"]
["FINCONS","HEAT","Q861_COOL","TJ_NCV","H8000","FC_OTH_CP_E_CL","Q861","_Z","_Z","_Z","_Z","_Z","ENERGY","_Z","TJ_NCV","y"]
["FINCONS","HEAT","Q861_S_COOL","TJ_NCV","H8000","FC_OTH_CP_E_SC","Q861","_Z","_Z","_Z","_Z","_Z","ENERGY","_Z","TJ_NCV","y"]
["FINCONS","HEAT","Q861_P_COOL","TJ_NCV","H8000","FC_OTH_CP_E_PC","Q861","_Z","_Z","_Z","_Z","_Z","ENERGY","_Z","TJ_NCV","y"]
["FINCONS","HEAT","Q861_LIGHT","TJ_NCV","H8000","FC_OTH_CP_E_LOUT","Q861","_Z","_Z","_Z","_Z","_Z","ENERGY","_Z","TJ_NCV","y"]
["FINCONS","HEAT","Q861_IN_LIGHT","TJ_NCV","H8000","FC_OTH_CP_E_LINDRE","Q861","_Z","_Z","_Z","_Z","_Z","ENERGY","_Z","TJ_NCV","y"]
["FINCONS","HEAT","Q861_OTH_BUILD","TJ_NCV","H8000","FC_OTH_CP_E_OE_BLD","Q861","_Z","_Z","_Z","_Z","_Z","ENERGY","_Z","TJ_NCV","y"]
["FINCONS","HEAT","Q861_OTH_NBUILD","TJ_NCV","H8000","FC_OTH_CP_E_OE_NBLD","Q861","_Z","_Z","_Z","_Z","_Z","ENERGY","_Z","TJ_NCV","y"]
["FINCONS","HEAT","R","TJ_NCV","H8000","ENERGUSE","R","_Z","_Z","_Z","_Z","_Z","ENERGY","_Z","TJ_NCV","y"]
["FINCONS","HEAT","R90-R92","TJ_NCV","H8000","ENERGUSE","R90-R92","_Z","_Z","_Z","_Z","_Z","ENERGY","_Z","TJ_NCV","y"]
["FINCONS","HEAT","R93","TJ_NCV","H8000","ENERGUSE","R93","_Z","_Z","_Z","_Z","_Z","ENERGY","_Z","TJ_NCV","y"]
["FINCONS","HEAT","S","TJ_NCV","H8000","ENERGUSE","S","_Z","_Z","_Z","_Z","_Z","ENERGY","_Z","TJ_NCV","y"]
["FINCONS","HEAT","U","TJ_NCV","H8000","ENERGUSE","U","_Z","_Z","_Z","_Z","_Z","ENERGY","_Z","TJ_NCV","y"]
["FINCONS","HEAT","DATAC","TJ_NCV","H8000","ENERGUSE","DATAC","_Z","_Z","_Z","_Z","_Z","ENERGY","_Z","TJ_NCV","y"]
["FINCONS","HEAT","TOTSER","TJ_NCV","H8000","ENERGUSE","_T","_Z","_Z","_Z","_Z","_Z","ENERGY","_Z","TJ_NCV","y"]
["FINCONS","HYDROGEN","C33","TJ_NCV","H2","ENERGUSE","C33","_Z","_Z","_Z","_Z","_Z","ENERGY","_Z","TJ_NCV","y"]
["FINCONS","HYDROGEN","E","TJ_NCV","H2","ENERGUSE","E","_Z","_Z","_Z","_Z","_Z","ENERGY","_Z","TJ_NCV","y"]
["FINCONS","HYDROGEN","E36","TJ_NCV","H2","ENERGUSE","E36","_Z","_Z","_Z","_Z","_Z","ENERGY","_Z","TJ_NCV","y"]
["FINCONS","HYDROGEN","E37-E39","TJ_NCV","H2","ENERGUSE","E37-E39","_Z","_Z","_Z","_Z","_Z","ENERGY","_Z","TJ_NCV","y"]
["FINCONS","HYDROGEN","E37","TJ_NCV","H2","ENERGUSE","E37","_Z","_Z","_Z","_Z","_Z","ENERGY","_Z","TJ_NCV","y"]
["FINCONS","HYDROGEN","E38","TJ_NCV","H2","ENERGUSE","E38","_Z","_Z","_Z","_Z","_Z","ENERGY","_Z","TJ_NCV","y"]
["FINCONS","HYDROGEN","E39","TJ_NCV","H2","ENERGUSE","E39","_Z","_Z","_Z","_Z","_Z","ENERGY","_Z","TJ_NCV","y"]
["FINCONS","HYDROGEN","G","TJ_NCV","H2","ENERGUSE","G","_Z","_Z","_Z","_Z","_Z","ENERGY","_Z","TJ_NCV","y"]
["FINCONS","HYDROGEN","G_HEAT","TJ_NCV","H2","FC_OTH_CP_E_HEAT","G","_Z","_Z","_Z","_Z","_Z","ENERGY","_Z","TJ_NCV","y"]
["FINCONS","HYDROGEN","G_S_HEAT","TJ_NCV","H2","FC_OTH_CP_E_SH","G","_Z","_Z","_Z","_Z","_Z","ENERGY","_Z","TJ_NCV","y"]
["FINCONS","HYDROGEN","G_W_HEAT","TJ_NCV","H2","FC_OTH_CP_E_WH","G","_Z","_Z","_Z","_Z","_Z","ENERGY","_Z","TJ_NCV","y"]
["FINCONS","HYDROGEN","G_COOL","TJ_NCV","H2","FC_OTH_CP_E_CL","G","_Z","_Z","_Z","_Z","_Z","ENERGY","_Z","TJ_NCV","y"]
["FINCONS","HYDROGEN","G_S_COOL","TJ_NCV","H2","FC_OTH_CP_E_SC","G","_Z","_Z","_Z","_Z","_Z","ENERGY","_Z","TJ_NCV","y"]
["FINCONS","HYDROGEN","G_P_COOL","TJ_NCV","H2","FC_OTH_CP_E_PC","G","_Z","_Z","_Z","_Z","_Z","ENERGY","_Z","TJ_NCV","y"]
["FINCONS","HYDROGEN","G_LIGHT","TJ_NCV","H2","FC_OTH_CP_E_LOUT","G","_Z","_Z","_Z","_Z","_Z","ENERGY","_Z","TJ_NCV","y"]
["FINCONS","HYDROGEN","G_IN_LIGHT","TJ_NCV","H2","FC_OTH_CP_E_LINDRE","G","_Z","_Z","_Z","_Z","_Z","ENERGY","_Z","TJ_NCV","y"]
["FINCONS","HYDROGEN","G_OTH_BUILD","TJ_NCV","H2","FC_OTH_CP_E_OE_BLD","G","_Z","_Z","_Z","_Z","_Z","ENERGY","_Z","TJ_NCV","y"]
["FINCONS","HYDROGEN","G_OTH_NBUILD","TJ_NCV","H2","FC_OTH_CP_E_OE_NBLD","G","_Z","_Z","_Z","_Z","_Z","ENERGY","_Z","TJ_NCV","y"]
["FINCONS","HYDROGEN","G45","TJ_NCV","H2","ENERGUSE","G45","_Z","_Z","_Z","_Z","_Z","ENERGY","_Z","TJ_NCV","y"]
["FINCONS","HYDROGEN","G46","TJ_NCV","H2","ENERGUSE","G46","_Z","_Z","_Z","_Z","_Z","ENERGY","_Z","TJ_NCV","y"]
["FINCONS","HYDROGEN","G47","TJ_NCV","H2","ENERGUSE","G47","_Z","_Z","_Z","_Z","_Z","ENERGY","_Z","TJ_NCV","y"]
["FINCONS","HYDROGEN","G471","TJ_NCV","H2","ENERGUSE","G471","_Z","_Z","_Z","_Z","_Z","ENERGY","_Z","TJ_NCV","y"]
["FINCONS","HYDROGEN","G47_X_G471","TJ_NCV","H2","ENERGUSE","G47_X_G471","_Z","_Z","_Z","_Z","_Z","ENERGY","_Z","TJ_NCV","y"]
["FINCONS","HYDROGEN","H52","TJ_NCV","H2","ENERGUSE","H52","_Z","_Z","_Z","_Z","_Z","ENERGY","_Z","TJ_NCV","y"]
["FINCONS","HYDROGEN","H52_STL","TJ_NCV","H2","ENERGUSE","H52_STL","_Z","_Z","_Z","_Z","_Z","ENERGY","_Z","TJ_NCV","y"]
["FINCONS","HYDROGEN","H53","TJ_NCV","H2","ENERGUSE","H53","_Z","_Z","_Z","_Z","_Z","ENERGY","_Z","TJ_NCV","y"]
["FINCONS","HYDROGEN","I","TJ_NCV","H2","ENERGUSE","I","_Z","_Z","_Z","_Z","_Z","ENERGY","_Z","TJ_NCV","y"]
["FINCONS","HYDROGEN","I55","TJ_NCV","H2","ENERGUSE","I55","_Z","_Z","_Z","_Z","_Z","ENERGY","_Z","TJ_NCV","y"]
["FINCONS","HYDROGEN","I55_HEAT","TJ_NCV","H2","FC_OTH_CP_E_HEAT","I55","_Z","_Z","_Z","_Z","_Z","ENERGY","_Z","TJ_NCV","y"]
["FINCONS","HYDROGEN","I55_S_HEAT","TJ_NCV","H2","FC_OTH_CP_E_SH","I55","_Z","_Z","_Z","_Z","_Z","ENERGY","_Z","TJ_NCV","y"]
["FINCONS","HYDROGEN","I55_W_HEAT","TJ_NCV","H2","FC_OTH_CP_E_WH","I55","_Z","_Z","_Z","_Z","_Z","ENERGY","_Z","TJ_NCV","y"]
["FINCONS","HYDROGEN","I55_COOL","TJ_NCV","H2","FC_OTH_CP_E_CL","I55","_Z","_Z","_Z","_Z","_Z","ENERGY","_Z","TJ_NCV","y"]
["FINCONS","HYDROGEN","I55_S_COOL","TJ_NCV","H2","FC_OTH_CP_E_SC","I55","_Z","_Z","_Z","_Z","_Z","ENERGY","_Z","TJ_NCV","y"]
["FINCONS","HYDROGEN","I55_P_COOL","TJ_NCV","H2","FC_OTH_CP_E_PC","I55","_Z","_Z","_Z","_Z","_Z","ENERGY","_Z","TJ_NCV","y"]
["FINCONS","HYDROGEN","I55_LIGHT","TJ_NCV","H2","FC_OTH_CP_E_LOUT","I55","_Z","_Z","_Z","_Z","_Z","ENERGY","_Z","TJ_NCV","y"]
["FINCONS","HYDROGEN","I55_IN_LIGHT","TJ_NCV","H2","FC_OTH_CP_E_LINDRE","I55","_Z","_Z","_Z","_Z","_Z","ENERGY","_Z","TJ_NCV","y"]
["FINCONS","HYDROGEN","I55_OTH_BUILD","TJ_NCV","H2","FC_OTH_CP_E_OE_BLD","I55","_Z","_Z","_Z","_Z","_Z","ENERGY","_Z","TJ_NCV","y"]
["FINCONS","HYDROGEN","I55_OTH_NBUILD","TJ_NCV","H2","FC_OTH_CP_E_OE_NBLD","I55","_Z","_Z","_Z","_Z","_Z","ENERGY","_Z","TJ_NCV","y"]
["FINCONS","HYDROGEN","I551","TJ_NCV","H2","ENERGUSE","I551","_Z","_Z","_Z","_Z","_Z","ENERGY","_Z","TJ_NCV","y"]
["FINCONS","HYDROGEN","I552","TJ_NCV","H2","ENERGUSE","I552","_Z","_Z","_Z","_Z","_Z","ENERGY","_Z","TJ_NCV","y"]
["FINCONS","HYDROGEN","I553","TJ_NCV","H2","ENERGUSE","I553","_Z","_Z","_Z","_Z","_Z","ENERGY","_Z","TJ_NCV","y"]
["FINCONS","HYDROGEN","I559","TJ_NCV","H2","ENERGUSE","I559","_Z","_Z","_Z","_Z","_Z","ENERGY","_Z","TJ_NCV","y"]
["FINCONS","HYDROGEN","I56","TJ_NCV","H2","ENERGUSE","I56","_Z","_Z","_Z","_Z","_Z","ENERGY","_Z","TJ_NCV","y"]
["FINCONS","HYDROGEN","I56_HEAT","TJ_NCV","H2","FC_OTH_CP_E_HEAT","I56","_Z","_Z","_Z","_Z","_Z","ENERGY","_Z","TJ_NCV","y"]
["FINCONS","HYDROGEN","I56_S_HEAT","TJ_NCV","H2","FC_OTH_CP_E_SH","I56","_Z","_Z","_Z","_Z","_Z","ENERGY","_Z","TJ_NCV","y"]
["FINCONS","HYDROGEN","I56_W_HEAT","TJ_NCV","H2","FC_OTH_CP_E_WH","I56","_Z","_Z","_Z","_Z","_Z","ENERGY","_Z","TJ_NCV","y"]
["FINCONS","HYDROGEN","I56_COOL","TJ_NCV","H2","FC_OTH_CP_E_CL","I56","_Z","_Z","_Z","_Z","_Z","ENERGY","_Z","TJ_NCV","y"]
["FINCONS","HYDROGEN","I56_S_COOL","TJ_NCV","H2","FC_OTH_CP_E_SC","I56","_Z","_Z","_Z","_Z","_Z","ENERGY","_Z","TJ_NCV","y"]
["FINCONS","HYDROGEN","I56_P_COOL","TJ_NCV","H2","FC_OTH_CP_E_PC","I56","_Z","_Z","_Z","_Z","_Z","ENERGY","_Z","TJ_NCV","y"]
["FINCONS","HYDROGEN","I56_LIGHT","TJ_NCV","H2","FC_OTH_CP_E_LOUT","I56","_Z","_Z","_Z","_Z","_Z","ENERGY","_Z","TJ_NCV","y"]
["FINCONS","HYDROGEN","I56_IN_LIGHT","TJ_NCV","H2","FC_OTH_CP_E_LINDRE","I56","_Z","_Z","_Z","_Z","_Z","ENERGY","_Z","TJ_NCV","y"]
["FINCONS","HYDROGEN","I56_OTH_BUILD","TJ_NCV","H2","FC_OTH_CP_E_OE_BLD","I56","_Z","_Z","_Z","_Z","_Z","ENERGY","_Z","TJ_NCV","y"]
["FINCONS","HYDROGEN","I56_OTH_NBUILD","TJ_NCV","H2","FC_OTH_CP_E_OE_NBLD","I56","_Z","_Z","_Z","_Z","_Z","ENERGY","_Z","TJ_NCV","y"]
["FINCONS","HYDROGEN","I561","TJ_NCV","H2","ENERGUSE","I561","_Z","_Z","_Z","_Z","_Z","ENERGY","_Z","TJ_NCV","y"]
["FINCONS","HYDROGEN","I562","TJ_NCV","H2","ENERGUSE","I562","_Z","_Z","_Z","_Z","_Z","ENERGY","_Z","TJ_NCV","y"]
["FINCONS","HYDROGEN","I563","TJ_NCV","H2","ENERGUSE","I563","_Z","_Z","_Z","_Z","_Z","ENERGY","_Z","TJ_NCV","y"]
["FINCONS","HYDROGEN","J","TJ_NCV","H2","ENERGUSE","J","_Z","_Z","_Z","_Z","_Z","ENERGY","_Z","TJ_NCV","y"]
["FINCONS","HYDROGEN","J58","TJ_NCV","H2","ENERGUSE","J58","_Z","_Z","_Z","_Z","_Z","ENERGY","_Z","TJ_NCV","y"]
["FINCONS","HYDROGEN","J59_J60","TJ_NCV","H2","ENERGUSE","J59_J60","_Z","_Z","_Z","_Z","_Z","ENERGY","_Z","TJ_NCV","y"]
["FINCONS","HYDROGEN","J61","TJ_NCV","H2","ENERGUSE","J61","_Z","_Z","_Z","_Z","_Z","ENERGY","_Z","TJ_NCV","y"]
["FINCONS","HYDROGEN","J62_J63","TJ_NCV","H2","ENERGUSE","J62_J63","_Z","_Z","_Z","_Z","_Z","ENERGY","_Z","TJ_NCV","y"]
["FINCONS","HYDROGEN","J62","TJ_NCV","H2","ENERGUSE","J62","_Z","_Z","_Z","_Z","_Z","ENERGY","_Z","TJ_NCV","y"]
["FINCONS","HYDROGEN","J63","TJ_NCV","H2","ENERGUSE","J63","_Z","_Z","_Z","_Z","_Z","ENERGY","_Z","TJ_NCV","y"]
["FINCONS","HYDROGEN","K_L","TJ_NCV","H2","ENERGUSE","K_L","_Z","_Z","_Z","_Z","_Z","ENERGY","_Z","TJ_NCV","y"]
["FINCONS","HYDROGEN","K","TJ_NCV","H2","ENERGUSE","K","_Z","_Z","_Z","_Z","_Z","ENERGY","_Z","TJ_NCV","y"]
["FINCONS","HYDROGEN","L","TJ_NCV","H2","ENERGUSE","L","_Z","_Z","_Z","_Z","_Z","ENERGY","_Z","TJ_NCV","y"]
["FINCONS","HYDROGEN","M_S","TJ_NCV","H2","ENERGUSE","M_S","_Z","_Z","_Z","_Z","_Z","ENERGY","_Z","TJ_NCV","y"]
["FINCONS","HYDROGEN","M","TJ_NCV","H2","ENERGUSE","M","_Z","_Z","_Z","_Z","_Z","ENERGY","_Z","TJ_NCV","y"]
["FINCONS","HYDROGEN","M69_M70","TJ_NCV","H2","ENERGUSE","M69_M70","_Z","_Z","_Z","_Z","_Z","ENERGY","_Z","TJ_NCV","y"]
["FINCONS","HYDROGEN","M71","TJ_NCV","H2","ENERGUSE","M71","_Z","_Z","_Z","_Z","_Z","ENERGY","_Z","TJ_NCV","y"]
["FINCONS","HYDROGEN","M72","TJ_NCV","H2","ENERGUSE","M72","_Z","_Z","_Z","_Z","_Z","ENERGY","_Z","TJ_NCV","y"]
["FINCONS","HYDROGEN","M73","TJ_NCV","H2","ENERGUSE","M73","_Z","_Z","_Z","_Z","_Z","ENERGY","_Z","TJ_NCV","y"]
["FINCONS","HYDROGEN","M74_M75","TJ_NCV","H2","ENERGUSE","M74_M75","_Z","_Z","_Z","_Z","_Z","ENERGY","_Z","TJ_NCV","y"]
["FINCONS","HYDROGEN","N","TJ_NCV","H2","ENERGUSE","N","_Z","_Z","_Z","_Z","_Z","ENERGY","_Z","TJ_NCV","y"]
["FINCONS","HYDROGEN","N77","TJ_NCV","H2","ENERGUSE","N77","_Z","_Z","_Z","_Z","_Z","ENERGY","_Z","TJ_NCV","y"]
["FINCONS","HYDROGEN","N78","TJ_NCV","H2","ENERGUSE","N78","_Z","_Z","_Z","_Z","_Z","ENERGY","_Z","TJ_NCV","y"]
["FINCONS","HYDROGEN","N79","TJ_NCV","H2","ENERGUSE","N79","_Z","_Z","_Z","_Z","_Z","ENERGY","_Z","TJ_NCV","y"]
["FINCONS","HYDROGEN","N80-N82","TJ_NCV","H2","ENERGUSE","N80-N82","_Z","_Z","_Z","_Z","_Z","ENERGY","_Z","TJ_NCV","y"]
["FINCONS","HYDROGEN","O","TJ_NCV","H2","ENERGUSE","O","_Z","_Z","_Z","_Z","_Z","ENERGY","_Z","TJ_NCV","y"]
["FINCONS","HYDROGEN","O_HEAT","TJ_NCV","H2","FC_OTH_CP_E_HEAT","O","_Z","_Z","_Z","_Z","_Z","ENERGY","_Z","TJ_NCV","y"]
["FINCONS","HYDROGEN","O_S_HEAT","TJ_NCV","H2","FC_OTH_CP_E_SH","O","_Z","_Z","_Z","_Z","_Z","ENERGY","_Z","TJ_NCV","y"]
["FINCONS","HYDROGEN","O_W_HEAT","TJ_NCV","H2","FC_OTH_CP_E_WH","O","_Z","_Z","_Z","_Z","_Z","ENERGY","_Z","TJ_NCV","y"]
["FINCONS","HYDROGEN","O_COOL","TJ_NCV","H2","FC_OTH_CP_E_CL","O","_Z","_Z","_Z","_Z","_Z","ENERGY","_Z","TJ_NCV","y"]
["FINCONS","HYDROGEN","O_S_COOL","TJ_NCV","H2","FC_OTH_CP_E_SC","O","_Z","_Z","_Z","_Z","_Z","ENERGY","_Z","TJ_NCV","y"]
["FINCONS","HYDROGEN","O_P_COOL","TJ_NCV","H2","FC_OTH_CP_E_PC","O","_Z","_Z","_Z","_Z","_Z","ENERGY","_Z","TJ_NCV","y"]
["FINCONS","HYDROGEN","O_LIGHT","TJ_NCV","H2","FC_OTH_CP_E_LOUT","O","_Z","_Z","_Z","_Z","_Z","ENERGY","_Z","TJ_NCV","y"]
["FINCONS","HYDROGEN","O_IN_LIGHT","TJ_NCV","H2","FC_OTH_CP_E_LINDRE","O","_Z","_Z","_Z","_Z","_Z","ENERGY","_Z","TJ_NCV","y"]
["FINCONS","HYDROGEN","O_OTH_BUILD","TJ_NCV","H2","FC_OTH_CP_E_OE_BLD","O","_Z","_Z","_Z","_Z","_Z","ENERGY","_Z","TJ_NCV","y"]
["FINCONS","HYDROGEN","O_OTH_NBUILD","TJ_NCV","H2","FC_OTH_CP_E_OE_NBLD","O","_Z","_Z","_Z","_Z","_Z","ENERGY","_Z","TJ_NCV","y"]
["FINCONS","HYDROGEN","P","TJ_NCV","H2","ENERGUSE","P","_Z","_Z","_Z","_Z","_Z","ENERGY","_Z","TJ_NCV","y"]
["FINCONS","HYDROGEN","Q","TJ_NCV","H2","ENERGUSE","Q","_Z","_Z","_Z","_Z","_Z","ENERGY","_Z","TJ_NCV","y"]
["FINCONS","HYDROGEN","Q861","TJ_NCV","H2","ENERGUSE","Q861","_Z","_Z","_Z","_Z","_Z","ENERGY","_Z","TJ_NCV","y"]
["FINCONS","HYDROGEN","Q861_HEAT","TJ_NCV","H2","FC_OTH_CP_E_HEAT","Q861","_Z","_Z","_Z","_Z","_Z","ENERGY","_Z","TJ_NCV","y"]
["FINCONS","HYDROGEN","Q861_S_HEAT","TJ_NCV","H2","FC_OTH_CP_E_SH","Q861","_Z","_Z","_Z","_Z","_Z","ENERGY","_Z","TJ_NCV","y"]
["FINCONS","HYDROGEN","Q861_W_HEAT","TJ_NCV","H2","FC_OTH_CP_E_WH","Q861","_Z","_Z","_Z","_Z","_Z","ENERGY","_Z","TJ_NCV","y"]
["FINCONS","HYDROGEN","Q861_COOL","TJ_NCV","H2","FC_OTH_CP_E_CL","Q861","_Z","_Z","_Z","_Z","_Z","ENERGY","_Z","TJ_NCV","y"]
["FINCONS","HYDROGEN","Q861_S_COOL","TJ_NCV","H2","FC_OTH_CP_E_SC","Q861","_Z","_Z","_Z","_Z","_Z","ENERGY","_Z","TJ_NCV","y"]
["FINCONS","HYDROGEN","Q861_P_COOL","TJ_NCV","H2","FC_OTH_CP_E_PC","Q861","_Z","_Z","_Z","_Z","_Z","ENERGY","_Z","TJ_NCV","y"]
["FINCONS","HYDROGEN","Q861_LIGHT","TJ_NCV","H2","FC_OTH_CP_E_LOUT","Q861","_Z","_Z","_Z","_Z","_Z","ENERGY","_Z","TJ_NCV","y"]
["FINCONS","HYDROGEN","Q861_IN_LIGHT","TJ_NCV","H2","FC_OTH_CP_E_LINDRE","Q861","_Z","_Z","_Z","_Z","_Z","ENERGY","_Z","TJ_NCV","y"]
["FINCONS","HYDROGEN","Q861_OTH_BUILD","TJ_NCV","H2","FC_OTH_CP_E_OE_BLD","Q861","_Z","_Z","_Z","_Z","_Z","ENERGY","_Z","TJ_NCV","y"]
["FINCONS","HYDROGEN","Q861_OTH_NBUILD","TJ_NCV","H2","FC_OTH_CP_E_OE_NBLD","Q861","_Z","_Z","_Z","_Z","_Z","ENERGY","_Z","TJ_NCV","y"]
["FINCONS","HYDROGEN","R","TJ_NCV","H2","ENERGUSE","R","_Z","_Z","_Z","_Z","_Z","ENERGY","_Z","TJ_NCV","y"]
["FINCONS","HYDROGEN","R90-R92","TJ_NCV","H2","ENERGUSE","R90-R92","_Z","_Z","_Z","_Z","_Z","ENERGY","_Z","TJ_NCV","y"]
["FINCONS","HYDROGEN","R93","TJ_NCV","H2","ENERGUSE","R93","_Z","_Z","_Z","_Z","_Z","ENERGY","_Z","TJ_NCV","y"]
["FINCONS","HYDROGEN","S","TJ_NCV","H2","ENERGUSE","S","_Z","_Z","_Z","_Z","_Z","ENERGY","_Z","TJ_NCV","y"]
["FINCONS","HYDROGEN","U","TJ_NCV","H2","ENERGUSE","U","_Z","_Z","_Z","_Z","_Z","ENERGY","_Z","TJ_NCV","y"]
["FINCONS","HYDROGEN","DATAC","TJ_NCV","H2","ENERGUSE","DATAC","_Z","_Z","_Z","_Z","_Z","ENERGY","_Z","TJ_NCV","y"]
["FINCONS","HYDROGEN","TOTSER","TJ_NCV","H2","ENERGUSE","_T","_Z","_Z","_Z","_Z","_Z","ENERGY","_Z","TJ_NCV","y"]
["FINCONS","TOTALOIL","CALOR","KT","O4000","ENERGUSE","COMMPUB","_Z","_Z","_Z","_Z","_Z","NCV","_Z","MJ_T","y"]
["FINCONS","LPG","CALOR","KT","O4630","ENERGUSE","COMMPUB","_Z","_Z","_Z","_Z","_Z","NCV","_Z","MJ_T","y"]
["FINCONS","GASDIES","CALOR","KT","O4671","ENERGUSE","COMMPUB","_Z","_Z","_Z","_Z","_Z","NCV","_Z","MJ_T","y"]
["FINCONS","COAL","CALOR","KT","SFFPO","ENERGUSE","COMMPUB","_Z","_Z","_Z","_Z","_Z","NCV","_Z","MJ_T","y"]
[null,null,null,null,"_Z","_Z","_Z","_Z","_Z","_Z","_Z","_Z","_Z","_Z","_Z","y"]
["FINCONS","COAL_PRE","TOTSER","KT","SFFPO","ENERGUSE","FC_OTH_CP_E","_Z","_Z","_Z","_Z","_Z","WEIGHT","_Z","THS_T","y"]
["FINCONS","ELECTR_PRE","TOTSER","GWH","E7000","ENERGUSE","FC_OTH_CP_E","_Z","_Z","_Z","_Z","_Z","ENERGY","_Z","GWH","y"]
["FINCONS","NATGAS_PRE","TOTSER","TJ_GCV","G3000","ENERGUSE","FC_OTH_CP_E","_Z","_Z","_Z","_Z","_Z","ENERGY","_Z","TJ_GCV","y"]
["FINCONS","TOTALOIL_PRE","TOTSER","KT","O4000","ENERGUSE","FC_OTH_CP_E","_Z","_Z","_Z","_Z","_Z","WEIGHT","_Z","THS_T","y"]
["FINCONS","LPG_PRE","TOTSER","KT","O4630","ENERGUSE","FC_OTH_CP_E","_Z","_Z","_Z","_Z","_Z","WEIGHT","_Z","THS_T","y"]
["FINCONS","GASDIES_PRE","TOTSER","KT","O4671","ENERGUSE","FC_OTH_CP_E","_Z","_Z","_Z","_Z","_Z","WEIGHT","_Z","THS_T","y"]
["FINCONS","REN_PRE","TOTSER","TJ_NCV","RA000","ENERGUSE","FC_OTH_CP_E","_Z","_Z","_Z","_Z","_Z","ENERGY","_Z","TJ","y"]
["FINCONS","SOLARTH_PRE","TOTSER","TJ_NCV","RA410","ENERGUSE","FC_OTH_CP_E","_Z","_Z","_Z","_Z","_Z","ENERGY","_Z","TJ","y"]
["FINCONS","PRIMSBIO_PRE","TOTSER","TJ_NCV","R510C","ENERGUSE","FC_OTH_CP_E","_Z","_Z","_Z","_Z","_Z","ENERGY","_Z","TJ","y"]
["FINCONS","BIOGASES_PRE","TOTSER","TJ_NCV","R5300","ENERGUSE","FC_OTH_CP_E","_Z","_Z","_Z","_Z","_Z","ENERGY","_Z","TJ","y"]
["FINCONS","GEOTHERM_PRE","TOTSER","TJ_NCV","RA200","ENERGUSE","FC_OTH_CP_E","_Z","_Z","_Z","_Z","_Z","ENERGY","_Z","TJ_NCV","y"]
["FINCONS","HEATPUMP_PRE","TOTSER","TJ_NCV","RA600","ENERGUSE","FC_OTH_CP_E","_Z","_Z","_Z","_Z","_Z","ENERGY","_Z","TJ_NCV","y"]
["FINCONS","NONREN_PRE","TOTSER","TJ_NCV","W60NR","ENERGUSE","FC_OTH_CP_E","_Z","_Z","_Z","_Z","_Z","ENERGY","_Z","TJ_NCV","y"]
["FINCONS","HEAT_PRE","TOTSER","TJ_NCV","H8000","ENERGUSE","FC_OTH_CP_E","_Z","_Z","_Z","_Z","_Z","ENERGY","_Z","TJ_NCV","y"]
["FINCONS","HYDROGEN_PRE","TOTSER","TJ_NCV","H2","ENERGUSE","FC_OTH_CP_E","_Z","_Z","_Z","_Z","_Z","ENERGY","_Z","TJ_NCV","y"]
["FINCONS","COAL","DATAC_COOL","KT","SFFPO","FC_OTH_CP_E_CL","DATAC","_Z","_Z","_Z","_Z","_Z","WEIGHT","_Z","KT","y"]
["FINCONS","TOT","DATAC_COOL","TJ","_T","FC_OTH_CP_E_CL","DATAC","_Z","_Z","_Z","_Z","_Z","ENERGY","_Z","TJ_NCV","y"]
["FINCONS","ELECTR","DATAC_COOL","GWH","E7000","FC_OTH_CP_E_CL","DATAC","_Z","_Z","_Z","_Z","_Z","ENERGY","_Z","GWH","y"]
["FINCONS","NATGAS","DATAC_COOL","TJ_GCV","G3000","FC_OTH_CP_E_CL","DATAC","_Z","_Z","_Z","_Z","_Z","ENERGY","_Z","TJ_GCV","y"]
["FINCONS","TOTALOIL","DATAC_COOL","KT","O4000","FC_OTH_CP_E_CL","DATAC","_Z","_Z","_Z","_Z","_Z","WEIGHT","_Z","KT","y"]
["FINCONS","LPG","DATAC_COOL","KT","O4630","FC_OTH_CP_E_CL","DATAC","_Z","_Z","_Z","_Z","_Z","WEIGHT","_Z","KT","y"]
["FINCONS","GASDIES","DATAC_COOL","KT","O4671","FC_OTH_CP_E_CL","DATAC","_Z","_Z","_Z","_Z","_Z","WEIGHT","_Z","KT","y"]
["FINCONS","REN","DATAC_COOL","TJ_NCV","RA000","FC_OTH_CP_E_CL","DATAC","_Z","_Z","_Z","_Z","_Z","ENERGY","_Z","TJ_NCV","y"]
["FINCONS","SOLARTH","DATAC_COOL","TJ_NCV","RA410","FC_OTH_CP_E_CL","DATAC","_Z","_Z","_Z","_Z","_Z","ENERGY","_Z","TJ_NCV","y"]
["FINCONS","PRIMSBIO","DATAC_COOL","TJ_NCV","R510C","FC_OTH_CP_E_CL","DATAC","_Z","_Z","_Z","_Z","_Z","ENERGY","_Z","TJ_NCV","y"]
["FINCONS","BIOGASES","DATAC_COOL","TJ_NCV","R5300","FC_OTH_CP_E_CL","DATAC","_Z","_Z","_Z","_Z","_Z","ENERGY","_Z","TJ_NCV","y"]
["FINCONS","GEOTHERM","DATAC_COOL","TJ_NCV","RA200","FC_OTH_CP_E_CL","DATAC","_Z","_Z","_Z","_Z","_Z","ENERGY","_Z","TJ_NCV","y"]
["FINCONS","HEATPUMP","DATAC_COOL","TJ_NCV","RA600","FC_OTH_CP_E_CL","DATAC","_Z","_Z","_Z","_Z","_Z","ENERGY","_Z","TJ_NCV","y"]
["FINCONS","NONREN","DATAC_COOL","TJ_NCV","W60NR","FC_OTH_CP_E_CL","DATAC","_Z","_Z","_Z","_Z","_Z","ENERGY","_Z","TJ_NCV","y"]
["FINCONS","HEAT","DATAC_COOL","TJ_NCV","H8000","FC_OTH_CP_E_CL","DATAC","_Z","_Z","_Z","_Z","_Z","ENERGY","_Z","TJ_NCV","y"]
["FINCONS","HYDROGEN","DATAC_COOL","TJ_NCV","H2","FC_OTH_CP_E_CL","DATAC","_Z","_Z","_Z","_Z","_Z","ENERGY","_Z","TJ_NCV","y"]
["FINCONS","COAL","DATAC_S_COOL","KT","SFFPO","FC_OTH_CP_E_SC","DATAC","_Z","_Z","_Z","_Z","_Z","WEIGHT","_Z","KT","y"]
["FINCONS","TOT","DATAC_S_COOL","TJ","_T","FC_OTH_CP_E_SC","DATAC","_Z","_Z","_Z","_Z","_Z","ENERGY","_Z","TJ_NCV","y"]
["FINCONS","ELECTR","DATAC_S_COOL","GWH","E7000","FC_OTH_CP_E_SC","DATAC","_Z","_Z","_Z","_Z","_Z","ENERGY","_Z","GWH","y"]
["FINCONS","NATGAS","DATAC_S_COOL","TJ_GCV","G3000","FC_OTH_CP_E_SC","DATAC","_Z","_Z","_Z","_Z","_Z","ENERGY","_Z","TJ_GCV","y"]
["FINCONS","TOTALOIL","DATAC_S_COOL","KT","O4000","FC_OTH_CP_E_SC","DATAC","_Z","_Z","_Z","_Z","_Z","WEIGHT","_Z","KT","y"]
["FINCONS","LPG","DATAC_S_COOL","KT","O4630","FC_OTH_CP_E_SC","DATAC","_Z","_Z","_Z","_Z","_Z","WEIGHT","_Z","KT","y"]
["FINCONS","GASDIES","DATAC_S_COOL","KT","O4671","FC_OTH_CP_E_SC","DATAC","_Z","_Z","_Z","_Z","_Z","WEIGHT","_Z","KT","y"]
["FINCONS","REN","DATAC_S_COOL","TJ_NCV","RA000","FC_OTH_CP_E_SC","DATAC","_Z","_Z","_Z","_Z","_Z","ENERGY","_Z","TJ_NCV","y"]
["FINCONS","SOLARTH","DATAC_S_COOL","TJ_NCV","RA410","FC_OTH_CP_E_SC","DATAC","_Z","_Z","_Z","_Z","_Z","ENERGY","_Z","TJ_NCV","y"]
["FINCONS","PRIMSBIO","DATAC_S_COOL","TJ_NCV","R510C","FC_OTH_CP_E_SC","DATAC","_Z","_Z","_Z","_Z","_Z","ENERGY","_Z","TJ_NCV","y"]
["FINCONS","BIOGASES","DATAC_S_COOL","TJ_NCV","R5300","FC_OTH_CP_E_SC","DATAC","_Z","_Z","_Z","_Z","_Z","ENERGY","_Z","TJ_NCV","y"]
["FINCONS","GEOTHERM","DATAC_S_COOL","TJ_NCV","RA200","FC_OTH_CP_E_SC","DATAC","_Z","_Z","_Z","_Z","_Z","ENERGY","_Z","TJ_NCV","y"]
["FINCONS","HEATPUMP","DATAC_S_COOL","TJ_NCV","RA600","FC_OTH_CP_E_SC","DATAC","_Z","_Z","_Z","_Z","_Z","ENERGY","_Z","TJ_NCV","y"]
["FINCONS","NONREN","DATAC_S_COOL","TJ_NCV","W60NR","FC_OTH_CP_E_SC","DATAC","_Z","_Z","_Z","_Z","_Z","ENERGY","_Z","TJ_NCV","y"]
["FINCONS","HEAT","DATAC_S_COOL","TJ_NCV","H8000","FC_OTH_CP_E_SC","DATAC","_Z","_Z","_Z","_Z","_Z","ENERGY","_Z","TJ_NCV","y"]
["FINCONS","HYDROGEN","DATAC_S_COOL","TJ_NCV","H2","FC_OTH_CP_E_SC","DATAC","_Z","_Z","_Z","_Z","_Z","ENERGY","_Z","TJ_NCV","y"]
["FINCONS","COAL","DATAC_P_COOL","KT","SFFPO","FC_OTH_CP_E_PC","DATAC","_Z","_Z","_Z","_Z","_Z","WEIGHT","_Z","KT","y"]
["FINCONS","TOT","DATAC_P_COOL","TJ","_T","FC_OTH_CP_E_PC","DATAC","_Z","_Z","_Z","_Z","_Z","ENERGY","_Z","TJ_NCV","y"]
["FINCONS","ELECTR","DATAC_P_COOL","GWH","E7000","FC_OTH_CP_E_PC","DATAC","_Z","_Z","_Z","_Z","_Z","ENERGY","_Z","GWH","y"]
["FINCONS","NATGAS","DATAC_P_COOL","TJ_GCV","G3000","FC_OTH_CP_E_PC","DATAC","_Z","_Z","_Z","_Z","_Z","ENERGY","_Z","TJ_GCV","y"]
["FINCONS","TOTALOIL","DATAC_P_COOL","KT","O4000","FC_OTH_CP_E_PC","DATAC","_Z","_Z","_Z","_Z","_Z","WEIGHT","_Z","KT","y"]
["FINCONS","LPG","DATAC_P_COOL","KT","O4630","FC_OTH_CP_E_PC","DATAC","_Z","_Z","_Z","_Z","_Z","WEIGHT","_Z","KT","y"]
["FINCONS","GASDIES","DATAC_P_COOL","KT","O4671","FC_OTH_CP_E_PC","DATAC","_Z","_Z","_Z","_Z","_Z","WEIGHT","_Z","KT","y"]
["FINCONS","REN","DATAC_P_COOL","TJ_NCV","RA000","FC_OTH_CP_E_PC","DATAC","_Z","_Z","_Z","_Z","_Z","ENERGY","_Z","TJ_NCV","y"]
["FINCONS","SOLARTH","DATAC_P_COOL","TJ_NCV","RA410","FC_OTH_CP_E_PC","DATAC","_Z","_Z","_Z","_Z","_Z","ENERGY","_Z","TJ_NCV","y"]
["FINCONS","PRIMSBIO","DATAC_P_COOL","TJ_NCV","R510C","FC_OTH_CP_E_PC","DATAC","_Z","_Z","_Z","_Z","_Z","ENERGY","_Z","TJ_NCV","y"]
["FINCONS","BIOGASES","DATAC_P_COOL","TJ_NCV","R5300","FC_OTH_CP_E_PC","DATAC","_Z","_Z","_Z","_Z","_Z","ENERGY","_Z","TJ_NCV","y"]
["FINCONS","GEOTHERM","DATAC_P_COOL","TJ_NCV","RA200","FC_OTH_CP_E_PC","DATAC","_Z","_Z","_Z","_Z","_Z","ENERGY","_Z","TJ_NCV","y"]
["FINCONS","HEATPUMP","DATAC_P_COOL","TJ_NCV","RA600","FC_OTH_CP_E_PC","DATAC","_Z","_Z","_Z","_Z","_Z","ENERGY","_Z","TJ_NCV","y"]
["FINCONS","NONREN","DATAC_P_COOL","TJ_NCV","W60NR","FC_OTH_CP_E_PC","DATAC","_Z","_Z","_Z","_Z","_Z","ENERGY","_Z","TJ_NCV","y"]
["FINCONS","HEAT","DATAC_P_COOL","TJ_NCV","H8000","FC_OTH_CP_E_PC","DATAC","_Z","_Z","_Z","_Z","_Z","ENERGY","_Z","TJ_NCV","y"]
["FINCONS","HYDROGEN","DATAC_P_COOL","TJ_NCV","H2","FC_OTH_CP_E_PC","DATAC","_Z","_Z","_Z","_Z","_Z","ENERGY","_Z","TJ_NCV","y"]

{"sheet":"Parameters","index":14,"n_rows":21,"n_cols":7,"rows_kept":21,"cut":false,"hidden":true,"merged":[]}
["Element","Type","PosType","Position",null,"DataStart","P2"]
["QUEST_SOURCE","DIM","COLUMN","B",null,"DataEnd","P100000"]
["FREQ","DIM","COLUMN","D",null,"SkipIncompleteKeys","true"]
["REF_AREA","DIM","COLUMN","C",null,"formatValues","actualValue"]
["ENERGY_PRODUCT","DIM","COLUMN","E"]
["MAIN_FLOW","DIM","COLUMN","F"]
["FLOW_BREAKDOWN","DIM","COLUMN","G"]
["PLANT_TECH","DIM","COLUMN","H"]
["PLANT_TYPE","DIM","COLUMN","I"]
["STOCKS","DIM","COLUMN","J"]
["INFRASTRUCTURE_IND","DIM","COLUMN","K"]
["VIS_A_VIS_AREA","DIM","COLUMN","L"]
["MEASURE_VALUE_TYPE","DIM","COLUMN","M"]
["TIME_PERIOD","DIM","COLUMN","O"]
["FACILITY_ID","DIM","COLUMN","N"]
["UNIT_MEASURE","DIM","COLUMN","Q"]
["OBS_STATUS","ATT","COLUMN","R"]
["CONF_STATUS","ATT","COLUMN","S"]
["COMMENT_OBS","ATT","SKIP"]
["FACILITY_TYPE","ATT","SKIP"]
["FACILITY_NAME","ATT","SKIP"]

{"sheet":"Parameter_mapping","index":15,"n_rows":2,"n_cols":2,"rows_kept":2,"cut":false,"hidden":true,"merged":[]}
["Data sheet","Parameter sheet"]
["Output_SDMX_long_complete","Parameters"]

{"sheet":"Mapping_countries","index":16,"n_rows":73,"n_cols":4,"rows_kept":73,"cut":false,"hidden":true,"merged":[]}
["Official","IEA","EUROSTAT","IEA-ISO"]
["Albania","ALBANIA","AL","AL"]
["Argentina","ARGENTINA","AR","AR"]
["Armenia","ARMENIA","AM","AM"]
["Australia","AUSTRALI","AU","AU"]
["Austria","AUSTRIA","AT","AT"]
["Azerbaijan","AZERBAIJAN","AZ","AZ"]
["Belarus","BELARUS","BY","BY"]
["Belgium","BELGIUM","BE","BE"]
["Bosnia and Herzegovina","BOSNIAHERZ","BA","BA"]
["Brazil","BRAZIL","BR","BR"]
["Bulgaria","BULGARIA","BG","BG"]
["Canada","CANADA","CA","CA"]
["Chile","CHILE","CL","CL"]
["China, People's Republic of","CHINA","CN","CN"]
["Colombia","COLOMBIA","CO","CO"]
["Costa Rica","COSTARICA","CR","CR"]
["Croatia","CROATIA","HR","HR"]
["Cyprus","CYPRUS","CY","CY"]
["Czech Republic","CZECH","CZ","CZ"]
["Denmark","DENMARK","DK","DK"]
["Egypt","EGYPT","EG","EG"]
["Estonia","ESTONIA","EE","EE"]
["Finland","FINLAND","FI","FI"]
["France","FRANCE","FR","FR"]
["Georgia","GEORGIA","GE","GE"]
["Germany","GERMANY","DE","DE"]
["Greece","GREECE","GR","GR"]
["Hungary","HUNGARY","HU","HU"]
["Iceland","ICELAND","IS","IS"]
["Ireland","IRELAND","IE","IE"]
["India","INDIA","IN","IN"]
["Indonesia","INDONESIA","ID","ID"]
["Israel","ISRAEL","IL","IL"]
["Italy","ITALY","IT","IT"]
["Japan","JAPAN","JP","JP"]
["Kazakhstan","KAZAKHSTAN","KZ","KZ"]
["Korea","KOREA","KR","KR"]
["Kosovo* (under UNSCR 1244/99)","KOSOVO","XK","XK"]
["Kyrgyzstan","KYRGYZSTAN","KG","KG"]
["Latvia","LATVIA","LV","LV"]
["Liechtenstein","LIECHTEN","LI","LI"]
["Lithuania","LITHUANIA","LT","LT"]
["Luxembourg","LUXEMBOU","LU","LU"]
["Malta","MALTA","MT","MT"]
["Mexico","MEXICO","MX","MX"]
["Moldova","MOLDOVA","MD","MD"]
["Montenegro","MONTENEGRO","ME","ME"]
["Morocco","MOROCCO","MA","MA"]
["Netherlands","NETHLAND","NL","NL"]
["New Zealand","NZ","NZ","NZ"]
["North Macedonia","NORTHMACED","MK","MK"]
["Norway","NORWAY","NO","NO"]
["Peru","PERU","PE","PE"]
["Poland","POLAND","PL","PL"]
["Portugal","PORTUGAL","PT","PT"]
["Romania","ROMANIA","RO","RO"]
["Russia","RUSSIA","RU","RU"]
["Serbia","SERBIA","RS","RS"]
["Singapore","SINGAPORE","SG","SG"]
["Slovak Republic","SLOVAKIA","SK","SK"]
["Slovenia","SLOVENIA","SI","SI"]
["South Africa","SOUTHAFRIC","ZA","ZA"]
["Spain","SPAIN","ES","ES"]
["Sweden","SWEDEN","SE","SE"]
["Switzerland","SWITLAND","CH","CH"]
["Tajikistan","TAJIKISTAN","TJ","TJ"]
["Thailand","THAILAND","TH","TH"]
["Tunisia","TUNISIA","TN","TN"]
["Türkiye","TURKEY","TR","TR"]
["Ukraine","UKRAINE","UA","UA"]
["United Kingdom","UK","GB","GB"]
["United States","USA","US","US"]

{"sheet":"Logs","index":17,"n_rows":1,"n_cols":7,"rows_kept":1,"cut":false,"hidden":true,"merged":[]}
["Date","Module","Function","Param","Return","ErrorCode","Description"]

{"sheet":"Param_Menu","index":18,"n_rows":17,"n_cols":13,"rows_kept":17,"cut":false,"hidden":true,"merged":[]}
[null,"Selection",null,"Sep",null,null,null,"Current",null,"Code","Label","Unit"]
["Format",2,null,",",null,null,null,1,1,"TOT","All Energy Products","TJ","TJ (NCV)"]
["File Import","D:\\tmp\\ESSR_Albania_SDMX_2023-11-21_14-08.csv",null,null,"Option 1",1,null,{"$f":"VLOOKUP(H2,I2:J16,2,FALSE)","v":"TOT"},2,"ELECTR","Electricity","GWH","GWh"]
["File Export","D:\\tmp\\ESSER_Albania_SDMX_2023-11-22_11-52.csv",null,null,null,null,null,{"$f":"VLOOKUP(H2,I:L,4,FALSE)","v":"TJ"},3,"NATGAS","Natural Gas","TJ_GCV","TJ (GCV)"]
["File Import historical","D:\\ARTEMIS INFO. MGMT\\Energy - Lot 2\\Development\\Questionnaires\\Disaggregated questionnaires\\Services\\Developed quest\\ESSERprefilltestLU.csv",null,null,null,null,null,{"$f":"VLOOKUP(H2,I:M,5,FALSE)","v":"TJ (NCV)"},4,"HEAT","Derived Heat","TJ_NCV","TJ (NCV)"]
[null,null,null,null,null,null,null,null,5,"TOTALOIL","Oil and Petroleum Products","KT","kt"]
["Years","Period","Selected","Option button",null,null,null,null,6,"LPG","LPG","KT","kt"]
[2020,{"$f":"PeriodsToLoad[[#This Row],[Years]]","v":2020},0,1,null,null,null,null,7,"GASDIES","Gas Diesel Oil","KT","kt"]
[2021,{"$f":"PeriodsToLoad[[#This Row],[Years]]","v":2021},0,1,null,null,null,null,8,"REN","Renewable Energies","TJ_NCV","TJ (NCV)"]
[2022,{"$f":"PeriodsToLoad[[#This Row],[Years]]","v":2022},1,1,null,null,null,null,9,"SOLARTH","Solar Thermal","TJ_NCV","TJ (NCV)"]
[2023,{"$f":"PeriodsToLoad[[#This Row],[Years]]","v":2023},0,1,null,null,null,null,10,"PRIMSBIO","Primary Solid Biofuels","TJ_NCV","TJ (NCV)"]
[2024,{"$f":"PeriodsToLoad[[#This Row],[Years]]","v":2024},0,1,null,null,null,null,11,"BIOGASES","Biogas","TJ_NCV","TJ (NCV)"]
[null,null,null,null,null,null,null,null,12,"GEOTHERM","Geothermal","TJ_NCV","TJ (NCV)"]
[null,null,null,null,null,null,null,null,13,"HEATPUMP","Ambient Heat","TJ_NCV","TJ (NCV)"]
[null,null,null,null,null,null,null,null,14,"COAL","Solid Fossil Fuels","KT","kt"]
[null,null,null,null,null,null,null,null,15,"NONREN","Non Renewable Waste","TJ_NCV","TJ (NCV)"]
[null,null,null,null,null,null,null,null,16,"HYDROGEN","Hydrogen","TJ_NCV","TJ (NCV)"]

{"sheet":"Param_Questionnaire","index":19,"n_rows":73,"n_cols":18,"rows_kept":73,"cut":false,"hidden":true,"merged":[]}
["Version","Eurostat",null,"Eurostat","IEA","Language",null,"FormatNormal","FormatConfidential","FormatConfidential2","FormatEstimated","FormatNotAvailable","FormatDataCannotExist","FormatNotSignificant","FormatLowReliability","FormatDefinitionDiff","FormatTSBreak","FormatProvisional"]
["Questionnaire","ESSER",null,"Albania","Albania","English",0,1234567.8899999999,0,1234.56789,1234567.8899999999,1234567.8899999999,1234567.8899999999,1234567.8899999999,1234567.8899999999,1234567.8899999999,1234567.8899999999,1234567.8899999999]
["DATAFLOW","ESTAT:ENERGY_ESSER_A(1.0)",null,"Austria","Argentina","French",1,1234567.8899999999,0,1234.56789,1234567.8899999999,1234567.8899999999,1234567.8899999999,1234567.8899999999,1234567.8899999999,1234567.8899999999,1234567.8899999999,1234567.8899999999]
["QUEST_SOURCE","A_ESSER",null,"Belgium","Armenia",null,2,1234567.8899999999,0,1234.56789,1234567.8899999999,1234567.8899999999,1234567.8899999999,1234567.8899999999,1234567.8899999999,1234567.8899999999,1234567.8899999999,1234567.8899999999]
["FREQ","A",null,"Bosnia and Herzegovina","Australia",null,3,1234567.8899999999,0,1234.56789,1234567.8899999999,1234567.8899999999,1234567.8899999999,1234567.8899999999,1234567.8899999999,1234567.8899999999,1234567.8899999999,1234567.8899999999]
["CountryName",{"$f":"Menu!D9","v":"Albania"},null,"Bulgaria","Austria",null,4,1234567.8899999999,0,1234.56789,1234567.8899999999,1234567.8899999999,1234567.8899999999,1234567.8899999999,1234567.8899999999,1234567.8899999999,1234567.8899999999,1234567.8899999999]
["CountryIEA",{"$f":"VLOOKUP(CountryName, Mapping_countries[], 2, 0)","v":"ALBANIA"},null,"Croatia","Azerbaijan",null,5,1234567.8899999999,0,1234.56789,1234567.8899999999,1234567.8899999999,1234567.8899999999,1234567.8899999999,1234567.8899999999,1234567.8899999999,1234567.8899999999,1234567.8899999999]
["CountryEUROSTAT",{"$f":"VLOOKUP(CountryName, Mapping_countries[], 3, 0)","v":"AL"},null,"Cyprus","Belarus",null,6,1234567.8899999999,0,1234.56789,1234567.8899999999,1234567.8899999999,1234567.8899999999,1234567.8899999999,1234567.8899999999,1234567.8899999999,1234567.8899999999,1234567.8899999999]
["Language",{"$f":"Menu!D7","v":"English"},null,"Czech Republic","Belgium",null,null,null,null,null,"e","o","m","n","u","d","b","p"]
["PeriodSelected",{"$f":"Menu!C13","v":2022},null,"Denmark","Bosnia and Herzegovina"]
["Data Format",{"$f":"IF(Param_Menu!B2=1, \"ISO\", \"SDMX\")","v":"SDMX"},null,"Estonia","Brazil"]
["FormatError","aaa",null,"Finland","Bulgaria"]
["FormatWarning","aaa",null,"France","Canada"]
["FormatRevision","aaa",null,"Georgia","Chile"]
["FormatLockFormula","aaa",null,"Germany","China, People's Republic of"]
["FormatLockNoFormula",null,null,"Greece","Colombia"]
["FormatEmpty",null,null,"Hungary","Costa Rica"]
["nbDecimal",3,"0 to 6","Iceland","Croatia"]
["FormatVoluntary","aaa",null,"Ireland","Cyprus"]
["FormatFormula","aaa",null,"Italy","Czech Republic"]
[null,null,null,"Kosovo* (under UNSCR 1244/99)","Denmark"]
[null,null,null,"Latvia","Egypt"]
[null,null,null,"Liechtenstein","Estonia"]
[null,null,null,"Lithuania","Finland"]
[null,null,null,"Luxembourg","France"]
[null,null,null,"Malta","Georgia"]
[null,null,null,"Moldova","Germany"]
["Test Value",9.9,null,"Montenegro","Greece"]
["CheckTolerance",0.1,null,"Netherlands","Hungary"]
["AllowConfidential",1,null,"North Macedonia","Iceland"]
["AllowDataCannotExist",1,null,"Norway","Ireland"]
["Display0",0,null,"Poland","India"]
["ShowFlags",true,null,"Portugal","Indonesia"]
["ShowChecks",true,null,"Romania","Israel"]
["ShowRevisions",true,null,"Serbia","Italy"]
[null,null,null,"Slovak Republic","Japan"]
[null,null,null,"Slovenia","Kazakhstan"]
[null,null,null,"Spain","Korea"]
[null,null,null,"Sweden","Kosovo* (under UNSCR 1244/99)"]
[null,null,null,"Switzerland","Kyrgyzstan"]
[null,null,null,"Türkiye","Latvia"]
[null,null,null,"Ukraine","Liechtenstein"]
[null,null,null,"United Kingdom","Lithuania"]
[null,null,null,null,"Luxembourg"]
[null,null,null,null,"Malta"]
[null,null,null,null,"Mexico"]
[null,null,null,null,"Moldova"]
[null,null,null,null,"Montenegro"]
[null,null,null,null,"Morocco"]
[null,null,null,null,"Netherlands"]
[null,null,null,null,"New Zealand"]
[null,null,null,null,"North Macedonia"]
[null,null,null,null,"Norway"]
[null,null,null,null,"Peru"]
[null,null,null,null,"Poland"]
[null,null,null,null,"Portugal"]
[null,null,null,null,"Romania"]
[null,null,null,null,"Russia"]
[null,null,null,null,"Serbia"]
[null,null,null,null,"Singapore"]
[null,null,null,null,"Slovak Republic"]
[null,null,null,null,"Slovenia"]
[null,null,null,null,"South Africa"]
[null,null,null,null,"Spain"]
[null,null,null,null,"Sweden"]
[null,null,null,null,"Switzerland"]
[null,null,null,null,"Tajikistan"]
[null,null,null,null,"Thailand"]
[null,null,null,null,"Tunisia"]
[null,null,null,null,"Türkiye"]
[null,null,null,null,"Ukraine"]
[null,null,null,null,"United Kingdom"]
[null,null,null,null,"United States"]

{"sheet":"Param_Multilanguage","index":20,"n_rows":165,"n_cols":3,"rows_kept":165,"cut":false,"hidden":true,"merged":[]}
["Shortnames","English","French"]
[null,"Remarks","Remarques"]
["C33","Repair and installation of machinery and equipment","Repair and installation of machinery and equipment"]
["E","Water supply; sewerage, waste management and remediation activities","Water supply; sewerage, waste management and remediation activities"]
["G","Wholesale and retail trade; repair of motor vehicles and motorcycles","Wholesale and retail trade; repair of motor vehicles and motorcycles"]
["G46","Wholesale trade, except of motor vehicles and motorcycles","Wholesale trade, except of motor vehicles and motorcycles"]
["G47","Retail trade, except of motor vehicles and motorcycles","Retail trade, except of motor vehicles and motorcycles"]
["H52","Warehousing and support activities for transportation","Warehousing and support activities for transportation"]
["H53","Postal and courier activities","Postal and courier activities"]
["I","Accommodation and food services activities","Accommodation and food services activities"]
["I55","Accommodation","Accommodation"]
["I56","Food and beverage services activities","Food and beverage services activities"]
["J","Information and communication","Information and communication"]
["K_L","Financial and insurance activities; real estate activities","Financial and insurance activities; real estate activities"]
["M_S","Professional, scientific and technical activities; other services","Professional, scientific and technical activities; other services"]
["N","Administrative and support services activities","Administrative and support services activities"]
["O","Public administration and defence; compulsory social security","Public administration and defence; compulsory social security"]
["P","Education","Education"]
["Q","Human health and social work activities","Human health and social work activities"]
["Q861","Of which: Hospital activities","Of which: Hospital activities"]
["R","Arts, entertainment and recreation","Arts, entertainment and recreation"]
["R93","Of which: Sports activities and amusement and recreation activities","Of which: Sports activities and amusement and recreation activities"]
["U","Activities of extra-territorial organisations and bodies","Activities of extra-territorial organisations and bodies"]
["DATAC","Data centres","Data centres"]
[null,"Water supply; sewerage, waste management and remediation activities","Water supply; sewerage, waste management and remediation activities"]
[null,"Water collection, treatment and supply","Water collection, treatment and supply"]
[null,"Sewerage; Waste collection, treatment and disposal activities; materials recovery; Remediation activities and other waste management services","Sewerage; Waste collection, treatment and disposal activities; materials recovery; Remediation activities and other waste management services"]
[null,"Sewerage","Sewerage"]
[null,"Waste collection, treatment and disposal activities; materials recovery","Waste collection, treatment and disposal activities; materials recovery"]
[null,"Remediation activities and other waste management services","Remediation activities and other waste management services"]
[null,"Wholesale and retail trade; repair of motor vehicles and motorcycles","Wholesale and retail trade; repair of motor vehicles and motorcycles"]
[null,"Heating","Heating"]
[null,"of which: Space heating","of which: Space heating"]
[null,"of which: Water heating","of which: Water heating"]
[null,"Cooling","Cooling"]
[null,"of which: Space cooling","of which: Space cooling"]
[null,"of which: Process cooling","of which: Process cooling"]
[null,"Outdoor lighting","Outdoor lighting"]
[null,"Indoor lighting, appliances and ICTs","Indoor lighting, appliances and ICTs"]
[null,"Other building activities","Other building activities"]
[null,"Other non-building activities","Other non-building activities"]
[null,"Wholesale and retail trade and repair of motor vehicles and motorcycles","Wholesale and retail trade and repair of motor vehicles and motorcycles"]
[null,"Retail trade, except of motor vehicles and motorcycles","Retail trade, except of motor vehicles and motorcycles"]
[null,"Retail sale in non-specialised stores","Retail sale in non-specialised stores"]
[null,"Retail sale in specialised stores and other retail trade","Retail sale in specialised stores and other retail trade"]
[null,"Warehousing and support activities for transportation","Warehousing and support activities for transportation"]
[null,"Outdoor lighting (Street lighting)","Outdoor lighting (Street lighting)"]
[null,"Accommodation","Accommodation"]
[null,"Hotels and similar accommodation","Hotels and similar accommodation"]
[null,"Holiday and other short-stay accommodation","Holiday and other short-stay accommodation"]
[null,"Camping grounds, recreational vehicle parks and trailer parks","Camping grounds, recreational vehicle parks and trailer parks"]
[null,"Other accommodation","Other accommodation"]
[null,"Accommodation","Accommodation"]
[null,"Heating","Heating"]
[null,"of which: Space heating","of which: Space heating"]
[null,"of which: Water heating","of which: Water heating"]
[null,"Cooling","Cooling"]
[null,"of which: Space cooling","of which: Space cooling"]
[null,"of which: Process cooling","of which: Process cooling"]
[null,"Outdoor lighting","Outdoor lighting"]
[null,"Indoor lighting, appliances and ICTs","Indoor lighting, appliances and ICTs"]
[null,"Other building activities","Other building activities"]
[null,"Other non-building activities","Other non-building activities"]
[null,"Food and beverage service activities","Food and beverage service activities"]
[null,"Restaurants and mobile food service activities","Restaurants and mobile food service activities"]
[null,"Event catering and other food service activities","Event catering and other food service activities"]
[null,"Beverage serving activities","Beverage serving activities"]
[null,"Food and beverage service activities","Food and beverage service activities"]
[null,"Heating","Heating"]
[null,"of which: Space heating","of which: Space heating"]
[null,"of which: Water heating","of which: Water heating"]
[null,"Cooling","Cooling"]
[null,"of which: Space cooling","of which: Space cooling"]
[null,"of which: Process cooling","of which: Process cooling"]
[null,"Outdoor lighting","Outdoor lighting"]
[null,"Indoor lighting, appliances and ICTs","Indoor lighting, appliances and ICTs"]
[null,"Other building activities","Other building activities"]
[null,"Other non-building activities","Other non-building activities"]
[null,"Information and communication","Information and communication"]
[null,"Publishing activities","Publishing activities"]
[null,"Motion picture, video and television programme production, sound recording and music publishing activities; Programming and broadcasting activities","Motion picture, video and television programme production, sound recording and music publishing activities; Programming and broadcasting activities"]
[null,"Telecommunications","Telecommunications"]
[null,"Computer programming, consultancy and related activities; Information service activities","Computer programming, consultancy and related activities; Information service activities"]
[null,"Computer programming, consultancy and related activities","Computer programming, consultancy and related activities"]
[null,"Information service activities","Information service activities"]
[null,"Financial and insurance activities","Financial and insurance activities"]
[null,"Real estate activities","Real estate activities"]
[null,"Professional, scientific and technical activities","Professional, scientific and technical activities"]
[null,"Legal and accounting activities; Activities of head offices, management consultancy activities","Legal and accounting activities; Activities of head offices, management consultancy activities"]
[null,"Architectural and engineering activities, technical testing and analysis","Architectural and engineering activities, technical testing and analysis"]
[null,"Scientific research and development","Scientific research and development"]
[null,"Advertising and market research","Advertising and market research"]
[null,"Veterinary activities; Other professional, scientific and technical activities","Veterinary activities; Other professional, scientific and technical activities"]
[null,"Administrative and support service activities","Administrative and support service activities"]
[null,"Rental and leasing activities","Rental and leasing activities"]
[null,"Employment activities","Employment activities"]
[null,"Travel agency, tour operator and other reservation service and related activities","Travel agency, tour operator and other reservation service and related activities"]
[null,"Security and investigation activities; Services to buildings and landscape activities; Office administrative, office support and other business support activities","Security and investigation activities; Services to buildings and landscape activities; Office administrative, office support and other business support activities"]
[null,"Public administrative and defence; compulsory social security","Public administrative and defence; compulsory social security"]
[null,"Heating","Heating"]
[null,"of which: Space heating","of which: Space heating"]
[null,"of which: Water heating","of which: Water heating"]
[null,"Cooling","Cooling"]
[null,"of which: Space cooling","of which: Space cooling"]
[null,"of which: Process cooling","of which: Process cooling"]
[null,"Outdoor lighting","Outdoor lighting"]
[null,"Indoor lighting, appliances and ICTs","Indoor lighting, appliances and ICTs"]
[null,"Other building activities","Other building activities"]
[null,"Other non-building activities","Other non-building activities"]
[null,"Hospital activities","Hospital activities"]
[null,"Heating","Heating"]
[null,"of which: Space heating","of which: Space heating"]
[null,"of which: Water heating","of which: Water heating"]
[null,"Cooling","Cooling"]
[null,"of which: Space cooling","of which: Space cooling"]
[null,"of which: Process cooling","of which: Process cooling"]
[null,"Outdoor lighting","Outdoor lighting"]
[null,"Indoor lighting, appliances and ICTs","Indoor lighting, appliances and ICTs"]
[null,"Other building activities","Other building activities"]
[null,"Other non-building activities","Other non-building activities"]
[null,"Arts, entertainment and recreation","Arts, entertainment and recreation"]
[null,"Creative, arts and entertainment activities; Libraries, archives, museums and other cultural activities; Gambling and betting activities","Creative, arts and entertainment activities; Libraries, archives, museums and other cultural activities; Gambling and betting activities"]
[null,"Sports activities and amusement and recreation activities","Sports activities and amusement and recreation activities"]
[null,"Other service activities","Other service activities"]
[null,"Food services activities","Food services activities"]
["TOTSER","Services total","Services total"]
[null,"Data centres","Data centres"]
[null,"All Energy Products","All Energy Products"]
[null,"Electricity","Electricity"]
[null,"Natural Gas","Natural Gas"]
[null,"Derived Heat","Derived Heat"]
[null,"Oil and Petroleum Products","Oil and Petroleum Products"]
[null,"LPG","LPG"]
[null,"Gas/Diesel oil","Gas/Diesel oil"]
[null,"Renewable Energies","Renewable Energies"]
[null,"Solar Thermal","Solar Thermal"]
[null,"Primary Solid Biofuels","Primary Solid Biofuels"]
[null,"Biogas","Biogas"]
[null,"Geothermal","Geothermal"]
[null,"Ambient Heat","Ambient Heat"]
[null,"Solid Fossil Fuels","Solid Fossil Fuels"]
[null,"Non Renewable Waste","Non Renewable Waste"]
[null,"Table1: Annual statistics on final energy consumption in services","Table1: Annual statistics on final energy consumption in services"]
[null,"Table 2: Final Energy Consumption in Services Sector by type of end use - Calorific values (MJ/t)","Table 2: Final Energy Consumption in Services Sector by type of end use - Calorific values (MJ/t)"]
[null,"All Energy Products","All Energy Products"]
[null,"Electrical Energy","Electrical Energy"]
[null,"Natural Gas","Natural Gas"]
[null,"Oil and Petroleum Products","Oil and Petroleum Products"]
[null,"LPG","LPG"]
[null,"Gas Diesel Oil","Gas Diesel Oil"]
[null,"Renewable Energies","Renewable Energies"]
[null,"Solar Thermal","Solar Thermal"]
[null,"Primary Solid Biofuels","Primary Solid Biofuels"]
[null,"Biogas","Biogas"]
[null,"Geothermal","Geothermal"]
[null,"Ambient_Heat","Ambient_Heat"]
[null,"Solid Fossil Fuels","Solid Fossil Fuels"]
[null,"Non Renewable Waste","Non Renewable Waste"]
[null,"Derived Heat","Derived Heat"]
[null,"Voluntary items","Voluntary items"]
[null,"Hydrogen","Hydrogen"]
[null,"Calorific values","Calorific values"]
[null,"Table1: Final Energy Consumption in the Services Sector by type of end use","Table1: Final Energy Consumption in the Services Sector by type of end use"]
[null,"Final Energy Consumption in the Services Sector","Final Energy Consumption in the Services Sector"]
[null,"Services prefilled from annuals","Services prefilled from annuals"]

{"sheet":"Menu","index":21,"n_rows":29,"n_cols":4,"rows_kept":29,"cut":false,"hidden":false,"merged":[[19,2,19,8],[23,2,23,8],[14,2,14,8],[10,2,10,8],[1,2,1,8],[2,2,2,8],[6,3,6,4],[8,3,8,4],[12,2,12,3],[3,2,3,8]]}
[]
[null,null,"Dissaggregated final energy consumption in services"]
[null,null,"REPORTING TEMPLATE "]
[null,null,"Eurostat"]
[]
[]
[null,null,"Language:","English"]
[]
[null,null,"Country:","Albania"]
[]
[null,null,"TABLES"]
[]
[null,null,2022]
[]
[null,null,"TIME SERIES"]
[]
[]
[]
[]
[null,null,"DATA TRANSFER"]
[]
[]
[]
[null,null,"VALIDATION AND VISUALISATION"]
[]
[]
[]
[]
[null,null,"Version:",20240221]

{"sheet":"Instructions","index":22,"n_rows":150,"n_cols":5,"rows_kept":150,"cut":false,"hidden":false,"merged":[[143,1,143,5],[144,1,144,5],[145,1,145,5],[147,1,147,5],[149,4,151,5],[136,1,136,5],[137,1,137,5],[138,1,138,5],[139,1,140,5],[141,1,141,5],[130,2,130,5],[131,2,131,5],[132,2,132,5],[133,2,133,5],[134,2,134,5],[120,1,123,5],[125,2,125,5],[126,2,126,5],[127,2,127,5],[128,1,129,1],[128,2,129,5],[97,4,105,5],[106,4,109,5],[111,4,113,5],[115,4,117,5],[119,1,119,5],[80,4,85,5],[87,1,87,5],[88,1,88,5],[89,1,90,5],[91,4,96,5],[72,4,74,5],[76,1,76,5],[77,1,77,5],[78,1,78,5],[54,1,54,5],[55,1,56,5],[58,4,60,5],[62,4,64,5],[66,4,70,5],[39,1,41,5],[43,1,43,5],[44,1,44,5],[46,4,48,5],[50,1,52,5],[20,4,24,5],[26,1,26,5],[27,1,28,5],[30,4,32,5],[34,4,37,5],[11,1,11,5],[12,1,12,5],[15,1,15,5],[16,1,16,5],[18,1,18,5],[1,2,1,5],[2,2,2,5],[5,1,5,5],[9,1,9,5],[10,1,10,5]]}
[]
[null,null,"Dissaggregated final energy consumption in services"]
[null,null,"REPORTING TEMPLATE "]
[]
[" "]
[null,"SUPPORT CONTACT"]
[null,"EUROSTAT: ",null,"ESTAT-ENERGY-ANNUAL@EC.EUROPA.EU"]
[]
[null,""]
[null,"SUBMISSION INSTRUCTIONS:"]
[null,"Countries reporting to Eurostat should transmit the completed reporting template via the Single Entry Point (SEP) via EDAMIS."]
[null,"https://webgate.ec.europa.eu/edamis4"]
[null,"In EDAMIS, please use dataset ENERGY_ESSER_A."]
[]
[]
[null,"BASIC FUNCTIONS"]
[null,"The instructions below describe the functions of the buttons on the 'Menu' worksheet."]
[]
[null,"The user should select his/her language and reporting country from the drop-down boxes at the top."]
[]
[null,null,null,null,"The user should select the periods (months and/or years) to be uploaded to the database. If a user modifies data in a timeseries spreadsheet that is outside the 'periods to load', a warning message will appear when the reporting template is saved. The data will be saved in the reporting template, but will not be included in the exported data and will not, therefore, be uploaded to the database.\nThe selection of the periods to load is also used for running the checks included in the reporting template."]
[]
[]
[]
[]
[]
[null,"TABLES section"]
[null,"The reporting period should be selected from the drop-down box. Only one period at a time can be filled in using this option. Please remember to save each table with the save button (top left) before closing the worksheet."]
[]
[]
[null,null,null,null,"Opens the table that contains the table-specific products and flows for the selected reporting period (see above)."]
[]
[]
[]
[null,null,null,null,"Use this worksheet to comment on reported data, for example point out changes in methodology, etc. This information will be part of the uploaded data and will be stored under the period to load."]
[]
[]
[]
[]
[null,"This reporting template uses virtual forms, so all new data in any of the tables needs to be saved, otherwise it will not be stored. Any changes made in a table will not be visible immediately in other linked tables. Each table will need to be either reopened or refreshed (by using the 'Show new data' button in each worksheet)."]
[]
[]
[]
[null,"TIME SERIES section"]
[null,"The user can also enter data in the Time Series worksheets. Using this option allows the user to enter data for all periods."]
[]
[null,null,null,null,"Each button opens a table containing the table-specific products and flows for all periods."]
[]
[]
[]
[null,"This reporting template uses virtual forms, so all new data (or flags) in any of the tables needs to be saved, otherwise it will not be saved. Any changes made in a table will not be visible immediately in other linked tables. Each table will need to be either reopened or refreshed (by using the 'Show new data' button in each worksheet)."]
[]
[]
[]
[null,"DATA TRANSFER section"]
[null,"Data can be imported to (or exported from) the reporting template via a CSV file (SDMX-CSV)."]
[]
[]
[null,null,null,null,"Opens a Windows browser to select the file to be imported. Data can be imported only for the periods which are covered by the questionnaire. If other periods are loaded, the loading will fail."]
[]
[]
[]
[null,null,null,null,"Opens a Windows browser to select where the file should be exported to. Before exporting the data, the user must check that the data which needs to be exported is properly selected via the 'Periods to load' button."]
[]
[]
[]
[null,null,null,null,"Once the reporting template is completed and saved, the user must decide whether to transmit an exported CSV file or the Excel file. If the user opts for the Excel file, it must be prepared for transmission to Eurostat. This button carries out the necessary preparation. Before preparing the data, the user must check that the data which needs to be prepared is properly selected via the 'Periods to load' button. If no period is selected, the transmission will be rejected.\nThen, the user must click the 'Prepare file for transmission' button and can transmit the Excel file to Eurostat."]
[]
[]
[]
[]
[]
[null,null,null,null,"This will load the prefilled data from a CSV file to the reporting template. This data will be stored as 'base data'.\nFunction reserved for Eurostat."]
[]
[]
[]
[null,"VALIDATION AND VISUALISATION section"]
[null,"Various graphs are available to visualise the reported data."]
[null,"Integrated checks are also available; these should be run by the user. The reported errors should be corrected before submitting the reporting template."]
[]
[null,null,null,null,"The period for which the checks needs to be launched can be selected via the 'Periods to load' button.\nBefore clicking to 'Run all checks', all worksheets must be closed. If there are worksheets open, a pop-up message will ask the user if open worksheets can be closed without saving. The user has the possibility to select cancel and then save any open worksheets.\nThe checks can then be relaunched. When launched, a separate worksheet will be generated, listing all errors from the selected periods. A filtering option is available in order to filter the results."]
[]
[]
[]
[]
[]
[]
[null,"Time Series / Form editing"]
[null,"The user is able to fill in data via the time series or main table worksheets."]
[null,"Changes are not visible in any other table until data is saved (it may be necessary to close and reopen a worksheet to view newly entered and SAVED data)."]
[]
[null,null,null,null,"This is the working view which must be used to fill-in data for the current cycle (new data and revisions for previous periods). It can also be used as a refresh button in order to reload the data if changes have been made and saved in other tables.\nWhen the user is in the 'Show new data' mode, the words on the button are green.\nIf the user inputs information (data or flags) and then clicks on 'Show new data' or 'Prefilled data', the data which was not saved will be lost."]
[]
[]
[]
[]
[]
[null,null,null,null,"The reporting template will be 'prefilled' with historical, or base data. This button will switch the data in the current table back to the base data. To switch back to any data filled in and saved by the user, the user should click on 'Show new data'.\nWARNING: This view should not be used to fill-in data! Any data should be filled-in in the 'Show new data' view! If the user fills in data while in 'Prefilled data' mode and then saves the form, this will become the working data which will then be visible in the ‘Show new data’ mode.\nWhen the user is in 'Prefilled data' mode, the words on the button are green.\nIf the user inputs information (data or flags) and then clicks on 'Show new data' or 'Prefilled data', the data which was not saved will be lost."]
[]
[]
[]
[]
[]
[]
[]
[]
[null,null,null,null,"Removes all data from the worksheet. If the worksheet is saved at this point, it will be saved blank.\nClicking 'Show new data' before saving will bring back users SAVED data, or clicking 'Prefilled data' will bring back base data."]
[]
[]
[]
[]
[null,null,null,null,"Saves the data filled in the worksheet. Nevertheless, when closing the reporting template itself, the file should also be saved."]
[]
[]
[]
[null,null,null,null,"Closes the worksheet. Any data modified since the last save, will not be saved."]
[]
[]
[]
[null,"Flags"]
[null,"The user may insert or remove flags, for just one cell or a selection of cells. To do this, simply select the cell (or range of cells) and select the appropriate flag.\nIf you wish to see only numeric data, the flags can be hidden in the worksheet by unticking the ‘See flags’ box. If the user inputs flags and then ticks/unticks the 'See flags', 'See checks' or 'See revisions' boxes, the flags which were not saved will be lost."]
[]
[]
[]
[]
[null,"M","Data cannot exist. To be used only when no values are provided."]
[null,"O","Missing value (not available/omitted/not known/not surveyed). To be used only when no values are provided."]
[null,"N","Not significant/negligible. To be used only when a '0' value is provided."]
[null,"C","Confidential value. If the data collection is in the secure environment, the C flag is used when values are provided. If the data collection is in the normal environment, the C flag is used without values."]
[]
[null,"D","Definition differs. To be used only when values are provided. An explanation should be given in the Remarks worksheet."]
[null,"B","Break in time series. To be used only when values are provided. An explanation should be given in the Remarks worksheet."]
[null,"P","Provisional value. To be used only when values are provided and only for the most recent time period."]
[null,"E","Estimated value. To be used only when values are provided."]
[null,"U","Low reliability/uncertain. To be used only when values are provided."]
[]
[null,"Checks and revisions"]
[null,"In the Time Series and Main tables, various conditions are checked. Errors are displayed in bold red, while warnings are displayed in red."]
[null,"Cells highlighted in yellow indicate a revision when compared to the prefilled data."]
[null,"The above-mentioned checks and revisions can be hidden by unticking the 'See checks' and 'See revisions' boxes. If the user inputs flags and then ticks/unticks the 'See flags', 'See checks' or 'See revisions' boxes, the flags which were not saved will be lost."]
[]
[null,"Voluntary data appear in italics."]
[]
[null,"Saving the reporting template"]
[null,"When work is complete and all individual worksheets are saved, the reporting template itself has to be saved before closing it."]
[null,"Do not forget the option \"Prepare file for transmission\", mentioned above, before submitting."]
[]
[null,"Reseting the data"]
[]
[null,null,null,null,"This will replace all working data (inculding any editing of data since the CSV was uploaded) with the original prefilled data ('base data')."]

{"sheet":"TemplateTable1","index":23,"n_rows":139,"n_cols":30,"rows_kept":139,"cut":false,"hidden":true,"merged":[]}
[null,null,null,null,null,null,null,null,null,null,null,"Table1: Annual statistics on final energy consumption in services",null,null,{"$f":"VLOOKUP(L1, LanguageData, MATCH(LanguageChosen, Language[Language],0), FALSE) &  \" - \"  & B2","v":"Table1: Annual statistics on final energy consumption in services - 2010"}]
["Time",2010,null,null,null,null,null,null,null,null,null,"Product",null,null,"TOT","ELECTR","NATGAS","HEAT","TOTALOIL","LPG","GASDIES","REN","SOLARTH","PRIMSBIO","BIOGASES","GEOTHERM","HEATPUMP","COAL","NONREN","HYDROGEN"]
["DataType :","FINCONS",null,null,null,null,null,null,null,null,null,"Item2",null,null,"TJ","GWH","TJ_GCV","TJ_NCV","KT","KT","KT","TJ_NCV","TJ_NCV","TJ_NCV","TJ_NCV","TJ_NCV","TJ_NCV","KT","TJ_NCV","TJ_NCV"]
[null,null,null,null,null,null,null,null,null,null,null,"FormulaRow",null,null,"§[Item1=C33]:[Item1=DATAC],[Item1=Formula_E]:[Item1=TOTSER]§SumListBlank(Sum([Product=ELECTR#Item2=GWH]) *3.6 + Sum([Product=NATGAS#Item2=TJ_GCV])*0.9 + Sum([Product=HEAT#Item2=TJ_NCV]) + (Sum([Product=TOTALOIL#Item2=KT])*Sum([Product=TOTALOIL#Item1=CALOR#Item2=KT]))/1000 + Sum([Product=REN#Item2=TJ_NCV]) + (Sum([Product=COAL#Item2=KT])*Sum([Product=COAL#Item1=CALOR#Item2=KT]))/1000 + Sum([Product=NONREN#Item2=TJ_NCV]) + Sum([Product=HYDROGEN#Item2=TJ_NCV]))",null,null,null,"SumListBlank(Sum([Product=LPG],[Product=GASDIES]))",null,null,"§[Item1=C33]:[Item1=DATAC],[Item1=Formula_E]:[Item1=TOTSER]§SumListBlank(Sum([Product=SOLARTH], [Product=PRIMSBIO],[Product=BIOGASES], [Product=GEOTHERM],[Product=HEATPUMP]))"]
[null,null,null,null,null,null,null,null,null,null,null,"LockedRow",null,null,1,null,null,null,null,null,null,null,null,null,null,null,null,null,null,1]
[null,null,null,null,null,null,null,null,null,null,null,"EmptyRow"]
[null,null,null,null,null,null,null,null,null,null,null,"VoluntaryRow"]
[null,null,null,null,null,null,null,null,null,null,null,"CheckRow",null,null,null,null,null,null,"§[Item1=C33]:[Item1=DATAC],[Item1=Formula_E]:[Item1=TOTSER]§< Sum([Product=LPG], [Product=GASDIES])","§[Item1=CALOR]§^AND(OR([Product=LPG#Item1=CALOR]< 43000,[Product=LPG#Item1=CALOR]>49000),[Product=LPG#Item1=CALOR]<>0)","§[Item1=CALOR]§^AND(OR([Product=GASDIES#Item1=CALOR]< 40000,[Product=GASDIES#Item1=CALOR]>45000),[Product=GASDIES#Item1=CALOR]<>0)","§[Item1=C33]:[Item1=DATAC],[Item1=Formula_E]:[Item1=TOTSER]§< Sum([Product=SOLARTH], [Product=PRIMSBIO], [Product=BIOGASES], [Product=GEOTHERM], [Product=HEATPUMP])",null,null,null,null,null,"§[Item1=CALOR]§^AND(OR([Product=COAL#Item1=CALOR]<14000,[Product=COAL#Item1=CALOR]>30000),[Product=COAL#Item1=CALOR]<>0)"]
[null,null,null,null,null,null,null,null,null,null,null,"LabelCheckRow",null,null,null,null,null,null,"Oil and Petroleum Products should be superior \nor equal to the sum of its disaggregated values","Calorific value for LPG should be between 43 000 and 49 000 MJ/t","Calorific value for Gas/Diesel oil should be \nbetween 40 000 and 45 000 MJ/t","Renewable Energies should be superior or \nequal to the sum of its disaggregated values",null,null,null,null,null,"Calorific value for Solid fossil fuels should be \nbetween 14 000 and 30 000 MJ/t"]
[null,null,null,null,null,null,null,null,null,null,null,null,null,null,"All Energy Products","Electricity","Natural Gas","Derived Heat","Oil and Petroleum Products","LPG","Gas/Diesel oil","Renewable Energies","Solar Thermal","Primary Solid Biofuels","Biogas","Geothermal","Ambient Heat","Solid Fossil Fuels","Non Renewable Waste","Hydrogen"]
["Item1","FormulaCol","CheckCol1","LabelCheckCol1","CheckCol2","LabelCheckCol2","LockedCol","EmptyCol","VoluntaryCol",null,null,null,null,null,{"$f":"VLOOKUP(O10, LanguageData, MATCH(LanguageChosen, Language[Language],0), FALSE)","v":"All Energy Products"},{"$f":"VLOOKUP(P10, LanguageData, MATCH(LanguageChosen, Language[Language],0), FALSE)","v":"Electricity"},{"$f":"VLOOKUP(Q10, LanguageData, MATCH(LanguageChosen, Language[Language],0), FALSE)","v":"Natural Gas"},{"$f":"VLOOKUP(R10, LanguageData, MATCH(LanguageChosen, Language[Language],0), FALSE)","v":"Derived Heat"},{"$f":"VLOOKUP(S10, LanguageData, MATCH(LanguageChosen, Language[Language],0), FALSE)","v":"Oil and Petroleum Products"},{"$f":"VLOOKUP(T10, LanguageData, MATCH(LanguageChosen, Language[Language],0), FALSE)","v":"LPG"},{"$f":"VLOOKUP(U10, LanguageData, MATCH(LanguageChosen, Language[Language],0), FALSE)","v":"Gas/Diesel oil"},{"$f":"VLOOKUP(V10, LanguageData, MATCH(LanguageChosen, Language[Language],0), FALSE)","v":"Renewable Energies"},{"$f":"VLOOKUP(W10, LanguageData, MATCH(LanguageChosen, Language[Language],0), FALSE)","v":"Solar Thermal"},{"$f":"VLOOKUP(X10, LanguageData, MATCH(LanguageChosen, Language[Language],0), FALSE)","v":"Primary Solid Biofuels"},{"$f":"VLOOKUP(Y10, LanguageData, MATCH(LanguageChosen, Language[Language],0), FALSE)","v":"Biogas"},{"$f":"VLOOKUP(Z10, LanguageData, MATCH(LanguageChosen, Language[Language],0), FALSE)","v":"Geothermal"},{"$f":"VLOOKUP(AA10, LanguageData, MATCH(LanguageChosen, Language[Language],0), FALSE)","v":"Ambient Heat"},{"$f":"VLOOKUP(AB10, LanguageData, MATCH(LanguageChosen, Language[Language],0), FALSE)","v":"Solid Fossil Fuels"},{"$f":"VLOOKUP(AC10, LanguageData, MATCH(LanguageChosen, Language[Language],0), FALSE)","v":"Non Renewable Waste"},{"$f":"VLOOKUP(AD10, LanguageData, MATCH(LanguageChosen, Language[Language],0), FALSE)","v":"Hydrogen"}]
[null,null,null,null,null,null,null,null,null,null,null,null,null,{"$f":"CountryName","v":"Albania"},"TJ (NCV)","GWh","TJ (GCV)","TJ (NCV)","kt","kt","kt","TJ (NCV)","TJ (NCV)","TJ (NCV)","TJ (NCV)","TJ (NCV)","TJ (NCV)","kt","TJ (NCV)","TJ (NCV)"]
["C33",null,null,null,null,null,null,null,null,null,"NACE DIVISION 33","Repair and installation of machinery and equipment",{"$f":"K13","v":"NACE DIVISION 33"},{"$f":"VLOOKUP(L13, LanguageData, MATCH(LanguageChosen, Language[Language],0), FALSE)","v":"Repair and installation of machinery and equipment"}]
["E",null,null,null,null,null,null,null,null,null,"NACE SECTION E","Water supply; sewerage, waste management and remediation activities",{"$f":"K14","v":"NACE SECTION E"},{"$f":"VLOOKUP(L14, LanguageData, MATCH(LanguageChosen, Language[Language],0), FALSE)","v":"Water supply; sewerage, waste management and remediation activities"}]
["G","§[Product=ELECTR#Item2=GWH]:[Product=HYDROGEN#Item2=TJ_NCV]§SumListBlank(Sum([Item1=G46],[Item1=G47]))","< Sum([Item1=G46], [Item1=G47])","Should be superior or equal to NACE DIVISION 46 \nplus NACE DIVISION 47",null,null,null,null,null,null,"NACE SECTION G: NACE DIVISIONS (45), 46 & 47","Wholesale and retail trade; repair of motor vehicles and motorcycles","NACE SECTION G: NACE DIVISIONS (45), 46 & 47",{"$f":"VLOOKUP(L15, LanguageData, MATCH(LanguageChosen, Language[Language],0), FALSE)","v":"Wholesale and retail trade; repair of motor vehicles and motorcycles"}]
["G46",null,null,null,null,null,null,null,null,null,"NACE DIVISION 46","Wholesale trade, except of motor vehicles and motorcycles","NACE DIVISION 46",{"$f":"VLOOKUP(L16, LanguageData, MATCH(LanguageChosen, Language[Language],0), FALSE)","v":"Wholesale trade, except of motor vehicles and motorcycles"}]
["G47",null,null,null,null,null,null,null,null,null,"NACE DIVISION 47","Retail trade, except of motor vehicles and motorcycles","NACE DIVISION 47",{"$f":"VLOOKUP(L17, LanguageData, MATCH(LanguageChosen, Language[Language],0), FALSE)","v":"Retail trade, except of motor vehicles and motorcycles"}]
["H52",null,null,null,null,null,null,null,null,null,"NACE DIVISION 52","Warehousing and support activities for transportation","NACE DIVISION 52",{"$f":"VLOOKUP(L18, LanguageData, MATCH(LanguageChosen, Language[Language],0), FALSE)","v":"Warehousing and support activities for transportation"}]
["H53",null,null,null,null,null,null,null,null,null,"NACE DIVISION 53","Postal and courier activities","NACE DIVISION 53",{"$f":"VLOOKUP(L19, LanguageData, MATCH(LanguageChosen, Language[Language],0), FALSE)","v":"Postal and courier activities"}]
["I","§[Product=ELECTR#Item2=GWH]:[Product=HYDROGEN#Item2=TJ_NCV]§SumListBlank(Sum([Item1=I55],[Item1=I56]))",null,null,null,null,1,null,null,null,"NACE SECTION I: NACE DIVISIONS 55 & 56","Accommodation and food services activities","NACE SECTION I: NACE DIVISIONS 55 & 56",{"$f":"VLOOKUP(L20, LanguageData, MATCH(LanguageChosen, Language[Language],0), FALSE)","v":"Accommodation and food services activities"}]
["I55",null,null,null,null,null,null,null,null,null,"NACE DIVISION 55","Accommodation","NACE DIVISION 55",{"$f":"VLOOKUP(L21, LanguageData, MATCH(LanguageChosen, Language[Language],0), FALSE)","v":"Accommodation"}]
["I56",null,null,null,null,null,null,null,null,null,"NACE DIVISION 56","Food and beverage services activities","NACE DIVISION 56",{"$f":"VLOOKUP(L22, LanguageData, MATCH(LanguageChosen, Language[Language],0), FALSE)","v":"Food and beverage services activities"}]
["J",null,null,null,null,null,null,null,null,null,"NACE SECTION J","Information and communication","NACE SECTION J",{"$f":"VLOOKUP(L23, LanguageData, MATCH(LanguageChosen, Language[Language],0), FALSE)","v":"Information and communication"}]
["K_L",null,null,null,null,null,null,null,null,null,"NACE SECTIONS K & L","Financial and insurance activities; real estate activities","NACE SECTIONS K & L",{"$f":"VLOOKUP(L24, LanguageData, MATCH(LanguageChosen, Language[Language],0), FALSE)","v":"Financial and insurance activities; real estate activities"}]
["M_S",null,null,null,null,null,null,null,null,null,"NACE SECTIONS M & S","Professional, scientific and technical activities; other services","NACE SECTIONS M & S",{"$f":"VLOOKUP(L25, LanguageData, MATCH(LanguageChosen, Language[Language],0), FALSE)","v":"Professional, scientific and technical activities; other services"}]
["N",null,null,null,null,null,null,null,null,null,"NACE SECTION N","Administrative and support services activities","NACE SECTION N",{"$f":"VLOOKUP(L26, LanguageData, MATCH(LanguageChosen, Language[Language],0), FALSE)","v":"Administrative and support services activities"}]
["O",null,null,null,null,null,null,null,null,null,"NACE SECTION O","Public administration and defence; compulsory social security","NACE SECTION O",{"$f":"VLOOKUP(L27, LanguageData, MATCH(LanguageChosen, Language[Language],0), FALSE)","v":"Public administration and defence; compulsory social security"}]
["P",null,null,null,null,null,null,null,null,null,"NACE SECTION P","Education","NACE SECTION P",{"$f":"VLOOKUP(L28, LanguageData, MATCH(LanguageChosen, Language[Language],0), FALSE)","v":"Education"}]
["Q",null,null,null,null,null,null,null,null,null,"NACE SECTION Q","Human health and social work activities","NACE SECTION Q",{"$f":"VLOOKUP(L29, LanguageData, MATCH(LanguageChosen, Language[Language],0), FALSE)","v":"Human health and social work activities"}]
["Q861",null,null,null,null,null,null,null,null,null,"NACE GROUP 86.1","Of which: Hospital activities","NACE GROUP 86.1",{"$f":"VLOOKUP(L30, LanguageData, MATCH(LanguageChosen, Language[Language],0), FALSE)","v":"Of which: Hospital activities"}]
["R",null,null,null,null,null,null,null,null,null,"NACE SECTION R","Arts, entertainment and recreation","NACE SECTION R",{"$f":"VLOOKUP(L31, LanguageData, MATCH(LanguageChosen, Language[Language],0), FALSE)","v":"Arts, entertainment and recreation"}]
["R93",null,null,null,null,null,null,null,null,null,"NACE DIVISION 93","Of which: Sports activities and amusement and recreation activities","NACE DIVISION 93",{"$f":"VLOOKUP(L32, LanguageData, MATCH(LanguageChosen, Language[Language],0), FALSE)","v":"Of which: Sports activities and amusement and recreation activities"}]
["U",null,null,null,null,null,null,null,null,null,"NACE SECTION U","Activities of extra-territorial organisations and bodies","NACE SECTION U",{"$f":"VLOOKUP(L33, LanguageData, MATCH(LanguageChosen, Language[Language],0), FALSE)","v":"Activities of extra-territorial organisations and bodies"}]
["DATAC",null,null,null,null,null,null,null,null,null,"DATA CENTRES","Data centres","DATA CENTRES",{"$f":"VLOOKUP(L34, LanguageData, MATCH(LanguageChosen, Language[Language],0), FALSE)","v":"Data centres"}]
["CALOR","§[Product=TOTALOIL#Item2=KT]§IF(OR([Product=LPG#Item2=KT]*sum([Product=LPG#Item1=TOTSER#Item2=KT])+[Product=GASDIES#Item2=KT]*sum([Product=GASDIES#Item1=TOTSER#Item2=KT])=0, sum([Product=TOTALOIL#Item1=TOTSER#Item2=KT])=0),\n\"\",\n([Product=LPG#Item2=KT]*sum([Product=LPG#Item1=TOTSER#Item2=KT])+[Product=GASDIES#Item2=KT]*sum([Product=GASDIES#Item1=TOTSER#Item2=KT]))/(sum([Product=LPG#Item1=TOTSER#Item2=KT])+sum([Product=GASDIES#Item1=TOTSER#Item2=KT])))\n","§[Product=TOTALOIL#Item1=CALOR#Item2=KT]§^AND(OR([Item1=CALOR]< 40000,[Item1=CALOR]>49000),[Item1=CALOR]<>0)","Calorific value for Oil and petroleum products \nshould be between 40 000 and 49 000 MJ/t",null,null,"§[Product=TOT#Item2=TJ]:[Product=HEAT#Item2=TJ_NCV],[Product=REN#Item2=TJ_NCV]:[Product=HEATPUMP#Item2=TJ_NCV],[Product=NONREN#Item2=TJ_NCV]:[Product=HYDROGEN#Item2=TJ_NCV]§1",null,null,null,"CALORIFIC VALUES","Calorific values","CALORIFIC VALUES",{"$f":"VLOOKUP(L35, LanguageData, MATCH(LanguageChosen, Language[Language],0), FALSE)","v":"Calorific values"}]
[null,null,null,null,null,null,null,1]
[null,null,null,null,null,null,null,1,null,null,"Voluntary items",null,{"$f":"VLOOKUP(K37, LanguageData, MATCH(LanguageChosen, Language[Language],0), FALSE)","v":"Voluntary items"}]
["Formula_E","§[Product=ELECTR#Item2=GWH]:[Product=HYDROGEN#Item2=TJ_NCV]§SumListBlank(Sum([Item1=E]))",null,null,null,null,1,null,1,null,"NACE SECTION E","Water supply; sewerage, waste management and remediation activities","NACE SECTION E",{"$f":"VLOOKUP(L38, LanguageData, MATCH(LanguageChosen, Language[Language],0), FALSE)","v":"Water supply; sewerage, waste management and remediation activities"}]
["E36",null,null,null,null,null,null,null,1,null,"NACE DIVISION 36","Water collection, treatment and supply","NACE DIVISION 36",{"$f":"VLOOKUP(L39, LanguageData, MATCH(LanguageChosen, Language[Language],0), FALSE)","v":"Water collection, treatment and supply"}]
["E37-E39","§[Product=ELECTR#Item2=GWH]:[Product=HYDROGEN#Item2=TJ_NCV]§SumListBlank(Sum([Item1=E37],[Item1=E38],[Item1=E39]))",null,null,null,null,null,null,1,null,"NACE DIVISIONS 37, 38 & 39","Sewerage; Waste collection, treatment and disposal activities; materials recovery; Remediation activities and other waste management services","NACE DIVISIONS 37, 38 & 39",{"$f":"VLOOKUP(L40, LanguageData, MATCH(LanguageChosen, Language[Language],0), FALSE)","v":"Sewerage; Waste collection, treatment and disposal activities; materials recovery; Remediation activities and other waste management services"}]
["E37",null,null,null,null,null,null,null,1,null,"NACE DIVISION 37","Sewerage","NACE DIVISION 37",{"$f":"VLOOKUP(L41, LanguageData, MATCH(LanguageChosen, Language[Language],0), FALSE)","v":"Sewerage"}]
["E38",null,null,null,null,null,null,null,1,null,"NACE DIVISION 38","Waste collection, treatment and disposal activities; materials recovery",{"$f":"K42","v":"NACE DIVISION 38"},{"$f":"VLOOKUP(L42, LanguageData, MATCH(LanguageChosen, Language[Language],0), FALSE)","v":"Waste collection, treatment and disposal activities; materials recovery"}]
["E39",null,null,null,null,null,null,null,1,null,"NACE DIVISION 39","Remediation activities and other waste management services","NACE DIVISION 39",{"$f":"VLOOKUP(L43, LanguageData, MATCH(LanguageChosen, Language[Language],0), FALSE)","v":"Remediation activities and other waste management services"}]
["Formula_G","§[Product=ELECTR#Item2=GWH]:[Product=HYDROGEN#Item2=TJ_NCV]§SumListBlank(Sum([Item1=G]))",null,null,null,null,1,null,1,null,"NACE SECTION G: NACE DIVISIONS (45), 46 & 47","Wholesale and retail trade; repair of motor vehicles and motorcycles","NACE SECTION G: NACE DIVISIONS (45), 46 & 47",{"$f":"VLOOKUP(L44, LanguageData, MATCH(LanguageChosen, Language[Language],0), FALSE)","v":"Wholesale and retail trade; repair of motor vehicles and motorcycles"}]
["G_HEAT",null,null,null,null,null,null,null,1,null,null,"Heating",null,{"$f":"VLOOKUP(L45, LanguageData, MATCH(LanguageChosen, Language[Language],0), FALSE)","v":"Heating"}]
["G_S_HEAT",null,null,null,null,null,null,null,1,null,null,"of which: Space heating",null,{"$f":"VLOOKUP(L46, LanguageData, MATCH(LanguageChosen, Language[Language],0), FALSE)","v":"of which: Space heating"}]
["G_W_HEAT",null,null,null,null,null,null,null,1,null,null,"of which: Water heating",null,{"$f":"VLOOKUP(L47, LanguageData, MATCH(LanguageChosen, Language[Language],0), FALSE)","v":"of which: Water heating"}]
["G_COOL",null,null,null,null,null,null,null,1,null,null,"Cooling",null,{"$f":"VLOOKUP(L48, LanguageData, MATCH(LanguageChosen, Language[Language],0), FALSE)","v":"Cooling"}]
["G_S_COOL",null,null,null,null,null,null,null,1,null,null,"of which: Space cooling",null,{"$f":"VLOOKUP(L49, LanguageData, MATCH(LanguageChosen, Language[Language],0), FALSE)","v":"of which: Space cooling"}]
["G_P_COOL",null,null,null,null,null,null,null,1,null,null,"of which: Process cooling",null,{"$f":"VLOOKUP(L50, LanguageData, MATCH(LanguageChosen, Language[Language],0), FALSE)","v":"of which: Process cooling"}]
["G_LIGHT",null,null,null,null,null,null,null,1,null,null,"Outdoor lighting",null,{"$f":"VLOOKUP(L51, LanguageData, MATCH(LanguageChosen, Language[Language],0), FALSE)","v":"Outdoor lighting"}]
["G_IN_LIGHT",null,null,null,null,null,null,null,1,null,null,"Indoor lighting, appliances and ICTs",null,{"$f":"VLOOKUP(L52, LanguageData, MATCH(LanguageChosen, Language[Language],0), FALSE)","v":"Indoor lighting, appliances and ICTs"}]
["G_OTH_BUILD",null,null,null,null,null,null,null,1,null,null,"Other building activities",null,{"$f":"VLOOKUP(L53, LanguageData, MATCH(LanguageChosen, Language[Language],0), FALSE)","v":"Other building activities"}]
["G_OTH_NBUILD",null,null,null,null,null,null,null,1,null,null,"Other non-building activities",null,{"$f":"VLOOKUP(L54, LanguageData, MATCH(LanguageChosen, Language[Language],0), FALSE)","v":"Other non-building activities"}]
["G45",null,null,null,null,null,null,null,1,null,"NACE DIVISION 45","Wholesale and retail trade and repair of motor vehicles and motorcycles","NACE DIVISION 45",{"$f":"VLOOKUP(L55, LanguageData, MATCH(LanguageChosen, Language[Language],0), FALSE)","v":"Wholesale and retail trade and repair of motor vehicles and motorcycles"}]
["Formula_G47","§[Product=ELECTR#Item2=GWH]:[Product=HYDROGEN#Item2=TJ_NCV]§SumListBlank(Sum([Item1=G47]))",null,null,null,null,1,null,1,null,"NACE DIVISION 47","Retail trade, except of motor vehicles and motorcycles","NACE DIVISION 47",{"$f":"VLOOKUP(L56, LanguageData, MATCH(LanguageChosen, Language[Language],0), FALSE)","v":"Retail trade, except of motor vehicles and motorcycles"}]
["G471",null,null,null,null,null,null,null,1,null,"NACE GROUP 47.1","Retail sale in non-specialised stores","NACE GROUP 47.1",{"$f":"VLOOKUP(L57, LanguageData, MATCH(LanguageChosen, Language[Language],0), FALSE)","v":"Retail sale in non-specialised stores"}]
["G47_X_G471",null,null,null,null,null,null,null,1,null,"NACE DIVISION 47 NOT INCLUDING NACE GROUP 47.1","Retail sale in specialised stores and other retail trade","NACE DIVISION 47 NOT INCLUDING NACE GROUP 47.1",{"$f":"VLOOKUP(L58, LanguageData, MATCH(LanguageChosen, Language[Language],0), FALSE)","v":"Retail sale in specialised stores and other retail trade"}]
["Formula_H52","§[Product=ELECTR#Item2=GWH]:[Product=HYDROGEN#Item2=TJ_NCV]§SumListBlank(Sum([Item1=H52]))",null,null,null,null,1,null,1,null,"NACE DIVISION 52","Warehousing and support activities for transportation","NACE DIVISION 52",{"$f":"VLOOKUP(L59, LanguageData, MATCH(LanguageChosen, Language[Language],0), FALSE)","v":"Warehousing and support activities for transportation"}]
["H52_STL",null,null,null,null,null,null,null,1,null,null,"Outdoor lighting (Street lighting)",null,{"$f":"VLOOKUP(L60, LanguageData, MATCH(LanguageChosen, Language[Language],0), FALSE)","v":"Outdoor lighting (Street lighting)"}]
["Formula_I55_1","§[Product=ELECTR#Item2=GWH]:[Product=HYDROGEN#Item2=TJ_NCV]§SumListBlank(Sum([Item1=I55]))",null,null,null,null,1,null,1,null,"NACE DIVISION 55","Accommodation","NACE DIVISION 55",{"$f":"VLOOKUP(L61, LanguageData, MATCH(LanguageChosen, Language[Language],0), FALSE)","v":"Accommodation"}]
["I551",null,null,null,null,null,null,null,1,null,"NACE GROUP 55.1","Hotels and similar accommodation","NACE GROUP 55.1",{"$f":"VLOOKUP(L62, LanguageData, MATCH(LanguageChosen, Language[Language],0), FALSE)","v":"Hotels and similar accommodation"}]
["I552",null,null,null,null,null,null,null,1,null,"NACE GROUP 55.2","Holiday and other short-stay accommodation","NACE GROUP 55.2",{"$f":"VLOOKUP(L63, LanguageData, MATCH(LanguageChosen, Language[Language],0), FALSE)","v":"Holiday and other short-stay accommodation"}]
["I553",null,null,null,null,null,null,null,1,null,"NACE GROUP 55.3","Camping grounds, recreational vehicle parks and trailer parks","NACE GROUP 55.3",{"$f":"VLOOKUP(L64, LanguageData, MATCH(LanguageChosen, Language[Language],0), FALSE)","v":"Camping grounds, recreational vehicle parks and trailer parks"}]
["I559",null,null,null,null,null,null,null,1,null,"NACE GROUP 55.9","Other accommodation","NACE GROUP 55.9",{"$f":"VLOOKUP(L65, LanguageData, MATCH(LanguageChosen, Language[Language],0), FALSE)","v":"Other accommodation"}]
["Formula_I55_2","§[Product=ELECTR#Item2=GWH]:[Product=HYDROGEN#Item2=TJ_NCV]§SumListBlank(Sum([Item1=I55]))",null,null,null,null,1,null,1,null,"NACE DIVISION 55","Accommodation","NACE DIVISION 55",{"$f":"VLOOKUP(L66, LanguageData, MATCH(LanguageChosen, Language[Language],0), FALSE)","v":"Accommodation"}]
["I55_HEAT",null,null,null,null,null,null,null,1,null,null,"Heating",null,{"$f":"VLOOKUP(L67, LanguageData, MATCH(LanguageChosen, Language[Language],0), FALSE)","v":"Heating"}]
["I55_S_HEAT",null,null,null,null,null,null,null,1,null,null,"of which: Space heating",null,{"$f":"VLOOKUP(L68, LanguageData, MATCH(LanguageChosen, Language[Language],0), FALSE)","v":"of which: Space heating"}]
["I55_W_HEAT",null,null,null,null,null,null,null,1,null,null,"of which: Water heating",null,{"$f":"VLOOKUP(L69, LanguageData, MATCH(LanguageChosen, Language[Language],0), FALSE)","v":"of which: Water heating"}]
["I55_COOL",null,null,null,null,null,null,null,1,null,null,"Cooling",null,{"$f":"VLOOKUP(L70, LanguageData, MATCH(LanguageChosen, Language[Language],0), FALSE)","v":"Cooling"}]
["I55_S_COOL",null,null,null,null,null,null,null,1,null,null,"of which: Space cooling",null,{"$f":"VLOOKUP(L71, LanguageData, MATCH(LanguageChosen, Language[Language],0), FALSE)","v":"of which: Space cooling"}]
["I55_P_COOL",null,null,null,null,null,null,null,1,null,null,"of which: Process cooling",null,{"$f":"VLOOKUP(L72, LanguageData, MATCH(LanguageChosen, Language[Language],0), FALSE)","v":"of which: Process cooling"}]
["I55_LIGHT",null,null,null,null,null,null,null,1,null,null,"Outdoor lighting",null,{"$f":"VLOOKUP(L73, LanguageData, MATCH(LanguageChosen, Language[Language],0), FALSE)","v":"Outdoor lighting"}]
["I55_IN_LIGHT",null,null,null,null,null,null,null,1,null,null,"Indoor lighting, appliances and ICTs",null,{"$f":"VLOOKUP(L74, LanguageData, MATCH(LanguageChosen, Language[Language],0), FALSE)","v":"Indoor lighting, appliances and ICTs"}]
["I55_OTH_BUILD",null,null,null,null,null,null,null,1,null,null,"Other building activities",null,{"$f":"VLOOKUP(L75, LanguageData, MATCH(LanguageChosen, Language[Language],0), FALSE)","v":"Other building activities"}]
["I55_OTH_NBUILD",null,null,null,null,null,null,null,1,null,null,"Other non-building activities",null,{"$f":"VLOOKUP(L76, LanguageData, MATCH(LanguageChosen, Language[Language],0), FALSE)","v":"Other non-building activities"}]
["Formula_I56_1","§[Product=ELECTR#Item2=GWH]:[Product=HYDROGEN#Item2=TJ_NCV]§SumListBlank(Sum([Item1=I56]))",null,null,null,null,1,null,1,null,"NACE DIVISION 56","Food and beverage service activities","NACE DIVISION 56",{"$f":"VLOOKUP(L77, LanguageData, MATCH(LanguageChosen, Language[Language],0), FALSE)","v":"Food and beverage service activities"}]
["I561",null,null,null,null,null,null,null,1,null,"NACE GROUP 56.1","Restaurants and mobile food service activities","NACE GROUP 56.1",{"$f":"VLOOKUP(L78, LanguageData, MATCH(LanguageChosen, Language[Language],0), FALSE)","v":"Restaurants and mobile food service activities"}]
["I562",null,null,null,null,null,null,null,1,null,"NACE GROUP 56.2","Event catering and other food service activities","NACE GROUP 56.2",{"$f":"VLOOKUP(L79, LanguageData, MATCH(LanguageChosen, Language[Language],0), FALSE)","v":"Event catering and other food service activities"}]
["I563",null,null,null,null,null,null,null,1,null,"NACE GROUP 56.3","Beverage serving activities",{"$f":"K80","v":"NACE GROUP 56.3"},{"$f":"VLOOKUP(L80, LanguageData, MATCH(LanguageChosen, Language[Language],0), FALSE)","v":"Beverage serving activities"}]
["Formula_I56_2","§[Product=ELECTR#Item2=GWH]:[Product=HYDROGEN#Item2=TJ_NCV]§SumListBlank(Sum([Item1=I56]))",null,null,null,null,1,null,1,null,"NACE DIVISION 56","Food and beverage service activities","NACE DIVISION 56",{"$f":"VLOOKUP(L81, LanguageData, MATCH(LanguageChosen, Language[Language],0), FALSE)","v":"Food and beverage service activities"}]
["I56_HEAT",null,null,null,null,null,null,null,1,null,null,"Heating",null,{"$f":"VLOOKUP(L82, LanguageData, MATCH(LanguageChosen, Language[Language],0), FALSE)","v":"Heating"}]
["I56_S_HEAT",null,null,null,null,null,null,null,1,null,null,"of which: Space heating",null,{"$f":"VLOOKUP(L83, LanguageData, MATCH(LanguageChosen, Language[Language],0), FALSE)","v":"of which: Space heating"}]
["I56_W_HEAT",null,null,null,null,null,null,null,1,null,null,"of which: Water heating",null,{"$f":"VLOOKUP(L84, LanguageData, MATCH(LanguageChosen, Language[Language],0), FALSE)","v":"of which: Water heating"}]
["I56_COOL",null,null,null,null,null,null,null,1,null,null,"Cooling",null,{"$f":"VLOOKUP(L85, LanguageData, MATCH(LanguageChosen, Language[Language],0), FALSE)","v":"Cooling"}]
["I56_S_COOL",null,null,null,null,null,null,null,1,null,null,"of which: Space cooling",null,{"$f":"VLOOKUP(L86, LanguageData, MATCH(LanguageChosen, Language[Language],0), FALSE)","v":"of which: Space cooling"}]
["I56_P_COOL",null,null,null,null,null,null,null,1,null,null,"of which: Process cooling",null,{"$f":"VLOOKUP(L87, LanguageData, MATCH(LanguageChosen, Language[Language],0), FALSE)","v":"of which: Process cooling"}]
["I56_LIGHT",null,null,null,null,null,null,null,1,null,null,"Outdoor lighting",null,{"$f":"VLOOKUP(L88, LanguageData, MATCH(LanguageChosen, Language[Language],0), FALSE)","v":"Outdoor lighting"}]
["I56_IN_LIGHT",null,null,null,null,null,null,null,1,null,null,"Indoor lighting, appliances and ICTs",null,{"$f":"VLOOKUP(L89, LanguageData, MATCH(LanguageChosen, Language[Language],0), FALSE)","v":"Indoor lighting, appliances and ICTs"}]
["I56_OTH_BUILD",null,null,null,null,null,null,null,1,null,null,"Other building activities",null,{"$f":"VLOOKUP(L90, LanguageData, MATCH(LanguageChosen, Language[Language],0), FALSE)","v":"Other building activities"}]
["I56_OTH_NBUILD",null,null,null,null,null,null,null,1,null,null,"Other non-building activities",null,{"$f":"VLOOKUP(L91, LanguageData, MATCH(LanguageChosen, Language[Language],0), FALSE)","v":"Other non-building activities"}]
["Formula_J","§[Product=ELECTR#Item2=GWH]:[Product=HYDROGEN#Item2=TJ_NCV]§SumListBlank(Sum([Item1=J]))",null,null,null,null,1,null,1,null,"NACE SECTION J","Information and communication","NACE SECTION J",{"$f":"VLOOKUP(L92, LanguageData, MATCH(LanguageChosen, Language[Language],0), FALSE)","v":"Information and communication"}]
["J58",null,null,null,null,null,null,null,1,null,"NACE DIVISION 58","Publishing activities","NACE DIVISION 58",{"$f":"VLOOKUP(L93, LanguageData, MATCH(LanguageChosen, Language[Language],0), FALSE)","v":"Publishing activities"}]
["J59_J60",null,null,null,null,null,null,null,1,null,"NACE DIVISIONS 59 & 60","Motion picture, video and television programme production, sound recording and music publishing activities; Programming and broadcasting activities","NACE DIVISIONS 59 & 60",{"$f":"VLOOKUP(L94, LanguageData, MATCH(LanguageChosen, Language[Language],0), FALSE)","v":"Motion picture, video and television programme production, sound recording and music publishing activities; Programming and broadcasting activities"}]
["J61",null,null,null,null,null,null,null,1,null,"NACE DIVISION 61","Telecommunications","NACE DIVISION 61",{"$f":"VLOOKUP(L95, LanguageData, MATCH(LanguageChosen, Language[Language],0), FALSE)","v":"Telecommunications"}]
["J62_J63","§[Product=ELECTR#Item2=GWH]:[Product=HYDROGEN#Item2=TJ_NCV]§SumListBlank(Sum([Item1=J62],[Item1=J63]))",null,null,null,null,null,null,1,null,"NACE DIVISIONS 62 & 63","Computer programming, consultancy and related activities; Information service activities","NACE DIVISIONS 62 & 63",{"$f":"VLOOKUP(L96, LanguageData, MATCH(LanguageChosen, Language[Language],0), FALSE)","v":"Computer programming, consultancy and related activities; Information service activities"}]
["J62",null,null,null,null,null,null,null,1,null,"NACE DIVISION 62","Computer programming, consultancy and related activities","NACE DIVISION 62",{"$f":"VLOOKUP(L97, LanguageData, MATCH(LanguageChosen, Language[Language],0), FALSE)","v":"Computer programming, consultancy and related activities"}]
["J63",null,null,null,null,null,null,null,1,null,"NACE DIVISION 63","Information service activities","NACE DIVISION 63",{"$f":"VLOOKUP(L98, LanguageData, MATCH(LanguageChosen, Language[Language],0), FALSE)","v":"Information service activities"}]
["K",null,null,null,null,null,null,null,1,null,"NACE SECTION K","Financial and insurance activities","NACE SECTION K",{"$f":"VLOOKUP(L99, LanguageData, MATCH(LanguageChosen, Language[Language],0), FALSE)","v":"Financial and insurance activities"}]
["L",null,null,null,null,null,null,null,1,null,"NACE SECTION L","Real estate activities","NACE SECTION L",{"$f":"VLOOKUP(L100, LanguageData, MATCH(LanguageChosen, Language[Language],0), FALSE)","v":"Real estate activities"}]
["M","§[Product=ELECTR#Item2=GWH]:[Product=HYDROGEN#Item2=TJ_NCV]§SumListBlank(Sum([Item1=M69_M70], [Item1=M71], [Item1=M72], [Item1=M73], [Item1=M74_M75]))","§[Product=ELECTR#Item2=GWH]:[Product=HYDROGEN#Item2=TJ_NCV]§< Sum([Item1=M69_M70], [Item1=M71], [Item1=M72], [Item1=M73], [Item1=M74_M75])","Should be superior or equal to NACE DIVISION 69\nto NACE DIVISION 75",null,null,null,null,1,null,"NACE SECTION M","Professional, scientific and technical activities","NACE SECTION M",{"$f":"VLOOKUP(L101, LanguageData, MATCH(LanguageChosen, Language[Language],0), FALSE)","v":"Professional, scientific and technical activities"}]
["M69_M70",null,null,null,null,null,null,null,1,null,"NACE DIVISIONS 69 & 70","Legal and accounting activities; Activities of head offices, management consultancy activities","NACE DIVISIONS 69 & 70",{"$f":"VLOOKUP(L102, LanguageData, MATCH(LanguageChosen, Language[Language],0), FALSE)","v":"Legal and accounting activities; Activities of head offices, management consultancy activities"}]
["M71",null,null,null,null,null,null,null,1,null,"NACE DIVISION 71","Architectural and engineering activities, technical testing and analysis","NACE DIVISION 71",{"$f":"VLOOKUP(L103, LanguageData, MATCH(LanguageChosen, Language[Language],0), FALSE)","v":"Architectural and engineering activities, technical testing and analysis"}]
["M72",null,null,null,null,null,null,null,1,null,"NACE DIVISION 72","Scientific research and development","NACE DIVISION 72",{"$f":"VLOOKUP(L104, LanguageData, MATCH(LanguageChosen, Language[Language],0), FALSE)","v":"Scientific research and development"}]
["M73",null,null,null,null,null,null,null,1,null,"NACE DIVISION 73","Advertising and market research","NACE DIVISION 73",{"$f":"VLOOKUP(L105, LanguageData, MATCH(LanguageChosen, Language[Language],0), FALSE)","v":"Advertising and market research"}]
["M74_M75",null,null,null,null,null,null,null,1,null,"NACE DIVISIONS 74 & 75","Veterinary activities; Other professional, scientific and technical activities","NACE DIVISIONS 74 & 75",{"$f":"VLOOKUP(L106, LanguageData, MATCH(LanguageChosen, Language[Language],0), FALSE)","v":"Veterinary activities; Other professional, scientific and technical activities"}]
["Formula_N","§[Product=ELECTR#Item2=GWH]:[Product=HYDROGEN#Item2=TJ_NCV]§SumListBlank(Sum([Item1=N]))",null,null,null,null,1,null,1,null,"NACE SECTION N","Administrative and support service activities","NACE SECTION N",{"$f":"VLOOKUP(L107, LanguageData, MATCH(LanguageChosen, Language[Language],0), FALSE)","v":"Administrative and support service activities"}]
["N77",null,null,null,null,null,null,null,1,null,"NACE DIVISION 77","Rental and leasing activities","NACE DIVISION 77",{"$f":"VLOOKUP(L108, LanguageData, MATCH(LanguageChosen, Language[Language],0), FALSE)","v":"Rental and leasing activities"}]
["N78",null,null,null,null,null,null,null,1,null,"NACE DIVISION 78","Employment activities","NACE DIVISION 78",{"$f":"VLOOKUP(L109, LanguageData, MATCH(LanguageChosen, Language[Language],0), FALSE)","v":"Employment activities"}]
["N79",null,null,null,null,null,null,null,1,null,"NACE DIVISION 79","Travel agency, tour operator and other reservation service and related activities","NACE DIVISION 79",{"$f":"VLOOKUP(L110, LanguageData, MATCH(LanguageChosen, Language[Language],0), FALSE)","v":"Travel agency, tour operator and other reservation service and related activities"}]
["N80-N82",null,null,null,null,null,null,null,1,null,"NACE DIVISIONS 80, 81 & 82","Security and investigation activities; Services to buildings and landscape activities; Office administrative, office support and other business support activities","NACE DIVISIONS 80, 81 & 82",{"$f":"VLOOKUP(L111, LanguageData, MATCH(LanguageChosen, Language[Language],0), FALSE)","v":"Security and investigation activities; Services to buildings and landscape activities; Office administrative, office support and other business support activities"}]
["Formula_O","§[Product=ELECTR#Item2=GWH]:[Product=HYDROGEN#Item2=TJ_NCV]§SumListBlank(Sum([Item1=O]))",null,null,null,null,1,null,1,null,"NACE SECTION O","Public administrative and defence; compulsory social security","NACE SECTION O",{"$f":"VLOOKUP(L112, LanguageData, MATCH(LanguageChosen, Language[Language],0), FALSE)","v":"Public administrative and defence; compulsory social security"}]
["O_HEAT",null,null,null,null,null,null,null,1,null,null,"Heating",null,{"$f":"VLOOKUP(L113, LanguageData, MATCH(LanguageChosen, Language[Language],0), FALSE)","v":"Heating"}]
["O_S_HEAT",null,null,null,null,null,null,null,1,null,null,"of which: Space heating",null,{"$f":"VLOOKUP(L114, LanguageData, MATCH(LanguageChosen, Language[Language],0), FALSE)","v":"of which: Space heating"}]
["O_W_HEAT",null,null,null,null,null,null,null,1,null,null,"of which: Water heating",null,{"$f":"VLOOKUP(L115, LanguageData, MATCH(LanguageChosen, Language[Language],0), FALSE)","v":"of which: Water heating"}]
["O_COOL",null,null,null,null,null,null,null,1,null,null,"Cooling",null,{"$f":"VLOOKUP(L116, LanguageData, MATCH(LanguageChosen, Language[Language],0), FALSE)","v":"Cooling"}]
["O_S_COOL",null,null,null,null,null,null,null,1,null,null,"of which: Space cooling",null,{"$f":"VLOOKUP(L117, LanguageData, MATCH(LanguageChosen, Language[Language],0), FALSE)","v":"of which: Space cooling"}]
["O_P_COOL",null,null,null,null,null,null,null,1,null,null,"of which: Process cooling",null,{"$f":"VLOOKUP(L118, LanguageData, MATCH(LanguageChosen, Language[Language],0), FALSE)","v":"of which: Process cooling"}]
["O_LIGHT",null,null,null,null,null,null,null,1,null,null,"Outdoor lighting",null,{"$f":"VLOOKUP(L119, LanguageData, MATCH(LanguageChosen, Language[Language],0), FALSE)","v":"Outdoor lighting"}]
["O_IN_LIGHT",null,null,null,null,null,null,null,1,null,null,"Indoor lighting, appliances and ICTs",null,{"$f":"VLOOKUP(L120, LanguageData, MATCH(LanguageChosen, Language[Language],0), FALSE)","v":"Indoor lighting, appliances and ICTs"}]
["O_OTH_BUILD",null,null,null,null,null,null,null,1,null,null,"Other building activities",null,{"$f":"VLOOKUP(L121, LanguageData, MATCH(LanguageChosen, Language[Language],0), FALSE)","v":"Other building activities"}]
["O_OTH_NBUILD",null,null,null,null,null,null,null,1,null,null,"Other non-building activities",null,{"$f":"VLOOKUP(L122, LanguageData, MATCH(LanguageChosen, Language[Language],0), FALSE)","v":"Other non-building activities"}]
["Formula_Q861","§[Product=ELECTR#Item2=GWH]:[Product=HYDROGEN#Item2=TJ_NCV]§SumListBlank(Sum([Item1=Q861]))",null,null,null,null,1,null,1,null,"NACE GROUP 86.1","Hospital activities","NACE GROUP 86.1",{"$f":"VLOOKUP(L123, LanguageData, MATCH(LanguageChosen, Language[Language],0), FALSE)","v":"Hospital activities"}]
["Q861_HEAT",null,null,null,null,null,null,null,1,null,null,"Heating",null,{"$f":"VLOOKUP(L124, LanguageData, MATCH(LanguageChosen, Language[Language],0), FALSE)","v":"Heating"}]
["Q861_S_HEAT",null,null,null,null,null,null,null,1,null,null,"of which: Space heating",null,{"$f":"VLOOKUP(L125, LanguageData, MATCH(LanguageChosen, Language[Language],0), FALSE)","v":"of which: Space heating"}]
["Q861_W_HEAT",null,null,null,null,null,null,null,1,null,null,"of which: Water heating",null,{"$f":"VLOOKUP(L126, LanguageData, MATCH(LanguageChosen, Language[Language],0), FALSE)","v":"of which: Water heating"}]
["Q861_COOL",null,null,null,null,null,null,null,1,null,null,"Cooling",null,{"$f":"VLOOKUP(L127, LanguageData, MATCH(LanguageChosen, Language[Language],0), FALSE)","v":"Cooling"}]
["Q861_S_COOL",null,null,null,null,null,null,null,1,null,null,"of which: Space cooling",null,{"$f":"VLOOKUP(L128, LanguageData, MATCH(LanguageChosen, Language[Language],0), FALSE)","v":"of which: Space cooling"}]
["Q861_P_COOL",null,null,null,null,null,null,null,1,null,null,"of which: Process cooling",null,{"$f":"VLOOKUP(L129, LanguageData, MATCH(LanguageChosen, Language[Language],0), FALSE)","v":"of which: Process cooling"}]
["Q861_LIGHT",null,null,null,null,null,null,null,1,null,null,"Outdoor lighting",null,{"$f":"VLOOKUP(L130, LanguageData, MATCH(LanguageChosen, Language[Language],0), FALSE)","v":"Outdoor lighting"}]
["Q861_IN_LIGHT",null,null,null,null,null,null,null,1,null,null,"Indoor lighting, appliances and ICTs",null,{"$f":"VLOOKUP(L131, LanguageData, MATCH(LanguageChosen, Language[Language],0), FALSE)","v":"Indoor lighting, appliances and ICTs"}]
["Q861_OTH_BUILD",null,null,null,null,null,null,null,1,null,null,"Other building activities",null,{"$f":"VLOOKUP(L132, LanguageData, MATCH(LanguageChosen, Language[Language],0), FALSE)","v":"Other building activities"}]
["Q861_OTH_NBUILD",null,null,null,null,null,null,null,1,null,null,"Other non-building activities",null,{"$f":"VLOOKUP(L133, LanguageData, MATCH(LanguageChosen, Language[Language],0), FALSE)","v":"Other non-building activities"}]
["Formula_R","§[Product=ELECTR#Item2=GWH]:[Product=HYDROGEN#Item2=TJ_NCV]§SumListBlank(Sum([Item1=R]))",null,null,null,null,1,null,1,null,"NACE SECTION R","Arts, entertainment and recreation","NACE SECTION R",{"$f":"VLOOKUP(L134, LanguageData, MATCH(LanguageChosen, Language[Language],0), FALSE)","v":"Arts, entertainment and recreation"}]
["R90-R92","§[Product=ELECTR#Item2=GWH]:[Product=HYDROGEN#Item2=TJ_NCV]§SumListBlank(Sum([Item1=R]) - Sum([Item1=R93]))",null,null,null,null,null,null,1,null,"NACE DIVISIONS 90, 91 & 92","Creative, arts and entertainment activities; Libraries, archives, museums and other cultural activities; Gambling and betting activities","NACE DIVISIONS 90, 91 & 92",{"$f":"VLOOKUP(L135, LanguageData, MATCH(LanguageChosen, Language[Language],0), FALSE)","v":"Creative, arts and entertainment activities; Libraries, archives, museums and other cultural activities; Gambling and betting activities"}]
["Formula_R93","§[Product=ELECTR#Item2=GWH]:[Product=HYDROGEN#Item2=TJ_NCV]§SumListBlank(Sum([Item1=R93]))",null,null,null,null,1,null,1,null,"NACE DIVISION 93","Sports activities and amusement and recreation activities","NACE DIVISION 93",{"$f":"VLOOKUP(L136, LanguageData, MATCH(LanguageChosen, Language[Language],0), FALSE)","v":"Sports activities and amusement and recreation activities"}]
["S",null,null,null,null,null,null,null,1,null,"NACE SECTION S","Other service activities","NACE SECTION S",{"$f":"VLOOKUP(L137, LanguageData, MATCH(LanguageChosen, Language[Language],0), FALSE)","v":"Other service activities"}]
[null,null,null,null,null,null,null,1]
["TOTSER","§[Product=ELECTR#Item2=GWH]:[Product=HYDROGEN#Item2=TJ_NCV]§SumListBlank(Sum([Item1=C33],[Item1=E],[Item1=G],[Item1=H52],[Item1=H53],[Item1=I],[Item1=J],[Item1=K_L],[Item1=M_S],[Item1=N],[Item1=O],[Item1=P],[Item1=Q],[Item1=R],[Item1=U]))","§[Product=TOTALOIL#ITEM2=KT]:[Product=GASDIES#ITEM2=KT],[Product=COAL#ITEM2=KT]§AND(sum([Item1=TOTSER])>0,sum([Item1=CALOR])<1)","If a value is reported, the equivalent Calorific Value\nshould also be reported.",null,null,1,null,null,null,null,"Services total",null,{"$f":"VLOOKUP(L139, LanguageData, MATCH(LanguageChosen, Language[Language],0), FALSE)","v":"Services total"}]

{"sheet":"TemplateRemarks","index":24,"n_rows":35,"n_cols":5,"rows_kept":35,"cut":false,"hidden":true,"merged":[[0,4,2,4]]}
["Mode","Remarks",null,null,{"$f":"VLOOKUP(B1, LanguageData, MATCH(LanguageChosen, Language[Language],0), FALSE) & \" - \" & B4","v":"Remarks - "}]
["DataType"]
["Product",null,null,{"$f":"CountryName","v":"Albania"}]
["Time"]
["Item2",null,"TypeRow",null,"txt"]
[]
["Item1",null,"Label"]
["REMROW01",null,"Remarks 1"]
["REMROW02",null,"Remarks 2"]
["REMROW03",null,"Remarks 3"]
["REMROW04",null,"Remarks 4"]
["REMROW05",null,"Remarks 5"]
["REMROW06",null,"Remarks 6"]
["REMROW07",null,"Remarks 7"]
["REMROW08",null,"Remarks 8"]
["REMROW09",null,"Remarks 9"]
["REMROW10",null,"Remarks 10"]
["REMROW11",null,"Remarks 11"]
["REMROW12",null,"Remarks 12"]
["REMROW13",null,"Remarks 13"]
["REMROW14",null,"Remarks 14"]
["REMROW15",null,"Remarks 15"]
["REMROW16",null,"Remarks 16"]
["REMROW17",null,"Remarks 17"]
["REMROW18",null,"Remarks 18"]
["REMROW19",null,"Remarks 19"]
["REMROW20",null,"Remarks 20"]
["REMROW21",null,"Remarks 21"]
["REMROW22",null,"Remarks 22"]
["REMROW23",null,"Remarks 23"]
["REMROW24",null,"Remarks 24"]
["REMROW25",null,"Remarks 25"]
["REMROW26",null,"Remarks 26"]
["REMROW27",null,"Remarks 27"]
["REMROW28",null,"Remarks 28"]

{"sheet":"Template_TS","index":25,"n_rows":137,"n_cols":18,"rows_kept":137,"cut":false,"hidden":true,"merged":[]}
[null,null,null,null,null,null,null,null,null,"Table1: Annual statistics on final energy consumption in services",null,null,null,{"$f":"VLOOKUP(J1,LanguageData,MATCH(LanguageChosen,Language[Language],0),FALSE) & \" - \"  & C4 &  \" (\" &  C5 &  \")\"","v":"Table1: Annual statistics on final energy consumption in services - All Energy Products (kt)"}]
[]
["DataType :","FINCONS",null,null,null,null,null,null,null,"Time",null,null,null,2020,2021,2022,2023,2024]
["Version","TOT",{"$f":"VLOOKUP(B4,Param_Menu!J:K,2,FALSE)","v":"All Energy Products"},null,null,null,null,null,null,"FormulaRow",null,null,null,{"$f":"IF($B$4=\"TOT\",\"§[Product=TOT#Item1=C33]:[Product=TOT#Item1=TOTSER]§\"&\"SumListBlank(Sum([ext:Product=ELECTR#Item2=GWH]) *3.6 + Sum([ext:Product=NATGAS#Item2=TJ_GCV])*0.9 + Sum([ext:Product=HEAT#Item2=TJ_NCV]) + (Sum([ext:Product=TOTALOIL#Item2=KT])*Sum([ext:Product=TOTALOIL#Item1=CALOR#Item2=KT]))/1000\" & \" + Sum([ext:Product=REN#Item2=TJ_NCV]) + (Sum([ext:Product=COAL#Item2=KT])*Sum([ext:Product=COAL#Item1=CALOR#Item2=KT]))/1000 + Sum([ext:Product=NONREN#Item2=TJ_NCV]) + Sum([ext:Product=HYDROGEN#Item2=TJ_NCV]))\",\nIF($B$4=\"TOTALOIL\",\"§[Product=TOTALOIL#Item1=C33]:[Product=TOTALOIL#Item1=TOTSER]§\"&\"SumListBlank(Sum([ext:Product=LPG],[ext:Product=GASDIES]))\",\nIF($B$4=\"REN\",\"§[Product=REN#Item1=C33]:[Product=REN#Item1=TOTSER]§\"&\"SumListBlank(Sum([ext:Product=SOLARTH],[ext:Product=PRIMSBIO],[ext:Product=BIOGASES],[ext:Product=GEOTHERM],[ext:Product=HEATPUMP]))\",\n\"\")))","v":"§[Product=TOT#Item1=C33]:[Product=TOT#Item1=TOTSER]§SumListBlank(Sum([ext:Product=ELECTR#Item2=GWH]) *3.6 + Sum([ext:Product=NATGAS#Item2=TJ_GCV])*0.9 + Sum([ext:Product=HEAT#Item2=TJ_NCV]) + (Sum([ext:Product=TOTALOIL#Item2=KT])*Sum([ext:Product=TOTALOIL#Item1=CALOR#Item2=KT]))/1000 + Sum([ext:Product=REN#Item2=TJ_NCV]) + (Sum([ext:Product=COAL#Item2=KT])*Sum([ext:Product=COAL#Item1=CALOR#Item2=KT]))/1000 + Sum([ext:Product=NONREN#Item2=TJ_NCV]) + Sum([ext:Product=HYDROGEN#Item2=TJ_NCV]))"},{"$f":"IF($B$4=\"TOT\",\"§[Product=TOT#Item1=C33]:[Product=TOT#Item1=TOTSER]§\"&\"SumListBlank(Sum([ext:Product=ELECTR#Item2=GWH]) *3.6 + Sum([ext:Product=NATGAS#Item2=TJ_GCV])*0.9 + Sum([ext:Product=HEAT#Item2=TJ_NCV]) + (Sum([ext:Product=TOTALOIL#Item2=KT])*Sum([ext:Product=TOTALOIL#Item1=CALOR#Item2=KT]))/1000\" & \" + Sum([ext:Product=REN#Item2=TJ_NCV]) + (Sum([ext:Product=COAL#Item2=KT])*Sum([ext:Product=COAL#Item1=CALOR#Item2=KT]))/1000 + Sum([ext:Product=NONREN#Item2=TJ_NCV]) + Sum([ext:Product=HYDROGEN#Item2=TJ_NCV]))\",\nIF($B$4=\"TOTALOIL\",\"§[Product=TOTALOIL#Item1=C33]:[Product=TOTALOIL#Item1=TOTSER]§\"&\"SumListBlank(Sum([ext:Product=LPG],[ext:Product=GASDIES]))\",\nIF($B$4=\"REN\",\"§[Product=REN#Item1=C33]:[Product=REN#Item1=TOTSER]§\"&\"SumListBlank(Sum([ext:Product=SOLARTH],[ext:Product=PRIMSBIO],[ext:Product=BIOGASES],[ext:Product=GEOTHERM],[ext:Product=HEATPUMP]))\",\n\"\")))","v":"§[Product=TOT#Item1=C33]:[Product=TOT#Item1=TOTSER]§SumListBlank(Sum([ext:Product=ELECTR#Item2=GWH]) *3.6 + Sum([ext:Product=NATGAS#Item2=TJ_GCV])*0.9 + Sum([ext:Product=HEAT#Item2=TJ_NCV]) + (Sum([ext:Product=TOTALOIL#Item2=KT])*Sum([ext:Product=TOTALOIL#Item1=CALOR#Item2=KT]))/1000 + Sum([ext:Product=REN#Item2=TJ_NCV]) + (Sum([ext:Product=COAL#Item2=KT])*Sum([ext:Product=COAL#Item1=CALOR#Item2=KT]))/1000 + Sum([ext:Product=NONREN#Item2=TJ_NCV]) + Sum([ext:Product=HYDROGEN#Item2=TJ_NCV]))"},{"$f":"IF($B$4=\"TOT\",\"§[Product=TOT#Item1=C33]:[Product=TOT#Item1=TOTSER]§\"&\"SumListBlank(Sum([ext:Product=ELECTR#Item2=GWH]) *3.6 + Sum([ext:Product=NATGAS#Item2=TJ_GCV])*0.9 + Sum([ext:Product=HEAT#Item2=TJ_NCV]) + (Sum([ext:Product=TOTALOIL#Item2=KT])*Sum([ext:Product=TOTALOIL#Item1=CALOR#Item2=KT]))/1000\" & \" + Sum([ext:Product=REN#Item2=TJ_NCV]) + (Sum([ext:Product=COAL#Item2=KT])*Sum([ext:Product=COAL#Item1=CALOR#Item2=KT]))/1000 + Sum([ext:Product=NONREN#Item2=TJ_NCV]) + Sum([ext:Product=HYDROGEN#Item2=TJ_NCV]))\",\nIF($B$4=\"TOTALOIL\",\"§[Product=TOTALOIL#Item1=C33]:[Product=TOTALOIL#Item1=TOTSER]§\"&\"SumListBlank(Sum([ext:Product=LPG],[ext:Product=GASDIES]))\",\nIF($B$4=\"REN\",\"§[Product=REN#Item1=C33]:[Product=REN#Item1=TOTSER]§\"&\"SumListBlank(Sum([ext:Product=SOLARTH],[ext:Product=PRIMSBIO],[ext:Product=BIOGASES],[ext:Product=GEOTHERM],[ext:Product=HEATPUMP]))\",\n\"\")))","v":"§[Product=TOT#Item1=C33]:[Product=TOT#Item1=TOTSER]§SumListBlank(Sum([ext:Product=ELECTR#Item2=GWH]) *3.6 + Sum([ext:Product=NATGAS#Item2=TJ_GCV])*0.9 + Sum([ext:Product=HEAT#Item2=TJ_NCV]) + (Sum([ext:Product=TOTALOIL#Item2=KT])*Sum([ext:Product=TOTALOIL#Item1=CALOR#Item2=KT]))/1000 + Sum([ext:Product=REN#Item2=TJ_NCV]) + (Sum([ext:Product=COAL#Item2=KT])*Sum([ext:Product=COAL#Item1=CALOR#Item2=KT]))/1000 + Sum([ext:Product=NONREN#Item2=TJ_NCV]) + Sum([ext:Product=HYDROGEN#Item2=TJ_NCV]))"},{"$f":"IF($B$4=\"TOT\",\"§[Product=TOT#Item1=C33]:[Product=TOT#Item1=TOTSER]§\"&\"SumListBlank(Sum([ext:Product=ELECTR#Item2=GWH]) *3.6 + Sum([ext:Product=NATGAS#Item2=TJ_GCV])*0.9 + Sum([ext:Product=HEAT#Item2=TJ_NCV]) + (Sum([ext:Product=TOTALOIL#Item2=KT])*Sum([ext:Product=TOTALOIL#Item1=CALOR#Item2=KT]))/1000\" & \" + Sum([ext:Product=REN#Item2=TJ_NCV]) + (Sum([ext:Product=COAL#Item2=KT])*Sum([ext:Product=COAL#Item1=CALOR#Item2=KT]))/1000 + Sum([ext:Product=NONREN#Item2=TJ_NCV]) + Sum([ext:Product=HYDROGEN#Item2=TJ_NCV]))\",\nIF($B$4=\"TOTALOIL\",\"§[Product=TOTALOIL#Item1=C33]:[Product=TOTALOIL#Item1=TOTSER]§\"&\"SumListBlank(Sum([ext:Product=LPG],[ext:Product=GASDIES]))\",\nIF($B$4=\"REN\",\"§[Product=REN#Item1=C33]:[Product=REN#Item1=TOTSER]§\"&\"SumListBlank(Sum([ext:Product=SOLARTH],[ext:Product=PRIMSBIO],[ext:Product=BIOGASES],[ext:Product=GEOTHERM],[ext:Product=HEATPUMP]))\",\n\"\")))","v":"§[Product=TOT#Item1=C33]:[Product=TOT#Item1=TOTSER]§SumListBlank(Sum([ext:Product=ELECTR#Item2=GWH]) *3.6 + Sum([ext:Product=NATGAS#Item2=TJ_GCV])*0.9 + Sum([ext:Product=HEAT#Item2=TJ_NCV]) + (Sum([ext:Product=TOTALOIL#Item2=KT])*Sum([ext:Product=TOTALOIL#Item1=CALOR#Item2=KT]))/1000 + Sum([ext:Product=REN#Item2=TJ_NCV]) + (Sum([ext:Product=COAL#Item2=KT])*Sum([ext:Product=COAL#Item1=CALOR#Item2=KT]))/1000 + Sum([ext:Product=NONREN#Item2=TJ_NCV]) + Sum([ext:Product=HYDROGEN#Item2=TJ_NCV]))"},"§[Product=TOT#Item1=C33]:[Product=TOT#Item1=TOTSER]§SumListBlank(Sum([ext:Product=ELECTR#Item2=GWH]) *3.6 + Sum([ext:Product=NATGAS#Item2=TJ_GCV])*0.9 + Sum([ext:Product=HEAT#Item2=TJ_NCV]) + (Sum([ext:Product=TOTALOIL#Item2=KT])*Sum([ext:Product=TOTALOIL#Item1=CALOR#Item2=KT]))/1000 + Sum([ext:Product=REN#Item2=TJ_NCV]) + (Sum([ext:Product=COAL#Item2=KT])*Sum([ext:Product=COAL#Item1=CALOR#Item2=KT]))/1000 + Sum([ext:Product=NONREN#Item2=TJ_NCV]) + Sum([ext:Product=HYDROGEN#Item2=TJ_NCV]))"]
["Item2","kt",{"$f":"VLOOKUP(B5,Param_Menu!L2:M17,2,FALSE)","v":"kt"},null,null,null,null,null,null,"CheckRow",null,null,{"$f":"IF($B$4=\"TOTALOIL\",\"< Sum([ext:Product=LPG], [ext:Product=GASDIES])\",IF($B$4=\"REN\",\"< Sum([ext:Product=SOLARTH], [ext:Product=PRIMSBIO], [ext:Product=BIOGASES], [ext:Product=GEOTHERM], [ext:Product=HEATPUMP])\",\"\"))","v":""},{"$f":"IF($B$4=\"TOTALOIL\",\"< Sum([ext:Product=LPG], [ext:Product=GASDIES])\",IF($B$4=\"REN\",\"< Sum([ext:Product=SOLARTH], [ext:Product=PRIMSBIO], [ext:Product=BIOGASES], [ext:Product=GEOTHERM], [ext:Product=HEATPUMP])\",\"\"))","v":""},{"$f":"IF($B$4=\"TOTALOIL\",\"< Sum([ext:Product=LPG], [ext:Product=GASDIES])\",IF($B$4=\"REN\",\"< Sum([ext:Product=SOLARTH], [ext:Product=PRIMSBIO], [ext:Product=BIOGASES], [ext:Product=GEOTHERM], [ext:Product=HEATPUMP])\",\"\"))","v":""},{"$f":"IF($B$4=\"TOTALOIL\",\"< Sum([ext:Product=LPG], [ext:Product=GASDIES])\",IF($B$4=\"REN\",\"< Sum([ext:Product=SOLARTH], [ext:Product=PRIMSBIO], [ext:Product=BIOGASES], [ext:Product=GEOTHERM], [ext:Product=HEATPUMP])\",\"\"))","v":""},{"$f":"IF($B$4=\"TOTALOIL\",\"< Sum([ext:Product=LPG], [ext:Product=GASDIES])\",IF($B$4=\"REN\",\"< Sum([ext:Product=SOLARTH], [ext:Product=PRIMSBIO], [ext:Product=BIOGASES], [ext:Product=GEOTHERM], [ext:Product=HEATPUMP])\",\"\"))","v":""}]
[null,null,null,null,null,null,null,null,null,"LabelCheckRow",null,null,{"$f":"IF($B$4=\"TOTALOIL\",\"Oil and Petroleum Products should be superior \nor equal to the sum of its disaggregated values\",IF($B$4=\"REN\",\"Renewable Energies should be superior or \nequal to the sum of its disaggregated values\",\"\"))","v":""},{"$f":"IF($B$4=\"TOTALOIL\",\"Oil and Petroleum Products should be superior \nor equal to the sum of its disaggregated values\",IF($B$4=\"REN\",\"Renewable Energies should be superior or \nequal to the sum of its disaggregated values\",\"\"))","v":""},"","",""]
[null,null,null,null,null,null,null,null,null,"EmptyRow"]
[null,null,null,null,null,null,null,null,null,"VoluntaryRow"]
[null,null,null,null,null,null,null,null,null,"LockedRow",null,null,{"$f":"IF($B$4=\"HYDROGEN\",1,\"\")","v":""},{"$f":"IF($B$4=\"HYDROGEN\",1,\"\")","v":""},{"$f":"IF($B$4=\"HYDROGEN\",1,\"\")","v":""},{"$f":"IF($B$4=\"HYDROGEN\",1,\"\")","v":""},{"$f":"IF($B$4=\"HYDROGEN\",1,\"\")","v":""}]
["Product","Item1","FormulaCol","CheckCol1","LabelCheckCol1","Source","LockedCol","EmptyCol","VoluntaryCol",null,null,null,{"$f":"CountryName","v":"Albania"},{"$f":"N3","v":2020},{"$f":"O3","v":2021},{"$f":"P3","v":2022},{"$f":"Q3","v":2023},{"$f":"R3","v":2024}]
[{"$f":"$B$4","v":"TOT"},"C33",null,null,null,null,{"$f":"IF($B$4=\"TOT\",1,\"\")","v":1},null,null,"NACE DIVISION 33","Repair and installation of machinery and equipment",{"$f":"J11","v":"NACE DIVISION 33"},{"$f":"VLOOKUP(K11, LanguageData, MATCH(LanguageChosen, Language[Language],0), FALSE)","v":"Repair and installation of machinery and equipment"}]
[{"$f":"$B$4","v":"TOT"},"E",null,null,null,null,1,null,null,"NACE SECTION E","Water supply; sewerage, waste management and remediation activities",{"$f":"J12","v":"NACE SECTION E"},{"$f":"VLOOKUP(K12, LanguageData, MATCH(LanguageChosen, Language[Language],0), FALSE)","v":"Water supply; sewerage, waste management and remediation activities"}]
["TOT","G",{"$f":"IF(B4=\"TOT\",\"\",\"IF(sum([Item1=G46],[Item1=G47])<>0,sum([Item1=G46],[Item1=G47]),\"\"\"\")\")","v":""},"< Sum([Item1=G46], [Item1=G47])","Should be superior or equal to NACE DIVISION 46 \nplus NACE DIVISION 47",null,1,null,null,"NACE SECTION G: NACE DIVISIONS (45), 46 & 47","Wholesale and retail trade; repair of motor vehicles and motorcycles","NACE SECTION G: NACE DIVISIONS (45), 46 & 47",{"$f":"VLOOKUP(K13, LanguageData, MATCH(LanguageChosen, Language[Language],0), FALSE)","v":"Wholesale and retail trade; repair of motor vehicles and motorcycles"}]
["TOT","G46",null,null,null,null,1,null,null,"NACE DIVISION 46","Wholesale trade, except of motor vehicles and motorcycles","NACE DIVISION 46",{"$f":"VLOOKUP(K14, LanguageData, MATCH(LanguageChosen, Language[Language],0), FALSE)","v":"Wholesale trade, except of motor vehicles and motorcycles"}]
["TOT","G47",null,null,null,null,1,null,null,"NACE DIVISION 47","Retail trade, except of motor vehicles and motorcycles","NACE DIVISION 47",{"$f":"VLOOKUP(K15, LanguageData, MATCH(LanguageChosen, Language[Language],0), FALSE)","v":"Retail trade, except of motor vehicles and motorcycles"}]
["TOT","H52",null,null,null,null,1,null,null,"NACE DIVISION 52","Warehousing and support activities for transportation","NACE DIVISION 52",{"$f":"VLOOKUP(K16, LanguageData, MATCH(LanguageChosen, Language[Language],0), FALSE)","v":"Warehousing and support activities for transportation"}]
["TOT","H53",null,null,null,null,1,null,null,"NACE DIVISION 53","Postal and courier activities","NACE DIVISION 53",{"$f":"VLOOKUP(K17, LanguageData, MATCH(LanguageChosen, Language[Language],0), FALSE)","v":"Postal and courier activities"}]
["TOT","I",{"$f":"IF(B4=\"TOT\",\"\",\"IF(sum([Item1=I55],[Item1=I56])<>0,sum([Item1=I55],[Item1=I56]),\"\"\"\")\")","v":""},null,null,null,1,null,null,"NACE SECTION I: NACE DIVISIONS 55 & 56","Accommodation and food services activities","NACE SECTION I: NACE DIVISIONS 55 & 56",{"$f":"VLOOKUP(K18, LanguageData, MATCH(LanguageChosen, Language[Language],0), FALSE)","v":"Accommodation and food services activities"}]
["TOT","I55",null,null,null,null,{"$f":"IF($B$4=\"TOT\",1,\"\")","v":1},null,null,"NACE DIVISION 55","Accommodation","NACE DIVISION 55",{"$f":"VLOOKUP(K19, LanguageData, MATCH(LanguageChosen, Language[Language],0), FALSE)","v":"Accommodation"}]
["TOT","I56",null,null,null,null,{"$f":"IF($B$4=\"TOT\",1,\"\")","v":1},null,null,"NACE DIVISION 56","Food services activities","NACE DIVISION 56",{"$f":"VLOOKUP(K20, LanguageData, MATCH(LanguageChosen, Language[Language],0), FALSE)","v":"Food services activities"}]
["TOT","J",null,null,null,null,{"$f":"IF($B$4=\"TOT\",1,\"\")","v":1},null,null,"NACE SECTION J","Information and communication","NACE SECTION J",{"$f":"VLOOKUP(K21, LanguageData, MATCH(LanguageChosen, Language[Language],0), FALSE)","v":"Information and communication"}]
["TOT","K_L",null,null,null,null,1,null,null,"NACE SECTIONS K & L","Financial and insurance activities; real estate activities","NACE SECTIONS K & L",{"$f":"VLOOKUP(K22, LanguageData, MATCH(LanguageChosen, Language[Language],0), FALSE)","v":"Financial and insurance activities; real estate activities"}]
["TOT","M_S",null,null,null,null,1,null,null,"NACE SECTIONS M & S","Professional, scientific and technical activities; other services","NACE SECTIONS M & S",{"$f":"VLOOKUP(K23, LanguageData, MATCH(LanguageChosen, Language[Language],0), FALSE)","v":"Professional, scientific and technical activities; other services"}]
["TOT","N",null,null,null,null,1,null,null,"NACE SECTION N","Administrative and support services activities","NACE SECTION N",{"$f":"VLOOKUP(K24, LanguageData, MATCH(LanguageChosen, Language[Language],0), FALSE)","v":"Administrative and support services activities"}]
["TOT","O",null,null,null,null,1,null,null,"NACE SECTION O","Public administration and defence; compulsory social security","NACE SECTION O",{"$f":"VLOOKUP(K25, LanguageData, MATCH(LanguageChosen, Language[Language],0), FALSE)","v":"Public administration and defence; compulsory social security"}]
["TOT","P",null,null,null,null,1,null,null,"NACE SECTION P","Education","NACE SECTION P",{"$f":"VLOOKUP(K26, LanguageData, MATCH(LanguageChosen, Language[Language],0), FALSE)","v":"Education"}]
["TOT","Q",null,null,null,null,1,null,null,"NACE SECTION Q","Human health and social work activities","NACE SECTION Q",{"$f":"VLOOKUP(K27, LanguageData, MATCH(LanguageChosen, Language[Language],0), FALSE)","v":"Human health and social work activities"}]
["TOT","Q861",null,null,null,null,1,null,null,"NACE GROUP 86.1","Of which: Hospital activities","NACE GROUP 86.1",{"$f":"VLOOKUP(K28, LanguageData, MATCH(LanguageChosen, Language[Language],0), FALSE)","v":"Of which: Hospital activities"}]
["TOT","R",null,null,null,null,1,null,null,"NACE SECTION R","Arts, entertainment and recreation","NACE SECTION R",{"$f":"VLOOKUP(K29, LanguageData, MATCH(LanguageChosen, Language[Language],0), FALSE)","v":"Arts, entertainment and recreation"}]
["TOT","R93",null,null,null,null,1,null,null,"NACE DIVISION 93","Of which: Sports activities and amusement and recreation activities","NACE DIVISION 93",{"$f":"VLOOKUP(K30, LanguageData, MATCH(LanguageChosen, Language[Language],0), FALSE)","v":"Of which: Sports activities and amusement and recreation activities"}]
["TOT","U",null,null,null,null,1,null,null,"NACE SECTION U","Activities of extra-territorial organisations and bodies","NACE SECTION U",{"$f":"VLOOKUP(K31, LanguageData, MATCH(LanguageChosen, Language[Language],0), FALSE)","v":"Activities of extra-territorial organisations and bodies"}]
["TOT","DATAC",null,null,null,null,1,null,null,"DATA CENTRES","Data centres","DATA CENTRES",{"$f":"VLOOKUP(K32, LanguageData, MATCH(LanguageChosen, Language[Language],0), FALSE)","v":"Data centres"}]
[null,null,null,null,null,null,null,1]
[null,null,null,null,null,null,null,1,null,"Voluntary items",null,{"$f":"VLOOKUP(J34, LanguageData, MATCH(LanguageChosen, Language[Language],0), FALSE)","v":"Voluntary items"}]
["TOT","Formula_E","IF([Item1=E]<>0,[Item1=E],\"\")",null,null,null,1,null,1,"NACE SECTION E","Water supply; sewerage, waste management and remediation activities",{"$f":"J35","v":"NACE SECTION E"},{"$f":"VLOOKUP(K35, LanguageData, MATCH(LanguageChosen, Language[Language],0), FALSE)","v":"Water supply; sewerage, waste management and remediation activities"}]
["TOT","E36",null,null,null,null,{"$f":"IF($B$4=\"TOT\",1,\"\")","v":1},null,1,"NACE DIVISION 36","Water collection, treatment and supply","NACE DIVISION 36",{"$f":"VLOOKUP(K36, LanguageData, MATCH(LanguageChosen, Language[Language],0), FALSE)","v":"Water collection, treatment and supply"}]
["TOT","E37-E39",{"$f":"IF(B4=\"TOT\",\"\",\"IF(sum([Item1=E37],[Item1=E38],[Item1=E39])<>0,sum([Item1=E37],[Item1=E38],[Item1=E39]),\"\"\"\")\")","v":""},null,null,null,1,null,1,"NACE DIVISIONS 37, 38 & 39","Sewerage; Waste collection, treatment and disposal activities; materials recovery; Remediation activities and other waste management services","NACE DIVISIONS 37, 38 & 39",{"$f":"VLOOKUP(K37, LanguageData, MATCH(LanguageChosen, Language[Language],0), FALSE)","v":"Sewerage; Waste collection, treatment and disposal activities; materials recovery; Remediation activities and other waste management services"}]
["TOT","E37",null,null,null,null,1,null,1,"NACE DIVISION 37","Sewerage","NACE DIVISION 37",{"$f":"VLOOKUP(K38, LanguageData, MATCH(LanguageChosen, Language[Language],0), FALSE)","v":"Sewerage"}]
["TOT","E38",null,null,null,null,1,null,1,"NACE DIVISION 38","Waste collection, treatment and disposal activities; materials recovery","NACE DIVISION 38",{"$f":"VLOOKUP(K39, LanguageData, MATCH(LanguageChosen, Language[Language],0), FALSE)","v":"Waste collection, treatment and disposal activities; materials recovery"}]
["TOT","E39",null,null,null,null,1,null,1,"NACE DIVISION 39","Remediation activities and other waste management services","NACE DIVISION 39",{"$f":"VLOOKUP(K40, LanguageData, MATCH(LanguageChosen, Language[Language],0), FALSE)","v":"Remediation activities and other waste management services"}]
["TOT","Formula_G","IF([Item1=G]<>0,[Item1=G],\"\")",null,null,null,1,null,1,"NACE SECTION G: NACE DIVISIONS (45), 46 & 47","Wholesale and retail trade; repair of motor vehicles and motorcycles","NACE SECTION G: NACE DIVISIONS (45), 46 & 47",{"$f":"VLOOKUP(K41, LanguageData, MATCH(LanguageChosen, Language[Language],0), FALSE)","v":"Wholesale and retail trade; repair of motor vehicles and motorcycles"}]
["TOT","G_HEAT",null,null,null,null,1,null,1,null,"Heating",null,{"$f":"VLOOKUP(K42, LanguageData, MATCH(LanguageChosen, Language[Language],0), FALSE)","v":"Heating"}]
["TOT","G_S_HEAT",null,null,null,null,1,null,1,null,"of which: Space heating",null,{"$f":"VLOOKUP(K43, LanguageData, MATCH(LanguageChosen, Language[Language],0), FALSE)","v":"of which: Space heating"}]
["TOT","G_W_HEAT",null,null,null,null,1,null,1,null,"of which: Water heating",null,{"$f":"VLOOKUP(K44, LanguageData, MATCH(LanguageChosen, Language[Language],0), FALSE)","v":"of which: Water heating"}]
["TOT","G_COOL",null,null,null,null,1,null,1,null,"Cooling",null,{"$f":"VLOOKUP(K45, LanguageData, MATCH(LanguageChosen, Language[Language],0), FALSE)","v":"Cooling"}]
["TOT","G_S_COOL",null,null,null,null,1,null,1,null,"of which: Space cooling",null,{"$f":"VLOOKUP(K46, LanguageData, MATCH(LanguageChosen, Language[Language],0), FALSE)","v":"of which: Space cooling"}]
["TOT","G_P_COOL",null,null,null,null,1,null,1,null,"of which: Process cooling",null,{"$f":"VLOOKUP(K47, LanguageData, MATCH(LanguageChosen, Language[Language],0), FALSE)","v":"of which: Process cooling"}]
["TOT","G_LIGHT",null,null,null,null,1,null,1,null,"Outdoor lighting",null,{"$f":"VLOOKUP(K48, LanguageData, MATCH(LanguageChosen, Language[Language],0), FALSE)","v":"Outdoor lighting"}]
["TOT","G_IN_LIGHT",null,null,null,null,1,null,1,null,"Indoor lighting, appliances and ICTs",null,{"$f":"VLOOKUP(K49, LanguageData, MATCH(LanguageChosen, Language[Language],0), FALSE)","v":"Indoor lighting, appliances and ICTs"}]
["TOT","G_OTH_BUILD",null,null,null,null,1,null,1,null,"Other building activities",null,{"$f":"VLOOKUP(K50, LanguageData, MATCH(LanguageChosen, Language[Language],0), FALSE)","v":"Other building activities"}]
["TOT","G_OTH_NBUILD",null,null,null,null,1,null,1,null,"Other non-building activities",null,{"$f":"VLOOKUP(K51, LanguageData, MATCH(LanguageChosen, Language[Language],0), FALSE)","v":"Other non-building activities"}]
["TOT","G45",null,null,null,null,1,null,1,"NACE DIVISION 45","Wholesale and retail trade and repair of motor vehicles and motorcycles","NACE DIVISION 45",{"$f":"VLOOKUP(K52, LanguageData, MATCH(LanguageChosen, Language[Language],0), FALSE)","v":"Wholesale and retail trade and repair of motor vehicles and motorcycles"}]
["TOT","Formula_G47","IF([Item1=G47]<>0,[Item1=G47],\"\")",null,null,null,1,null,1,"NACE DIVISION 47","Retail trade, except of motor vehicles and motorcycles","NACE DIVISION 47",{"$f":"VLOOKUP(K53, LanguageData, MATCH(LanguageChosen, Language[Language],0), FALSE)","v":"Retail trade, except of motor vehicles and motorcycles"}]
["TOT","G471",null,null,null,null,1,null,1,"NACE GROUP 47.1","Retail sale in non-specialised stores","NACE GROUP 47.1",{"$f":"VLOOKUP(K54, LanguageData, MATCH(LanguageChosen, Language[Language],0), FALSE)","v":"Retail sale in non-specialised stores"}]
["TOT","G47_X_G471",null,null,null,null,1,null,1,"NACE DIVISION 47 NOT INCLUDING NACE GROUP 47.1","Retail sale in specialised stores and other retail trade","NACE DIVISION 47 NOT INCLUDING NACE GROUP 47.1",{"$f":"VLOOKUP(K55, LanguageData, MATCH(LanguageChosen, Language[Language],0), FALSE)","v":"Retail sale in specialised stores and other retail trade"}]
["TOT","Formula_H52","IF([Item1=H52]<>0,[Item1=H52],\"\")",null,null,null,1,null,1,"NACE DIVISION 52","Warehousing and support activities for transportation",{"$f":"J56","v":"NACE DIVISION 52"},{"$f":"VLOOKUP(K56, LanguageData, MATCH(LanguageChosen, Language[Language],0), FALSE)","v":"Warehousing and support activities for transportation"}]
["TOT","H52_STL",null,null,null,null,1,null,1,null,"Outdoor lighting (Street lighting)",null,{"$f":"VLOOKUP(K57, LanguageData, MATCH(LanguageChosen, Language[Language],0), FALSE)","v":"Outdoor lighting (Street lighting)"}]
["TOT","Formula_I55_1","IF([Item1=I55]<>0,[Item1=I55],\"\")",null,null,null,1,null,1,"NACE DIVISION 55","Accommodation",{"$f":"J58","v":"NACE DIVISION 55"},{"$f":"VLOOKUP(K58, LanguageData, MATCH(LanguageChosen, Language[Language],0), FALSE)","v":"Accommodation"}]
["TOT","I551",null,null,null,null,1,null,1,"NACE GROUP 55.1","Hotels and similar accommodation",{"$f":"J59","v":"NACE GROUP 55.1"},{"$f":"VLOOKUP(K59, LanguageData, MATCH(LanguageChosen, Language[Language],0), FALSE)","v":"Hotels and similar accommodation"}]
["TOT","I552",null,null,null,null,1,null,1,"NACE GROUP 55.2","Holiday and other short-stay accommodation","NACE GROUP 55.2",{"$f":"VLOOKUP(K60, LanguageData, MATCH(LanguageChosen, Language[Language],0), FALSE)","v":"Holiday and other short-stay accommodation"}]
["TOT","I553",null,null,null,null,1,null,1,"NACE GROUP 55.3","Camping grounds, recreational vehicle parks and trailer parks","NACE GROUP 55.3",{"$f":"VLOOKUP(K61, LanguageData, MATCH(LanguageChosen, Language[Language],0), FALSE)","v":"Camping grounds, recreational vehicle parks and trailer parks"}]
["TOT","I559",null,null,null,null,1,null,1,"NACE GROUP 55.9","Other accommodation","NACE GROUP 55.9",{"$f":"VLOOKUP(K62, LanguageData, MATCH(LanguageChosen, Language[Language],0), FALSE)","v":"Other accommodation"}]
["TOT","Formula_I55_2","IF([Item1=I55]<>0,[Item1=I55],\"\")",null,null,null,1,null,1,"NACE DIVISION 55","Accommodation","NACE DIVISION 55",{"$f":"VLOOKUP(K63, LanguageData, MATCH(LanguageChosen, Language[Language],0), FALSE)","v":"Accommodation"}]
["TOT","I55_HEAT",null,null,null,null,1,null,1,null,"Heating",null,{"$f":"VLOOKUP(K64, LanguageData, MATCH(LanguageChosen, Language[Language],0), FALSE)","v":"Heating"}]
["TOT","I55_S_HEAT",null,null,null,null,1,null,1,null,"of which: Space heating",null,{"$f":"VLOOKUP(K65, LanguageData, MATCH(LanguageChosen, Language[Language],0), FALSE)","v":"of which: Space heating"}]
["TOT","I55_W_HEAT",null,null,null,null,1,null,1,null,"of which: Water heating",null,{"$f":"VLOOKUP(K66, LanguageData, MATCH(LanguageChosen, Language[Language],0), FALSE)","v":"of which: Water heating"}]
["TOT","I55_COOL",null,null,null,null,1,null,1,null,"Cooling",null,{"$f":"VLOOKUP(K67, LanguageData, MATCH(LanguageChosen, Language[Language],0), FALSE)","v":"Cooling"}]
["TOT","I55_S_COOL",null,null,null,null,1,null,1,null,"of which: Space cooling",null,{"$f":"VLOOKUP(K68, LanguageData, MATCH(LanguageChosen, Language[Language],0), FALSE)","v":"of which: Space cooling"}]
["TOT","I55_P_COOL",null,null,null,null,1,null,1,null,"of which: Process cooling",null,{"$f":"VLOOKUP(K69, LanguageData, MATCH(LanguageChosen, Language[Language],0), FALSE)","v":"of which: Process cooling"}]
["TOT","I55_LIGHT",null,null,null,null,1,null,1,null,"Outdoor lighting",null,{"$f":"VLOOKUP(K70, LanguageData, MATCH(LanguageChosen, Language[Language],0), FALSE)","v":"Outdoor lighting"}]
["TOT","I55_IN_LIGHT",null,null,null,null,1,null,1,null,"Indoor lighting, appliances and ICTs",null,{"$f":"VLOOKUP(K71, LanguageData, MATCH(LanguageChosen, Language[Language],0), FALSE)","v":"Indoor lighting, appliances and ICTs"}]
["TOT","I55_OTH_BUILD",null,null,null,null,1,null,1,null,"Other building activities",null,{"$f":"VLOOKUP(K72, LanguageData, MATCH(LanguageChosen, Language[Language],0), FALSE)","v":"Other building activities"}]
["TOT","I55_OTH_NBUILD",null,null,null,null,1,null,1,null,"Other non-building activities",null,{"$f":"VLOOKUP(K73, LanguageData, MATCH(LanguageChosen, Language[Language],0), FALSE)","v":"Other non-building activities"}]
["TOT","Formula_I56_1","IF([Item1=I56]<>0,[Item1=I56],\"\")",null,null,null,1,null,1,"NACE DIVISION 56","Food and beverage service activities",{"$f":"J74","v":"NACE DIVISION 56"},{"$f":"VLOOKUP(K74, LanguageData, MATCH(LanguageChosen, Language[Language],0), FALSE)","v":"Food and beverage service activities"}]
["TOT","I561",null,null,null,null,1,null,1,"NACE GROUP 56.1","Restaurants and mobile food service activities",{"$f":"J75","v":"NACE GROUP 56.1"},{"$f":"VLOOKUP(K75, LanguageData, MATCH(LanguageChosen, Language[Language],0), FALSE)","v":"Restaurants and mobile food service activities"}]
[{"$f":"$B$4","v":"TOT"},"I562",null,null,null,null,1,null,1,"NACE GROUP 56.2","Event catering and other food service activities","NACE GROUP 56.2",{"$f":"VLOOKUP(K76, LanguageData, MATCH(LanguageChosen, Language[Language],0), FALSE)","v":"Event catering and other food service activities"}]
["TOT","I563",null,null,null,null,1,null,1,"NACE GROUP 56.3","Beverage serving activities","NACE GROUP 56.3",{"$f":"VLOOKUP(K77, LanguageData, MATCH(LanguageChosen, Language[Language],0), FALSE)","v":"Beverage serving activities"}]
["TOT","Formula_I56_2","IF([Item1=I56]<>0,[Item1=I56],\"\")",null,null,null,1,null,1,"NACE DIVISION 56","Food and beverage service activities","NACE DIVISION 56",{"$f":"VLOOKUP(K78, LanguageData, MATCH(LanguageChosen, Language[Language],0), FALSE)","v":"Food and beverage service activities"}]
["TOT","I56_HEAT",null,null,null,null,1,null,1,null,"Heating",null,{"$f":"VLOOKUP(K79, LanguageData, MATCH(LanguageChosen, Language[Language],0), FALSE)","v":"Heating"}]
["TOT","I56_S_HEAT",null,null,null,null,1,null,1,null,"of which: Space heating",null,{"$f":"VLOOKUP(K80, LanguageData, MATCH(LanguageChosen, Language[Language],0), FALSE)","v":"of which: Space heating"}]
["TOT","I56_W_HEAT",null,null,null,null,1,null,1,null,"of which: Water heating",null,{"$f":"VLOOKUP(K81, LanguageData, MATCH(LanguageChosen, Language[Language],0), FALSE)","v":"of which: Water heating"}]
["TOT","I56_COOL",null,null,null,null,1,null,1,null,"Cooling",null,{"$f":"VLOOKUP(K82, LanguageData, MATCH(LanguageChosen, Language[Language],0), FALSE)","v":"Cooling"}]
["TOT","I56_S_COOL",null,null,null,null,1,null,1,null,"of which: Space cooling",null,{"$f":"VLOOKUP(K83, LanguageData, MATCH(LanguageChosen, Language[Language],0), FALSE)","v":"of which: Space cooling"}]
["TOT","I56_P_COOL",null,null,null,null,1,null,1,null,"of which: Process cooling",null,{"$f":"VLOOKUP(K84, LanguageData, MATCH(LanguageChosen, Language[Language],0), FALSE)","v":"of which: Process cooling"}]
["TOT","I56_LIGHT",null,null,null,null,1,null,1,null,"Outdoor lighting",null,{"$f":"VLOOKUP(K85, LanguageData, MATCH(LanguageChosen, Language[Language],0), FALSE)","v":"Outdoor lighting"}]
["TOT","I56_IN_LIGHT",null,null,null,null,1,null,1,null,"Indoor lighting, appliances and ICTs",null,{"$f":"VLOOKUP(K86, LanguageData, MATCH(LanguageChosen, Language[Language],0), FALSE)","v":"Indoor lighting, appliances and ICTs"}]
["TOT","I56_OTH_BUILD",null,null,null,null,1,null,1,null,"Other building activities",null,{"$f":"VLOOKUP(K87, LanguageData, MATCH(LanguageChosen, Language[Language],0), FALSE)","v":"Other building activities"}]
["TOT","I56_OTH_NBUILD",null,null,null,null,1,null,1,null,"Other non-building activities",null,{"$f":"VLOOKUP(K88, LanguageData, MATCH(LanguageChosen, Language[Language],0), FALSE)","v":"Other non-building activities"}]
["TOT","Formula_J","IF([Item1=J]<>0,[Item1=J],\"\")",null,null,null,1,null,1,"NACE SECTION J","Information and communication",{"$f":"J89","v":"NACE SECTION J"},{"$f":"VLOOKUP(K89, LanguageData, MATCH(LanguageChosen, Language[Language],0), FALSE)","v":"Information and communication"}]
["TOT","J58",null,null,null,null,1,null,1,"NACE DIVISION 58","Publishing activities",{"$f":"J90","v":"NACE DIVISION 58"},{"$f":"VLOOKUP(K90, LanguageData, MATCH(LanguageChosen, Language[Language],0), FALSE)","v":"Publishing activities"}]
["TOT","J59_J60",null,null,null,null,1,null,1,"NACE DIVISIONS 59 & 60","Motion picture, video and television programme production, sound recording and music publishing activities; Programming and broadcasting activities","NACE DIVISIONS 59 & 60",{"$f":"VLOOKUP(K91, LanguageData, MATCH(LanguageChosen, Language[Language],0), FALSE)","v":"Motion picture, video and television programme production, sound recording and music publishing activities; Programming and broadcasting activities"}]
["TOT","J61",null,null,null,null,1,null,1,"NACE DIVISION 61","Telecommunications","NACE DIVISION 61",{"$f":"VLOOKUP(K92, LanguageData, MATCH(LanguageChosen, Language[Language],0), FALSE)","v":"Telecommunications"}]
["TOT","J62_J63",{"$f":"IF(B4=\"TOT\",\"\",\"IF(sum([Item1=J62],[Item1=J63])<>0,sum([Item1=J62],[Item1=J63]),\"\"\"\")\")","v":""},null,null,null,1,null,1,"NACE DIVISIONS 62 & 63","Computer programming, consultancy and related activities; Information service activities","NACE DIVISIONS 62 & 63",{"$f":"VLOOKUP(K93, LanguageData, MATCH(LanguageChosen, Language[Language],0), FALSE)","v":"Computer programming, consultancy and related activities; Information service activities"}]
["TOT","J62",null,null,null,null,1,null,1,"NACE DIVISION 62","Computer programming, consultancy and related activities","NACE DIVISION 62",{"$f":"VLOOKUP(K94, LanguageData, MATCH(LanguageChosen, Language[Language],0), FALSE)","v":"Computer programming, consultancy and related activities"}]
["TOT","J63",null,null,null,null,1,null,1,"NACE DIVISION 63","Information service activities","NACE DIVISION 63",{"$f":"VLOOKUP(K95, LanguageData, MATCH(LanguageChosen, Language[Language],0), FALSE)","v":"Information service activities"}]
["TOT","K",null,null,null,null,1,null,1,"NACE SECTION K","Financial and insurance activities",{"$f":"J96","v":"NACE SECTION K"},{"$f":"VLOOKUP(K96, LanguageData, MATCH(LanguageChosen, Language[Language],0), FALSE)","v":"Financial and insurance activities"}]
["TOT","L",null,null,null,null,1,null,1,"NACE SECTION L","Real estate activities","NACE SECTION L",{"$f":"VLOOKUP(K97, LanguageData, MATCH(LanguageChosen, Language[Language],0), FALSE)","v":"Real estate activities"}]
["TOT","M",{"$f":"IF(B4=\"TOT\",\"\",\"IF(sum([Item1=M69_M70], [Item1=M71], [Item1=M72], [Item1=M73], [Item1=M74_M75])<>0,sum([Item1=M69_M70], [Item1=M71], [Item1=M72], [Item1=M73], [Item1=M74_M75]),\"\"\"\")\")","v":""},{"$f":"IF($B$4=\"TOT\",\"\",\"< Sum([Item1=M69_M70], [Item1=M71], [Item1=M72], [Item1=M73], [Item1=M74_M75])\")","v":""},"Should be superior or equal to NACE DIVISION 69\nto NACE DIVISION 75",null,1,null,1,"NACE SECTION M","Professional, scientific and technical activities","NACE SECTION M",{"$f":"VLOOKUP(K98, LanguageData, MATCH(LanguageChosen, Language[Language],0), FALSE)","v":"Professional, scientific and technical activities"}]
["TOT","M69_M70",null,null,null,null,1,null,1,"NACE DIVISIONS 69 & 70","Legal and accounting activities; Activities of head offices, management consultancy activities","NACE DIVISIONS 69 & 70",{"$f":"VLOOKUP(K99, LanguageData, MATCH(LanguageChosen, Language[Language],0), FALSE)","v":"Legal and accounting activities; Activities of head offices, management consultancy activities"}]
["TOT","M71",null,null,null,null,{"$f":"IF($B$4=\"TOT\",1,\"\")","v":1},null,1,"NACE DIVISION 71","Architectural and engineering activities, technical testing and analysis","NACE DIVISION 71",{"$f":"VLOOKUP(K100, LanguageData, MATCH(LanguageChosen, Language[Language],0), FALSE)","v":"Architectural and engineering activities, technical testing and analysis"}]
["TOT","M72",null,null,null,null,1,null,1,"NACE DIVISION 72","Scientific research and development","NACE DIVISION 72",{"$f":"VLOOKUP(K101, LanguageData, MATCH(LanguageChosen, Language[Language],0), FALSE)","v":"Scientific research and development"}]
["TOT","M73",null,null,null,null,1,null,1,"NACE DIVISION 73","Advertising and market research","NACE DIVISION 73",{"$f":"VLOOKUP(K102, LanguageData, MATCH(LanguageChosen, Language[Language],0), FALSE)","v":"Advertising and market research"}]
["TOT","M74_M75",null,null,null,null,1,null,1,"NACE DIVISIONS 74 & 75","Veterinary activities; Other professional, scientific and technical activities","NACE DIVISIONS 74 & 75",{"$f":"VLOOKUP(K103, LanguageData, MATCH(LanguageChosen, Language[Language],0), FALSE)","v":"Veterinary activities; Other professional, scientific and technical activities"}]
["TOT","Formula_N","IF([Item1=N]<>0,[Item1=N],\"\")",null,null,null,1,null,1,"NACE SECTION N","Administrative and support service activities","NACE SECTION N",{"$f":"VLOOKUP(K104, LanguageData, MATCH(LanguageChosen, Language[Language],0), FALSE)","v":"Administrative and support service activities"}]
["TOT","N77",null,null,null,null,{"$f":"IF($B$4=\"TOT\",1,\"\")","v":1},null,1,"NACE DIVISION 77","Rental and leasing activities","NACE DIVISION 77",{"$f":"VLOOKUP(K105, LanguageData, MATCH(LanguageChosen, Language[Language],0), FALSE)","v":"Rental and leasing activities"}]
["TOT","N78",null,null,null,null,1,null,1,"NACE DIVISION 78","Employment activities","NACE DIVISION 78",{"$f":"VLOOKUP(K106, LanguageData, MATCH(LanguageChosen, Language[Language],0), FALSE)","v":"Employment activities"}]
["TOT","N79",null,null,null,null,1,null,1,"NACE DIVISION 79","Travel agency, tour operator and other reservation service and related activities","NACE DIVISION 79",{"$f":"VLOOKUP(K107, LanguageData, MATCH(LanguageChosen, Language[Language],0), FALSE)","v":"Travel agency, tour operator and other reservation service and related activities"}]
["TOT","N80-N82",null,null,null,null,1,null,1,"NACE DIVISIONS 80, 81 & 82","Security and investigation activities; Services to buildings and landscape activities; Office administrative, office support and other business support activities","NACE DIVISIONS 80, 81 & 82",{"$f":"VLOOKUP(K108, LanguageData, MATCH(LanguageChosen, Language[Language],0), FALSE)","v":"Security and investigation activities; Services to buildings and landscape activities; Office administrative, office support and other business support activities"}]
["TOT","Formula_O","IF([Item1=O]<>0,[Item1=O],\"\")",null,null,null,1,null,1,"NACE SECTION O","Public administrative and defence; compulsory social security","NACE SECTION O",{"$f":"VLOOKUP(K109, LanguageData, MATCH(LanguageChosen, Language[Language],0), FALSE)","v":"Public administrative and defence; compulsory social security"}]
["TOT","O_HEAT",null,null,null,null,{"$f":"IF($B$4=\"TOT\",1,\"\")","v":1},null,1,null,"Heating",null,{"$f":"VLOOKUP(K110, LanguageData, MATCH(LanguageChosen, Language[Language],0), FALSE)","v":"Heating"}]
["TOT","O_S_HEAT",null,null,null,null,1,null,1,null,"of which: Space heating",null,{"$f":"VLOOKUP(K111, LanguageData, MATCH(LanguageChosen, Language[Language],0), FALSE)","v":"of which: Space heating"}]
["TOT","O_W_HEAT",null,null,null,null,1,null,1,null,"of which: Water heating",null,{"$f":"VLOOKUP(K112, LanguageData, MATCH(LanguageChosen, Language[Language],0), FALSE)","v":"of which: Water heating"}]
["TOT","O_COOL",null,null,null,null,1,null,1,null,"Cooling",null,{"$f":"VLOOKUP(K113, LanguageData, MATCH(LanguageChosen, Language[Language],0), FALSE)","v":"Cooling"}]
["TOT","O_S_COOL",null,null,null,null,1,null,1,null,"of which: Space cooling",null,{"$f":"VLOOKUP(K114, LanguageData, MATCH(LanguageChosen, Language[Language],0), FALSE)","v":"of which: Space cooling"}]
["TOT","O_P_COOL",null,null,null,null,1,null,1,null,"of which: Process cooling",null,{"$f":"VLOOKUP(K115, LanguageData, MATCH(LanguageChosen, Language[Language],0), FALSE)","v":"of which: Process cooling"}]
["TOT","O_LIGHT",null,null,null,null,1,null,1,null,"Outdoor lighting",null,{"$f":"VLOOKUP(K116, LanguageData, MATCH(LanguageChosen, Language[Language],0), FALSE)","v":"Outdoor lighting"}]
["TOT","O_IN_LIGHT",null,null,null,null,1,null,1,null,"Indoor lighting, appliances and ICTs",null,{"$f":"VLOOKUP(K117, LanguageData, MATCH(LanguageChosen, Language[Language],0), FALSE)","v":"Indoor lighting, appliances and ICTs"}]
["TOT","O_OTH_BUILD",null,null,null,null,1,null,1,null,"Other building activities",null,{"$f":"VLOOKUP(K118, LanguageData, MATCH(LanguageChosen, Language[Language],0), FALSE)","v":"Other building activities"}]
["TOT","O_OTH_NBUILD",null,null,null,null,1,null,1,null,"Other non-building activities",null,{"$f":"VLOOKUP(K119, LanguageData, MATCH(LanguageChosen, Language[Language],0), FALSE)","v":"Other non-building activities"}]
["TOT","Formula_Q861","IF([Item1=Q861]<>0,[Item1=Q861],\"\")",null,null,null,1,null,1,"NACE GROUP 86.1","Hospital activities","NACE GROUP 86.1",{"$f":"VLOOKUP(K120, LanguageData, MATCH(LanguageChosen, Language[Language],0), FALSE)","v":"Hospital activities"}]
["TOT","Q861_HEAT",null,null,null,null,{"$f":"IF($B$4=\"TOT\",1,\"\")","v":1},null,1,null,"Heating",null,{"$f":"VLOOKUP(K121, LanguageData, MATCH(LanguageChosen, Language[Language],0), FALSE)","v":"Heating"}]
["TOT","Q861_S_HEAT",null,null,null,null,1,null,1,null,"of which: Space heating",null,{"$f":"VLOOKUP(K122, LanguageData, MATCH(LanguageChosen, Language[Language],0), FALSE)","v":"of which: Space heating"}]
["TOT","Q861_W_HEAT",null,null,null,null,1,null,1,null,"of which: Water heating",null,{"$f":"VLOOKUP(K123, LanguageData, MATCH(LanguageChosen, Language[Language],0), FALSE)","v":"of which: Water heating"}]
["TOT","Q861_COOL",null,null,null,null,1,null,1,null,"Cooling",null,{"$f":"VLOOKUP(K124, LanguageData, MATCH(LanguageChosen, Language[Language],0), FALSE)","v":"Cooling"}]
["TOT","Q861_S_COOL",null,null,null,null,1,null,1,null,"of which: Space cooling",null,{"$f":"VLOOKUP(K125, LanguageData, MATCH(LanguageChosen, Language[Language],0), FALSE)","v":"of which: Space cooling"}]
["TOT","Q861_P_COOL",null,null,null,null,1,null,1,null,"of which: Process cooling",null,{"$f":"VLOOKUP(K126, LanguageData, MATCH(LanguageChosen, Language[Language],0), FALSE)","v":"of which: Process cooling"}]
["TOT","Q861_LIGHT",null,null,null,null,1,null,1,null,"Outdoor lighting",null,{"$f":"VLOOKUP(K127, LanguageData, MATCH(LanguageChosen, Language[Language],0), FALSE)","v":"Outdoor lighting"}]
["TOT","Q861_IN_LIGHT",null,null,null,null,1,null,1,null,"Indoor lighting, appliances and ICTs",null,{"$f":"VLOOKUP(K128, LanguageData, MATCH(LanguageChosen, Language[Language],0), FALSE)","v":"Indoor lighting, appliances and ICTs"}]
["TOT","Q861_OTH_BUILD",null,null,null,null,1,null,1,null,"Other building activities",null,{"$f":"VLOOKUP(K129, LanguageData, MATCH(LanguageChosen, Language[Language],0), FALSE)","v":"Other building activities"}]
["TOT","Q861_OTH_NBUILD",null,null,null,null,1,null,1,null,"Other non-building activities",null,{"$f":"VLOOKUP(K130, LanguageData, MATCH(LanguageChosen, Language[Language],0), FALSE)","v":"Other non-building activities"}]
["TOT","Formula_R","IF([Item1=R]<>0,[Item1=R],\"\")",null,null,null,1,null,1,"NACE SECTION R","Arts, entertainment and recreation",{"$f":"J131","v":"NACE SECTION R"},{"$f":"VLOOKUP(K131, LanguageData, MATCH(LanguageChosen, Language[Language],0), FALSE)","v":"Arts, entertainment and recreation"}]
["TOT","R90-R92",{"$f":"IF(B4=\"TOT\",\"\",\"IF(Sum([Item1=R])-Sum([Item1=R93])<>0,Sum([Item1=R])-Sum([Item1=R93]),\"\"\"\")\")","v":""},null,null,null,1,null,1,"NACE DIVISIONS 90, 91 & 92","Creative, arts and entertainment activities; Libraries, archives, museums and other cultural activities; Gambling and betting activities",{"$f":"J132","v":"NACE DIVISIONS 90, 91 & 92"},{"$f":"VLOOKUP(K132, LanguageData, MATCH(LanguageChosen, Language[Language],0), FALSE)","v":"Creative, arts and entertainment activities; Libraries, archives, museums and other cultural activities; Gambling and betting activities"}]
["TOT","Formula_R93","IF([Item1=R93]<>0,[Item1=R93],\"\")",null,null,null,1,null,1,"NACE DIVISION 93","Sports activities and amusement and recreation activities","NACE DIVISION 93",{"$f":"VLOOKUP(K133, LanguageData, MATCH(LanguageChosen, Language[Language],0), FALSE)","v":"Sports activities and amusement and recreation activities"}]
["TOT","S",null,null,null,null,{"$f":"IF($B$4=\"TOT\",1,\"\")","v":1},null,1,"NACE SECTION S","Other service activities","NACE SECTION S",{"$f":"VLOOKUP(K134, LanguageData, MATCH(LanguageChosen, Language[Language],0), FALSE)","v":"Other service activities"}]
[null,null,null,null,null,null,null,1]
["TOT","TOTSER",{"$f":"IF(B4=\"TOT\",\"\",\"SumListBlank([Item1=C33],[Item1=E],[Item1=G],[Item1=H52],[Item1=H53],[Item1=I],[Item1=J],\"&\"[Item1=K_L],[Item1=M_S],[Item1=N],[Item1=O],[Item1=P],[Item1=Q],[Item1=R],[Item1=U])\")","v":""},null,null,null,1,null,null,null,"Services total",null,{"$f":"VLOOKUP(K136, LanguageData, MATCH(LanguageChosen, Language[Language],0), FALSE)","v":"Services total"}]
[{"$f":"$B$4 & \"_PRE\"","v":"TOT_PRE"},"TOTSER",null,null,null,"H",1,null,null,null,"Services prefilled from annuals",null,{"$f":"VLOOKUP(K137, LanguageData, MATCH(LanguageChosen, Language[Language],0), FALSE)","v":"Services prefilled from annuals"}]

{"sheet":"TemplateCalorific_values","index":26,"n_rows":12,"n_cols":16,"rows_kept":12,"cut":false,"hidden":true,"merged":[]}
[null,null,null,null,null,null,null,null,null,"Table 2: Final Energy Consumption in Services Sector by type of end use - Calorific values (MJ/t)",null,{"$f":"VLOOKUP(J1, LanguageData, MATCH(LanguageChosen,Language[Language],0), FALSE)","v":"Table 2: Final Energy Consumption in Services Sector by type of end use - Calorific values (MJ/t)"}]
["DataType","FINCONS",null,null,null,null,null,null,null,"Time",null,2020,2021,2022,2023,2024]
["Item1","CALOR",null,null,null,null,null,null,null,"FormulaRow"]
["Item2","KT",null,null,null,null,null,null,null,"LockedRow"]
[null,null,null,null,null,null,null,null,null,"EmptyRow"]
[null,null,null,null,null,null,null,null,null,"VoluntaryRow"]
[null,null,null,null,null,null,null,null,null,"NbDecimalRow",null,3,3,3,3,3]
["Product","FormulaCol","CheckCol1","LabelCheckCol1","CheckCol2","LabelCheckCol2","LockedCol","EmptyCol","VoluntaryCol","Label",{"$f":"CountryName","v":"Albania"},{"$f":"L2","v":2020},{"$f":"M2","v":2021},{"$f":"N2","v":2022},{"$f":"O2","v":2023},{"$f":"P2","v":2024}]
["TOTALOIL","IF(OR([Product=LPG]*[ext:Product=LPG#Item1=TOTSER]+[Product=GASDIES]*[ext:Product=GASDIES#Item1=TOTSER]=0,[ext:Product=TOTALOIL#Item1=TOTSER]=0),\n\"\",\n([Product=LPG]*[ext:Product=LPG#Item1=TOTSER]+[Product=GASDIES]*[ext:Product=GASDIES#Item1=TOTSER])/([ext:Product=LPG#Item1=TOTSER]+[ext:Product=GASDIES#Item1=TOTSER]))","^AND(OR([Item1=CALOR]< 40000,[Item1=CALOR]>49000),[Item1=CALOR]<>0)","Calorific value should be included between 40 000 and 49 000 MJ/t",null,null,null,null,null,"Oil and petroleum products",{"$f":"VLOOKUP(J9, LanguageData, MATCH(LanguageChosen, Language[Language],0), FALSE)","v":"Oil and Petroleum Products"}]
["LPG",null,"^AND(OR([Item1=CALOR]< 43000,[Item1=CALOR]>49000),[Item1=CALOR]<>0)","Calorific value should be included between 43 000 and 49 000 MJ/t",null,null,null,null,null,"LPG",{"$f":"VLOOKUP(J10, LanguageData, MATCH(LanguageChosen, Language[Language],0), FALSE)","v":"LPG"}]
["GASDIES",null,"^AND(OR([Item1=CALOR]< 40000,[Item1=CALOR]>45000),[Item1=CALOR]<>0)","Calorific value should be included between 40 000 and 45 000 MJ/t",null,null,null,null,null,"Gas/Diesel oil",{"$f":"VLOOKUP(J11, LanguageData, MATCH(LanguageChosen, Language[Language],0), FALSE)","v":"Gas/Diesel oil"}]
["COAL",null,"^AND(OR([Item1=CALOR]<14000,[Item1=CALOR]>30000),[Item1=CALOR]<>0)","Calorific value should be included between 14 000 and 30 000 MJ/t",null,null,null,null,null,"Solid fossil fuels",{"$f":"VLOOKUP(J12, LanguageData, MATCH(LanguageChosen, Language[Language],0), FALSE)","v":"Solid Fossil Fuels"}]

{"sheet":"TemplateRemarksTS","index":27,"n_rows":35,"n_cols":9,"rows_kept":35,"cut":false,"hidden":true,"merged":[]}
["Mode","Remarks"]
["DataType",null,null,null,{"$f":"VLOOKUP(B1, LanguageData, MATCH(LanguageChosen, Language[Language],0), FALSE)","v":"Remarks"}]
["Product"]
[]
["Item2",null,"TypeRow",null,"txt","txt","txt","txt","txt"]
[null,null,"Time",{"$f":"CountryName","v":"Albania"},2020,2021,2022,2023,2024]
["Item1",null,"Label"]
["REMROW01",null,"Remarks 1"]
["REMROW02",null,"Remarks 2"]
["REMROW03",null,"Remarks 3"]
["REMROW04",null,"Remarks 4"]
["REMROW05",null,"Remarks 5"]
["REMROW06",null,"Remarks 6"]
["REMROW07",null,"Remarks 7"]
["REMROW08",null,"Remarks 8"]
["REMROW09",null,"Remarks 9"]
["REMROW10",null,"Remarks 10"]
["REMROW11",null,"Remarks 11"]
["REMROW12",null,"Remarks 12"]
["REMROW13",null,"Remarks 13"]
["REMROW14",null,"Remarks 14"]
["REMROW15",null,"Remarks 15"]
["REMROW16",null,"Remarks 16"]
["REMROW17",null,"Remarks 17"]
["REMROW18",null,"Remarks 18"]
["REMROW19",null,"Remarks 19"]
["REMROW20",null,"Remarks 20"]
["REMROW21",null,"Remarks 21"]
["REMROW22",null,"Remarks 22"]
["REMROW23",null,"Remarks 23"]
["REMROW24",null,"Remarks 24"]
["REMROW25",null,"Remarks 25"]
["REMROW26",null,"Remarks 26"]
["REMROW27",null,"Remarks 27"]
["REMROW28",null,"Remarks 28"]

{"sheet":"CheckReport","index":28,"n_rows":1,"n_cols":14,"rows_kept":1,"cut":false,"hidden":true,"merged":[]}
["COUNTRY","QUEST","DATATYPE","PRODUCT","ITEM1","ITEM2","TIME","VALIDATION","VALUE","EXPECTED","RULE","CELL","TABLE","ERRORTYPE"]

{"sheet":"TemplateGraph","index":29,"n_rows":927,"n_cols":22,"rows_kept":927,"cut":false,"hidden":true,"merged":[]}
["Mode",null,null,null,null,null,null,"Final Energy Consumption in the Services Sector",null,null,null,null,null,null,{"$f":"CountryName & \" - \" & VLOOKUP(H1, LanguageData, MATCH(LanguageChosen,Language[Language]),FALSE)","v":"Albania - Final Energy Consumption in the Services Sector"}]
["DataType","FINCONS",null,null,null,null,null,{"$f":"B3","v":"C33"},null,{"$f":"CountryName","v":"Albania"}]
["Item1","C33"]
[null,null,null,null,null,null,null,"LockedRow",null,null,null,1]
[null,null,null,null,null,null,null,"EmptyRow"]
[null,null,null,null,null,null,null,"VoluntaryRow"]
["Product","Item2","FormulaCol","Item1","LockedCol","EmptyCol","VoluntaryCol","Label","Flow","Product","Time","Value"]
["ELECTR","GWH",null,"C33",null,null,null,"Electricity",{"$f":"VLOOKUP(D8, Param_Multilanguage!A:C, MATCH(LanguageChosen,Language[Language],0)+1, FALSE)","v":"Repair and installation of machinery and equipment"},{"$f":"VLOOKUP(H8,LanguageData,MATCH(LanguageChosen,Language[Language],0),FALSE) & \" - \" & B8","v":"Electricity - GWH"},2020]
["NATGAS","TJ_GCV",null,"C33",null,null,null,"Natural Gas",{"$f":"VLOOKUP(D9, Param_Multilanguage!A:C, MATCH(LanguageChosen,Language[Language],0)+1, FALSE)","v":"Repair and installation of machinery and equipment"},{"$f":"VLOOKUP(H9,LanguageData,MATCH(LanguageChosen,Language[Language],0),FALSE) & \" - \" & B9","v":"Natural Gas - TJ_GCV"},2020]
["HEAT","TJ_NCV",null,"C33",null,null,null,"Derived Heat",{"$f":"VLOOKUP(D10, Param_Multilanguage!A:C, MATCH(LanguageChosen,Language[Language],0)+1, FALSE)","v":"Repair and installation of machinery and equipment"},{"$f":"VLOOKUP(H10,LanguageData,MATCH(LanguageChosen,Language[Language],0),FALSE) & \" - \" & B10","v":"Derived Heat - TJ_NCV"},2020]
["TOTALOIL","KT",null,"C33",null,null,null,"Oil and Petroleum Products",{"$f":"VLOOKUP(D11, Param_Multilanguage!A:C, MATCH(LanguageChosen,Language[Language],0)+1, FALSE)","v":"Repair and installation of machinery and equipment"},{"$f":"VLOOKUP(H11,LanguageData,MATCH(LanguageChosen,Language[Language],0),FALSE) & \" - \" & B11","v":"Oil and Petroleum Products - KT"},2020]
["REN","TJ_NCV",null,"C33",null,null,null,"Renewable Energies",{"$f":"VLOOKUP(D12, Param_Multilanguage!A:C, MATCH(LanguageChosen,Language[Language],0)+1, FALSE)","v":"Repair and installation of machinery and equipment"},{"$f":"VLOOKUP(H12,LanguageData,MATCH(LanguageChosen,Language[Language],0),FALSE) & \" - \" & B12","v":"Renewable Energies - TJ_NCV"},2020]
["COAL","KT",null,"C33",null,null,null,"Solid Fossil Fuels",{"$f":"VLOOKUP(D13, Param_Multilanguage!A:C, MATCH(LanguageChosen,Language[Language],0)+1, FALSE)","v":"Repair and installation of machinery and equipment"},{"$f":"VLOOKUP(H13,LanguageData,MATCH(LanguageChosen,Language[Language],0),FALSE) & \" - \" & B13","v":"Solid Fossil Fuels - KT"},2020]
["NONREN","TJ_NCV",null,"C33",null,null,null,"Non Renewable Waste",{"$f":"VLOOKUP(D14, Param_Multilanguage!A:C, MATCH(LanguageChosen,Language[Language],0)+1, FALSE)","v":"Repair and installation of machinery and equipment"},{"$f":"VLOOKUP(H14,LanguageData,MATCH(LanguageChosen,Language[Language],0),FALSE) & \" - \" & B14","v":"Non Renewable Waste - TJ_NCV"},2020]
["HYDROGEN","TJ_NCV",null,"C33",null,null,null,"Hydrogen",{"$f":"VLOOKUP(D15, Param_Multilanguage!A:C, MATCH(LanguageChosen,Language[Language],0)+1, FALSE)","v":"Repair and installation of machinery and equipment"},{"$f":"VLOOKUP(H15,LanguageData,MATCH(LanguageChosen,Language[Language],0),FALSE) & \" - \" & B15","v":"Hydrogen - TJ_NCV"},2020]
["ELECTR","GWH",null,"E",null,null,null,"Electricity",{"$f":"VLOOKUP(D16, Param_Multilanguage!A:C, MATCH(LanguageChosen,Language[Language],0)+1, FALSE)","v":"Water supply; sewerage, waste management and remediation activities"},{"$f":"VLOOKUP(H16,LanguageData,MATCH(LanguageChosen,Language[Language],0),FALSE) & \" - \" & B16","v":"Electricity - GWH"},2020]
["NATGAS","TJ_GCV",null,"E",null,null,null,"Natural Gas",{"$f":"VLOOKUP(D17, Param_Multilanguage!A:C, MATCH(LanguageChosen,Language[Language],0)+1, FALSE)","v":"Water supply; sewerage, waste management and remediation activities"},{"$f":"VLOOKUP(H17,LanguageData,MATCH(LanguageChosen,Language[Language],0),FALSE) & \" - \" & B17","v":"Natural Gas - TJ_GCV"},2020]
["HEAT","TJ_NCV",null,"E",null,null,null,"Derived Heat",{"$f":"VLOOKUP(D18, Param_Multilanguage!A:C, MATCH(LanguageChosen,Language[Language],0)+1, FALSE)","v":"Water supply; sewerage, waste management and remediation activities"},{"$f":"VLOOKUP(H18,LanguageData,MATCH(LanguageChosen,Language[Language],0),FALSE) & \" - \" & B18","v":"Derived Heat - TJ_NCV"},2020]
["TOTALOIL","KT",null,"E",null,null,null,"Oil and Petroleum Products",{"$f":"VLOOKUP(D19, Param_Multilanguage!A:C, MATCH(LanguageChosen,Language[Language],0)+1, FALSE)","v":"Water supply; sewerage, waste management and remediation activities"},{"$f":"VLOOKUP(H19,LanguageData,MATCH(LanguageChosen,Language[Language],0),FALSE) & \" - \" & B19","v":"Oil and Petroleum Products - KT"},2020]
["REN","TJ_NCV",null,"E",null,null,null,"Renewable Energies",{"$f":"VLOOKUP(D20, Param_Multilanguage!A:C, MATCH(LanguageChosen,Language[Language],0)+1, FALSE)","v":"Water supply; sewerage, waste management and remediation activities"},{"$f":"VLOOKUP(H20,LanguageData,MATCH(LanguageChosen,Language[Language],0),FALSE) & \" - \" & B20","v":"Renewable Energies - TJ_NCV"},2020]
["COAL","KT",null,"E",null,null,null,"Solid Fossil Fuels",{"$f":"VLOOKUP(D21, Param_Multilanguage!A:C, MATCH(LanguageChosen,Language[Language],0)+1, FALSE)","v":"Water supply; sewerage, waste management and remediation activities"},{"$f":"VLOOKUP(H21,LanguageData,MATCH(LanguageChosen,Language[Language],0),FALSE) & \" - \" & B21","v":"Solid Fossil Fuels - KT"},2020]
["NONREN","TJ_NCV",null,"E",null,null,null,"Non Renewable Waste",{"$f":"VLOOKUP(D22, Param_Multilanguage!A:C, MATCH(LanguageChosen,Language[Language],0)+1, FALSE)","v":"Water supply; sewerage, waste management and remediation activities"},{"$f":"VLOOKUP(H22,LanguageData,MATCH(LanguageChosen,Language[Language],0),FALSE) & \" - \" & B22","v":"Non Renewable Waste - TJ_NCV"},2020]
["HYDROGEN","TJ_NCV",null,"E",null,null,null,"Hydrogen",{"$f":"VLOOKUP(D23, Param_Multilanguage!A:C, MATCH(LanguageChosen,Language[Language],0)+1, FALSE)","v":"Water supply; sewerage, waste management and remediation activities"},{"$f":"VLOOKUP(H23,LanguageData,MATCH(LanguageChosen,Language[Language],0),FALSE) & \" - \" & B23","v":"Hydrogen - TJ_NCV"},2020]
["ELECTR","GWH",null,"G",null,null,null,"Electricity",{"$f":"VLOOKUP(D24, Param_Multilanguage!A:C, MATCH(LanguageChosen,Language[Language],0)+1, FALSE)","v":"Wholesale and retail trade; repair of motor vehicles and motorcycles"},{"$f":"VLOOKUP(H24,LanguageData,MATCH(LanguageChosen,Language[Language],0),FALSE) & \" - \" & B24","v":"Electricity - GWH"},2020]
["NATGAS","TJ_GCV",null,"G",null,null,null,"Natural Gas",{"$f":"VLOOKUP(D25, Param_Multilanguage!A:C, MATCH(LanguageChosen,Language[Language],0)+1, FALSE)","v":"Wholesale and retail trade; repair of motor vehicles and motorcycles"},{"$f":"VLOOKUP(H25,LanguageData,MATCH(LanguageChosen,Language[Language],0),FALSE) & \" - \" & B25","v":"Natural Gas - TJ_GCV"},2020]
["HEAT","TJ_NCV",null,"G",null,null,null,"Derived Heat",{"$f":"VLOOKUP(D26, Param_Multilanguage!A:C, MATCH(LanguageChosen,Language[Language],0)+1, FALSE)","v":"Wholesale and retail trade; repair of motor vehicles and motorcycles"},{"$f":"VLOOKUP(H26,LanguageData,MATCH(LanguageChosen,Language[Language],0),FALSE) & \" - \" & B26","v":"Derived Heat - TJ_NCV"},2020]
["TOTALOIL","KT",null,"G",null,null,null,"Oil and Petroleum Products",{"$f":"VLOOKUP(D27, Param_Multilanguage!A:C, MATCH(LanguageChosen,Language[Language],0)+1, FALSE)","v":"Wholesale and retail trade; repair of motor vehicles and motorcycles"},{"$f":"VLOOKUP(H27,LanguageData,MATCH(LanguageChosen,Language[Language],0),FALSE) & \" - \" & B27","v":"Oil and Petroleum Products - KT"},2020]
["REN","TJ_NCV",null,"G",null,null,null,"Renewable Energies",{"$f":"VLOOKUP(D28, Param_Multilanguage!A:C, MATCH(LanguageChosen,Language[Language],0)+1, FALSE)","v":"Wholesale and retail trade; repair of motor vehicles and motorcycles"},{"$f":"VLOOKUP(H28,LanguageData,MATCH(LanguageChosen,Language[Language],0),FALSE) & \" - \" & B28","v":"Renewable Energies - TJ_NCV"},2020]
["COAL","KT",null,"G",null,null,null,"Solid Fossil Fuels",{"$f":"VLOOKUP(D29, Param_Multilanguage!A:C, MATCH(LanguageChosen,Language[Language],0)+1, FALSE)","v":"Wholesale and retail trade; repair of motor vehicles and motorcycles"},{"$f":"VLOOKUP(H29,LanguageData,MATCH(LanguageChosen,Language[Language],0),FALSE) & \" - \" & B29","v":"Solid Fossil Fuels - KT"},2020]
["NONREN","TJ_NCV",null,"G",null,null,null,"Non Renewable Waste",{"$f":"VLOOKUP(D30, Param_Multilanguage!A:C, MATCH(LanguageChosen,Language[Language],0)+1, FALSE)","v":"Wholesale and retail trade; repair of motor vehicles and motorcycles"},{"$f":"VLOOKUP(H30,LanguageData,MATCH(LanguageChosen,Language[Language],0),FALSE) & \" - \" & B30","v":"Non Renewable Waste - TJ_NCV"},2020]
["HYDROGEN","TJ_NCV",null,"G",null,null,null,"Hydrogen",{"$f":"VLOOKUP(D31, Param_Multilanguage!A:C, MATCH(LanguageChosen,Language[Language],0)+1, FALSE)","v":"Wholesale and retail trade; repair of motor vehicles and motorcycles"},{"$f":"VLOOKUP(H31,LanguageData,MATCH(LanguageChosen,Language[Language],0),FALSE) & \" - \" & B31","v":"Hydrogen - TJ_NCV"},2020]
["ELECTR","GWH",null,"G46",null,null,null,"Electricity",{"$f":"VLOOKUP(D32, Param_Multilanguage!A:C, MATCH(LanguageChosen,Language[Language],0)+1, FALSE)","v":"Wholesale trade, except of motor vehicles and motorcycles"},{"$f":"VLOOKUP(H32,LanguageData,MATCH(LanguageChosen,Language[Language],0),FALSE) & \" - \" & B32","v":"Electricity - GWH"},2020]
["NATGAS","TJ_GCV",null,"G46",null,null,null,"Natural Gas",{"$f":"VLOOKUP(D33, Param_Multilanguage!A:C, MATCH(LanguageChosen,Language[Language],0)+1, FALSE)","v":"Wholesale trade, except of motor vehicles and motorcycles"},{"$f":"VLOOKUP(H33,LanguageData,MATCH(LanguageChosen,Language[Language],0),FALSE) & \" - \" & B33","v":"Natural Gas - TJ_GCV"},2020]
["HEAT","TJ_NCV",null,"G46",null,null,null,"Derived Heat",{"$f":"VLOOKUP(D34, Param_Multilanguage!A:C, MATCH(LanguageChosen,Language[Language],0)+1, FALSE)","v":"Wholesale trade, except of motor vehicles and motorcycles"},{"$f":"VLOOKUP(H34,LanguageData,MATCH(LanguageChosen,Language[Language],0),FALSE) & \" - \" & B34","v":"Derived Heat - TJ_NCV"},2020]
["TOTALOIL","KT",null,"G46",null,null,null,"Oil and Petroleum Products",{"$f":"VLOOKUP(D35, Param_Multilanguage!A:C, MATCH(LanguageChosen,Language[Language],0)+1, FALSE)","v":"Wholesale trade, except of motor vehicles and motorcycles"},{"$f":"VLOOKUP(H35,LanguageData,MATCH(LanguageChosen,Language[Language],0),FALSE) & \" - \" & B35","v":"Oil and Petroleum Products - KT"},2020]
["REN","TJ_NCV",null,"G46",null,null,null,"Renewable Energies",{"$f":"VLOOKUP(D36, Param_Multilanguage!A:C, MATCH(LanguageChosen,Language[Language],0)+1, FALSE)","v":"Wholesale trade, except of motor vehicles and motorcycles"},{"$f":"VLOOKUP(H36,LanguageData,MATCH(LanguageChosen,Language[Language],0),FALSE) & \" - \" & B36","v":"Renewable Energies - TJ_NCV"},2020]
["COAL","KT",null,"G46",null,null,null,"Solid Fossil Fuels",{"$f":"VLOOKUP(D37, Param_Multilanguage!A:C, MATCH(LanguageChosen,Language[Language],0)+1, FALSE)","v":"Wholesale trade, except of motor vehicles and motorcycles"},{"$f":"VLOOKUP(H37,LanguageData,MATCH(LanguageChosen,Language[Language],0),FALSE) & \" - \" & B37","v":"Solid Fossil Fuels - KT"},2020]
["NONREN","TJ_NCV",null,"G46",null,null,null,"Non Renewable Waste",{"$f":"VLOOKUP(D38, Param_Multilanguage!A:C, MATCH(LanguageChosen,Language[Language],0)+1, FALSE)","v":"Wholesale trade, except of motor vehicles and motorcycles"},{"$f":"VLOOKUP(H38,LanguageData,MATCH(LanguageChosen,Language[Language],0),FALSE) & \" - \" & B38","v":"Non Renewable Waste - TJ_NCV"},2020]
["HYDROGEN","TJ_NCV",null,"G46",null,null,null,"Hydrogen",{"$f":"VLOOKUP(D39, Param_Multilanguage!A:C, MATCH(LanguageChosen,Language[Language],0)+1, FALSE)","v":"Wholesale trade, except of motor vehicles and motorcycles"},{"$f":"VLOOKUP(H39,LanguageData,MATCH(LanguageChosen,Language[Language],0),FALSE) & \" - \" & B39","v":"Hydrogen - TJ_NCV"},2020]
["ELECTR","GWH",null,"G47",null,null,null,"Electricity",{"$f":"VLOOKUP(D40, Param_Multilanguage!A:C, MATCH(LanguageChosen,Language[Language],0)+1, FALSE)","v":"Retail trade, except of motor vehicles and motorcycles"},{"$f":"VLOOKUP(H40,LanguageData,MATCH(LanguageChosen,Language[Language],0),FALSE) & \" - \" & B40","v":"Electricity - GWH"},2020]
["NATGAS","TJ_GCV",null,"G47",null,null,null,"Natural Gas",{"$f":"VLOOKUP(D41, Param_Multilanguage!A:C, MATCH(LanguageChosen,Language[Language],0)+1, FALSE)","v":"Retail trade, except of motor vehicles and motorcycles"},{"$f":"VLOOKUP(H41,LanguageData,MATCH(LanguageChosen,Language[Language],0),FALSE) & \" - \" & B41","v":"Natural Gas - TJ_GCV"},2020]
["HEAT","TJ_NCV",null,"G47",null,null,null,"Derived Heat",{"$f":"VLOOKUP(D42, Param_Multilanguage!A:C, MATCH(LanguageChosen,Language[Language],0)+1, FALSE)","v":"Retail trade, except of motor vehicles and motorcycles"},{"$f":"VLOOKUP(H42,LanguageData,MATCH(LanguageChosen,Language[Language],0),FALSE) & \" - \" & B42","v":"Derived Heat - TJ_NCV"},2020]
["TOTALOIL","KT",null,"G47",null,null,null,"Oil and Petroleum Products",{"$f":"VLOOKUP(D43, Param_Multilanguage!A:C, MATCH(LanguageChosen,Language[Language],0)+1, FALSE)","v":"Retail trade, except of motor vehicles and motorcycles"},{"$f":"VLOOKUP(H43,LanguageData,MATCH(LanguageChosen,Language[Language],0),FALSE) & \" - \" & B43","v":"Oil and Petroleum Products - KT"},2020]
["REN","TJ_NCV",null,"G47",null,null,null,"Renewable Energies",{"$f":"VLOOKUP(D44, Param_Multilanguage!A:C, MATCH(LanguageChosen,Language[Language],0)+1, FALSE)","v":"Retail trade, except of motor vehicles and motorcycles"},{"$f":"VLOOKUP(H44,LanguageData,MATCH(LanguageChosen,Language[Language],0),FALSE) & \" - \" & B44","v":"Renewable Energies - TJ_NCV"},2020]
["COAL","KT",null,"G47",null,null,null,"Solid Fossil Fuels",{"$f":"VLOOKUP(D45, Param_Multilanguage!A:C, MATCH(LanguageChosen,Language[Language],0)+1, FALSE)","v":"Retail trade, except of motor vehicles and motorcycles"},{"$f":"VLOOKUP(H45,LanguageData,MATCH(LanguageChosen,Language[Language],0),FALSE) & \" - \" & B45","v":"Solid Fossil Fuels - KT"},2020]
["NONREN","TJ_NCV",null,"G47",null,null,null,"Non Renewable Waste",{"$f":"VLOOKUP(D46, Param_Multilanguage!A:C, MATCH(LanguageChosen,Language[Language],0)+1, FALSE)","v":"Retail trade, except of motor vehicles and motorcycles"},{"$f":"VLOOKUP(H46,LanguageData,MATCH(LanguageChosen,Language[Language],0),FALSE) & \" - \" & B46","v":"Non Renewable Waste - TJ_NCV"},2020]
["HYDROGEN","TJ_NCV",null,"G47",null,null,null,"Hydrogen",{"$f":"VLOOKUP(D47, Param_Multilanguage!A:C, MATCH(LanguageChosen,Language[Language],0)+1, FALSE)","v":"Retail trade, except of motor vehicles and motorcycles"},{"$f":"VLOOKUP(H47,LanguageData,MATCH(LanguageChosen,Language[Language],0),FALSE) & \" - \" & B47","v":"Hydrogen - TJ_NCV"},2020]
["ELECTR","GWH",null,"H52",null,null,null,"Electricity",{"$f":"VLOOKUP(D48, Param_Multilanguage!A:C, MATCH(LanguageChosen,Language[Language],0)+1, FALSE)","v":"Warehousing and support activities for transportation"},{"$f":"VLOOKUP(H48,LanguageData,MATCH(LanguageChosen,Language[Language],0),FALSE) & \" - \" & B48","v":"Electricity - GWH"},2020]
["NATGAS","TJ_GCV",null,"H52",null,null,null,"Natural Gas",{"$f":"VLOOKUP(D49, Param_Multilanguage!A:C, MATCH(LanguageChosen,Language[Language],0)+1, FALSE)","v":"Warehousing and support activities for transportation"},{"$f":"VLOOKUP(H49,LanguageData,MATCH(LanguageChosen,Language[Language],0),FALSE) & \" - \" & B49","v":"Natural Gas - TJ_GCV"},2020]
["HEAT","TJ_NCV",null,"H52",null,null,null,"Derived Heat",{"$f":"VLOOKUP(D50, Param_Multilanguage!A:C, MATCH(LanguageChosen,Language[Language],0)+1, FALSE)","v":"Warehousing and support activities for transportation"},{"$f":"VLOOKUP(H50,LanguageData,MATCH(LanguageChosen,Language[Language],0),FALSE) & \" - \" & B50","v":"Derived Heat - TJ_NCV"},2020]
["TOTALOIL","KT",null,"H52",null,null,null,"Oil and Petroleum Products",{"$f":"VLOOKUP(D51, Param_Multilanguage!A:C, MATCH(LanguageChosen,Language[Language],0)+1, FALSE)","v":"Warehousing and support activities for transportation"},{"$f":"VLOOKUP(H51,LanguageData,MATCH(LanguageChosen,Language[Language],0),FALSE) & \" - \" & B51","v":"Oil and Petroleum Products - KT"},2020]
["REN","TJ_NCV",null,"H52",null,null,null,"Renewable Energies",{"$f":"VLOOKUP(D52, Param_Multilanguage!A:C, MATCH(LanguageChosen,Language[Language],0)+1, FALSE)","v":"Warehousing and support activities for transportation"},{"$f":"VLOOKUP(H52,LanguageData,MATCH(LanguageChosen,Language[Language],0),FALSE) & \" - \" & B52","v":"Renewable Energies - TJ_NCV"},2020]
["COAL","KT",null,"H52",null,null,null,"Solid Fossil Fuels",{"$f":"VLOOKUP(D53, Param_Multilanguage!A:C, MATCH(LanguageChosen,Language[Language],0)+1, FALSE)","v":"Warehousing and support activities for transportation"},{"$f":"VLOOKUP(H53,LanguageData,MATCH(LanguageChosen,Language[Language],0),FALSE) & \" - \" & B53","v":"Solid Fossil Fuels - KT"},2020]
["NONREN","TJ_NCV",null,"H52",null,null,null,"Non Renewable Waste",{"$f":"VLOOKUP(D54, Param_Multilanguage!A:C, MATCH(LanguageChosen,Language[Language],0)+1, FALSE)","v":"Warehousing and support activities for transportation"},{"$f":"VLOOKUP(H54,LanguageData,MATCH(LanguageChosen,Language[Language],0),FALSE) & \" - \" & B54","v":"Non Renewable Waste - TJ_NCV"},2020]
["HYDROGEN","TJ_NCV",null,"H52",null,null,null,"Hydrogen",{"$f":"VLOOKUP(D55, Param_Multilanguage!A:C, MATCH(LanguageChosen,Language[Language],0)+1, FALSE)","v":"Warehousing and support activities for transportation"},{"$f":"VLOOKUP(H55,LanguageData,MATCH(LanguageChosen,Language[Language],0),FALSE) & \" - \" & B55","v":"Hydrogen - TJ_NCV"},2020]
["ELECTR","GWH",null,"H53",null,null,null,"Electricity",{"$f":"VLOOKUP(D56, Param_Multilanguage!A:C, MATCH(LanguageChosen,Language[Language],0)+1, FALSE)","v":"Postal and courier activities"},{"$f":"VLOOKUP(H56,LanguageData,MATCH(LanguageChosen,Language[Language],0),FALSE) & \" - \" & B56","v":"Electricity - GWH"},2020]
["NATGAS","TJ_GCV",null,"H53",null,null,null,"Natural Gas",{"$f":"VLOOKUP(D57, Param_Multilanguage!A:C, MATCH(LanguageChosen,Language[Language],0)+1, FALSE)","v":"Postal and courier activities"},{"$f":"VLOOKUP(H57,LanguageData,MATCH(LanguageChosen,Language[Language],0),FALSE) & \" - \" & B57","v":"Natural Gas - TJ_GCV"},2020]
["HEAT","TJ_NCV",null,"H53",null,null,null,"Derived Heat",{"$f":"VLOOKUP(D58, Param_Multilanguage!A:C, MATCH(LanguageChosen,Language[Language],0)+1, FALSE)","v":"Postal and courier activities"},{"$f":"VLOOKUP(H58,LanguageData,MATCH(LanguageChosen,Language[Language],0),FALSE) & \" - \" & B58","v":"Derived Heat - TJ_NCV"},2020]
["TOTALOIL","KT",null,"H53",null,null,null,"Oil and Petroleum Products",{"$f":"VLOOKUP(D59, Param_Multilanguage!A:C, MATCH(LanguageChosen,Language[Language],0)+1, FALSE)","v":"Postal and courier activities"},{"$f":"VLOOKUP(H59,LanguageData,MATCH(LanguageChosen,Language[Language],0),FALSE) & \" - \" & B59","v":"Oil and Petroleum Products - KT"},2020]
["REN","TJ_NCV",null,"H53",null,null,null,"Renewable Energies",{"$f":"VLOOKUP(D60, Param_Multilanguage!A:C, MATCH(LanguageChosen,Language[Language],0)+1, FALSE)","v":"Postal and courier activities"},{"$f":"VLOOKUP(H60,LanguageData,MATCH(LanguageChosen,Language[Language],0),FALSE) & \" - \" & B60","v":"Renewable Energies - TJ_NCV"},2020]
["COAL","KT",null,"H53",null,null,null,"Solid Fossil Fuels",{"$f":"VLOOKUP(D61, Param_Multilanguage!A:C, MATCH(LanguageChosen,Language[Language],0)+1, FALSE)","v":"Postal and courier activities"},{"$f":"VLOOKUP(H61,LanguageData,MATCH(LanguageChosen,Language[Language],0),FALSE) & \" - \" & B61","v":"Solid Fossil Fuels - KT"},2020]
["NONREN","TJ_NCV",null,"H53",null,null,null,"Non Renewable Waste",{"$f":"VLOOKUP(D62, Param_Multilanguage!A:C, MATCH(LanguageChosen,Language[Language],0)+1, FALSE)","v":"Postal and courier activities"},{"$f":"VLOOKUP(H62,LanguageData,MATCH(LanguageChosen,Language[Language],0),FALSE) & \" - \" & B62","v":"Non Renewable Waste - TJ_NCV"},2020]
["HYDROGEN","TJ_NCV",null,"H53",null,null,null,"Hydrogen",{"$f":"VLOOKUP(D63, Param_Multilanguage!A:C, MATCH(LanguageChosen,Language[Language],0)+1, FALSE)","v":"Postal and courier activities"},{"$f":"VLOOKUP(H63,LanguageData,MATCH(LanguageChosen,Language[Language],0),FALSE) & \" - \" & B63","v":"Hydrogen - TJ_NCV"},2020]
["ELECTR","GWH",null,"I",null,null,null,"Electricity",{"$f":"VLOOKUP(D64, Param_Multilanguage!A:C, MATCH(LanguageChosen,Language[Language],0)+1, FALSE)","v":"Accommodation and food services activities"},{"$f":"VLOOKUP(H64,LanguageData,MATCH(LanguageChosen,Language[Language],0),FALSE) & \" - \" & B64","v":"Electricity - GWH"},2020]
["NATGAS","TJ_GCV",null,"I",null,null,null,"Natural Gas",{"$f":"VLOOKUP(D65, Param_Multilanguage!A:C, MATCH(LanguageChosen,Language[Language],0)+1, FALSE)","v":"Accommodation and food services activities"},{"$f":"VLOOKUP(H65,LanguageData,MATCH(LanguageChosen,Language[Language],0),FALSE) & \" - \" & B65","v":"Natural Gas - TJ_GCV"},2020]
["HEAT","TJ_NCV",null,"I",null,null,null,"Derived Heat",{"$f":"VLOOKUP(D66, Param_Multilanguage!A:C, MATCH(LanguageChosen,Language[Language],0)+1, FALSE)","v":"Accommodation and food services activities"},{"$f":"VLOOKUP(H66,LanguageData,MATCH(LanguageChosen,Language[Language],0),FALSE) & \" - \" & B66","v":"Derived Heat - TJ_NCV"},2020]
["TOTALOIL","KT",null,"I",null,null,null,"Oil and Petroleum Products",{"$f":"VLOOKUP(D67, Param_Multilanguage!A:C, MATCH(LanguageChosen,Language[Language],0)+1, FALSE)","v":"Accommodation and food services activities"},{"$f":"VLOOKUP(H67,LanguageData,MATCH(LanguageChosen,Language[Language],0),FALSE) & \" - \" & B67","v":"Oil and Petroleum Products - KT"},2020]
["REN","TJ_NCV",null,"I",null,null,null,"Renewable Energies",{"$f":"VLOOKUP(D68, Param_Multilanguage!A:C, MATCH(LanguageChosen,Language[Language],0)+1, FALSE)","v":"Accommodation and food services activities"},{"$f":"VLOOKUP(H68,LanguageData,MATCH(LanguageChosen,Language[Language],0),FALSE) & \" - \" & B68","v":"Renewable Energies - TJ_NCV"},2020]
["COAL","KT",null,"I",null,null,null,"Solid Fossil Fuels",{"$f":"VLOOKUP(D69, Param_Multilanguage!A:C, MATCH(LanguageChosen,Language[Language],0)+1, FALSE)","v":"Accommodation and food services activities"},{"$f":"VLOOKUP(H69,LanguageData,MATCH(LanguageChosen,Language[Language],0),FALSE) & \" - \" & B69","v":"Solid Fossil Fuels - KT"},2020]
["NONREN","TJ_NCV",null,"I",null,null,null,"Non Renewable Waste",{"$f":"VLOOKUP(D70, Param_Multilanguage!A:C, MATCH(LanguageChosen,Language[Language],0)+1, FALSE)","v":"Accommodation and food services activities"},{"$f":"VLOOKUP(H70,LanguageData,MATCH(LanguageChosen,Language[Language],0),FALSE) & \" - \" & B70","v":"Non Renewable Waste - TJ_NCV"},2020]
["HYDROGEN","TJ_NCV",null,"I",null,null,null,"Hydrogen",{"$f":"VLOOKUP(D71, Param_Multilanguage!A:C, MATCH(LanguageChosen,Language[Language],0)+1, FALSE)","v":"Accommodation and food services activities"},{"$f":"VLOOKUP(H71,LanguageData,MATCH(LanguageChosen,Language[Language],0),FALSE) & \" - \" & B71","v":"Hydrogen - TJ_NCV"},2020]
["ELECTR","GWH",null,"I55",null,null,null,"Electricity",{"$f":"VLOOKUP(D72, Param_Multilanguage!A:C, MATCH(LanguageChosen,Language[Language],0)+1, FALSE)","v":"Accommodation"},{"$f":"VLOOKUP(H72,LanguageData,MATCH(LanguageChosen,Language[Language],0),FALSE) & \" - \" & B72","v":"Electricity - GWH"},2020]
["NATGAS","TJ_GCV",null,"I55",null,null,null,"Natural Gas",{"$f":"VLOOKUP(D73, Param_Multilanguage!A:C, MATCH(LanguageChosen,Language[Language],0)+1, FALSE)","v":"Accommodation"},{"$f":"VLOOKUP(H73,LanguageData,MATCH(LanguageChosen,Language[Language],0),FALSE) & \" - \" & B73","v":"Natural Gas - TJ_GCV"},2020]
["HEAT","TJ_NCV",null,"I55",null,null,null,"Derived Heat",{"$f":"VLOOKUP(D74, Param_Multilanguage!A:C, MATCH(LanguageChosen,Language[Language],0)+1, FALSE)","v":"Accommodation"},{"$f":"VLOOKUP(H74,LanguageData,MATCH(LanguageChosen,Language[Language],0),FALSE) & \" - \" & B74","v":"Derived Heat - TJ_NCV"},2020]
["TOTALOIL","KT",null,"I55",null,null,null,"Oil and Petroleum Products",{"$f":"VLOOKUP(D75, Param_Multilanguage!A:C, MATCH(LanguageChosen,Language[Language],0)+1, FALSE)","v":"Accommodation"},{"$f":"VLOOKUP(H75,LanguageData,MATCH(LanguageChosen,Language[Language],0),FALSE) & \" - \" & B75","v":"Oil and Petroleum Products - KT"},2020]
["REN","TJ_NCV",null,"I55",null,null,null,"Renewable Energies",{"$f":"VLOOKUP(D76, Param_Multilanguage!A:C, MATCH(LanguageChosen,Language[Language],0)+1, FALSE)","v":"Accommodation"},{"$f":"VLOOKUP(H76,LanguageData,MATCH(LanguageChosen,Language[Language],0),FALSE) & \" - \" & B76","v":"Renewable Energies - TJ_NCV"},2020]
["COAL","KT",null,"I55",null,null,null,"Solid Fossil Fuels",{"$f":"VLOOKUP(D77, Param_Multilanguage!A:C, MATCH(LanguageChosen,Language[Language],0)+1, FALSE)","v":"Accommodation"},{"$f":"VLOOKUP(H77,LanguageData,MATCH(LanguageChosen,Language[Language],0),FALSE) & \" - \" & B77","v":"Solid Fossil Fuels - KT"},2020]
["NONREN","TJ_NCV",null,"I55",null,null,null,"Non Renewable Waste",{"$f":"VLOOKUP(D78, Param_Multilanguage!A:C, MATCH(LanguageChosen,Language[Language],0)+1, FALSE)","v":"Accommodation"},{"$f":"VLOOKUP(H78,LanguageData,MATCH(LanguageChosen,Language[Language],0),FALSE) & \" - \" & B78","v":"Non Renewable Waste - TJ_NCV"},2020]
["HYDROGEN","TJ_NCV",null,"I55",null,null,null,"Hydrogen",{"$f":"VLOOKUP(D79, Param_Multilanguage!A:C, MATCH(LanguageChosen,Language[Language],0)+1, FALSE)","v":"Accommodation"},{"$f":"VLOOKUP(H79,LanguageData,MATCH(LanguageChosen,Language[Language],0),FALSE) & \" - \" & B79","v":"Hydrogen - TJ_NCV"},2020]
["ELECTR","GWH",null,"I56",null,null,null,"Electricity",{"$f":"VLOOKUP(D80, Param_Multilanguage!A:C, MATCH(LanguageChosen,Language[Language],0)+1, FALSE)","v":"Food and beverage services activities"},{"$f":"VLOOKUP(H80,LanguageData,MATCH(LanguageChosen,Language[Language],0),FALSE) & \" - \" & B80","v":"Electricity - GWH"},2020]
["NATGAS","TJ_GCV",null,"I56",null,null,null,"Natural Gas",{"$f":"VLOOKUP(D81, Param_Multilanguage!A:C, MATCH(LanguageChosen,Language[Language],0)+1, FALSE)","v":"Food and beverage services activities"},{"$f":"VLOOKUP(H81,LanguageData,MATCH(LanguageChosen,Language[Language],0),FALSE) & \" - \" & B81","v":"Natural Gas - TJ_GCV"},2020]
["HEAT","TJ_NCV",null,"I56",null,null,null,"Derived Heat",{"$f":"VLOOKUP(D82, Param_Multilanguage!A:C, MATCH(LanguageChosen,Language[Language],0)+1, FALSE)","v":"Food and beverage services activities"},{"$f":"VLOOKUP(H82,LanguageData,MATCH(LanguageChosen,Language[Language],0),FALSE) & \" - \" & B82","v":"Derived Heat - TJ_NCV"},2020]
["TOTALOIL","KT",null,"I56",null,null,null,"Oil and Petroleum Products",{"$f":"VLOOKUP(D83, Param_Multilanguage!A:C, MATCH(LanguageChosen,Language[Language],0)+1, FALSE)","v":"Food and beverage services activities"},{"$f":"VLOOKUP(H83,LanguageData,MATCH(LanguageChosen,Language[Language],0),FALSE) & \" - \" & B83","v":"Oil and Petroleum Products - KT"},2020]
["REN","TJ_NCV",null,"I56",null,null,null,"Renewable Energies",{"$f":"VLOOKUP(D84, Param_Multilanguage!A:C, MATCH(LanguageChosen,Language[Language],0)+1, FALSE)","v":"Food and beverage services activities"},{"$f":"VLOOKUP(H84,LanguageData,MATCH(LanguageChosen,Language[Language],0),FALSE) & \" - \" & B84","v":"Renewable Energies - TJ_NCV"},2020]
["COAL","KT",null,"I56",null,null,null,"Solid Fossil Fuels",{"$f":"VLOOKUP(D85, Param_Multilanguage!A:C, MATCH(LanguageChosen,Language[Language],0)+1, FALSE)","v":"Food and beverage services activities"},{"$f":"VLOOKUP(H85,LanguageData,MATCH(LanguageChosen,Language[Language],0),FALSE) & \" - \" & B85","v":"Solid Fossil Fuels - KT"},2020]
["NONREN","TJ_NCV",null,"I56",null,null,null,"Non Renewable Waste",{"$f":"VLOOKUP(D86, Param_Multilanguage!A:C, MATCH(LanguageChosen,Language[Language],0)+1, FALSE)","v":"Food and beverage services activities"},{"$f":"VLOOKUP(H86,LanguageData,MATCH(LanguageChosen,Language[Language],0),FALSE) & \" - \" & B86","v":"Non Renewable Waste - TJ_NCV"},2020]
["HYDROGEN","TJ_NCV",null,"I56",null,null,null,"Hydrogen",{"$f":"VLOOKUP(D87, Param_Multilanguage!A:C, MATCH(LanguageChosen,Language[Language],0)+1, FALSE)","v":"Food and beverage services activities"},{"$f":"VLOOKUP(H87,LanguageData,MATCH(LanguageChosen,Language[Language],0),FALSE) & \" - \" & B87","v":"Hydrogen - TJ_NCV"},2020]
["ELECTR","GWH",null,"J",null,null,null,"Electricity",{"$f":"VLOOKUP(D88, Param_Multilanguage!A:C, MATCH(LanguageChosen,Language[Language],0)+1, FALSE)","v":"Information and communication"},{"$f":"VLOOKUP(H88,LanguageData,MATCH(LanguageChosen,Language[Language],0),FALSE) & \" - \" & B88","v":"Electricity - GWH"},2020]
["NATGAS","TJ_GCV",null,"J",null,null,null,"Natural Gas",{"$f":"VLOOKUP(D89, Param_Multilanguage!A:C, MATCH(LanguageChosen,Language[Language],0)+1, FALSE)","v":"Information and communication"},{"$f":"VLOOKUP(H89,LanguageData,MATCH(LanguageChosen,Language[Language],0),FALSE) & \" - \" & B89","v":"Natural Gas - TJ_GCV"},2020]
["HEAT","TJ_NCV",null,"J",null,null,null,"Derived Heat",{"$f":"VLOOKUP(D90, Param_Multilanguage!A:C, MATCH(LanguageChosen,Language[Language],0)+1, FALSE)","v":"Information and communication"},{"$f":"VLOOKUP(H90,LanguageData,MATCH(LanguageChosen,Language[Language],0),FALSE) & \" - \" & B90","v":"Derived Heat - TJ_NCV"},2020]
["TOTALOIL","KT",null,"J",null,null,null,"Oil and Petroleum Products",{"$f":"VLOOKUP(D91, Param_Multilanguage!A:C, MATCH(LanguageChosen,Language[Language],0)+1, FALSE)","v":"Information and communication"},{"$f":"VLOOKUP(H91,LanguageData,MATCH(LanguageChosen,Language[Language],0),FALSE) & \" - \" & B91","v":"Oil and Petroleum Products - KT"},2020]
["REN","TJ_NCV",null,"J",null,null,null,"Renewable Energies",{"$f":"VLOOKUP(D92, Param_Multilanguage!A:C, MATCH(LanguageChosen,Language[Language],0)+1, FALSE)","v":"Information and communication"},{"$f":"VLOOKUP(H92,LanguageData,MATCH(LanguageChosen,Language[Language],0),FALSE) & \" - \" & B92","v":"Renewable Energies - TJ_NCV"},2020]
["COAL","KT",null,"J",null,null,null,"Solid Fossil Fuels",{"$f":"VLOOKUP(D93, Param_Multilanguage!A:C, MATCH(LanguageChosen,Language[Language],0)+1, FALSE)","v":"Information and communication"},{"$f":"VLOOKUP(H93,LanguageData,MATCH(LanguageChosen,Language[Language],0),FALSE) & \" - \" & B93","v":"Solid Fossil Fuels - KT"},2020]
["NONREN","TJ_NCV",null,"J",null,null,null,"Non Renewable Waste",{"$f":"VLOOKUP(D94, Param_Multilanguage!A:C, MATCH(LanguageChosen,Language[Language],0)+1, FALSE)","v":"Information and communication"},{"$f":"VLOOKUP(H94,LanguageData,MATCH(LanguageChosen,Language[Language],0),FALSE) & \" - \" & B94","v":"Non Renewable Waste - TJ_NCV"},2020]
["HYDROGEN","TJ_NCV",null,"J",null,null,null,"Hydrogen",{"$f":"VLOOKUP(D95, Param_Multilanguage!A:C, MATCH(LanguageChosen,Language[Language],0)+1, FALSE)","v":"Information and communication"},{"$f":"VLOOKUP(H95,LanguageData,MATCH(LanguageChosen,Language[Language],0),FALSE) & \" - \" & B95","v":"Hydrogen - TJ_NCV"},2020]
["ELECTR","GWH",null,"K_L",null,null,null,"Electricity",{"$f":"VLOOKUP(D96, Param_Multilanguage!A:C, MATCH(LanguageChosen,Language[Language],0)+1, FALSE)","v":"Financial and insurance activities; real estate activities"},{"$f":"VLOOKUP(H96,LanguageData,MATCH(LanguageChosen,Language[Language],0),FALSE) & \" - \" & B96","v":"Electricity - GWH"},2020]
["NATGAS","TJ_GCV",null,"K_L",null,null,null,"Natural Gas",{"$f":"VLOOKUP(D97, Param_Multilanguage!A:C, MATCH(LanguageChosen,Language[Language],0)+1, FALSE)","v":"Financial and insurance activities; real estate activities"},{"$f":"VLOOKUP(H97,LanguageData,MATCH(LanguageChosen,Language[Language],0),FALSE) & \" - \" & B97","v":"Natural Gas - TJ_GCV"},2020]
["HEAT","TJ_NCV",null,"K_L",null,null,null,"Derived Heat",{"$f":"VLOOKUP(D98, Param_Multilanguage!A:C, MATCH(LanguageChosen,Language[Language],0)+1, FALSE)","v":"Financial and insurance activities; real estate activities"},{"$f":"VLOOKUP(H98,LanguageData,MATCH(LanguageChosen,Language[Language],0),FALSE) & \" - \" & B98","v":"Derived Heat - TJ_NCV"},2020]
["TOTALOIL","KT",null,"K_L",null,null,null,"Oil and Petroleum Products",{"$f":"VLOOKUP(D99, Param_Multilanguage!A:C, MATCH(LanguageChosen,Language[Language],0)+1, FALSE)","v":"Financial and insurance activities; real estate activities"},{"$f":"VLOOKUP(H99,LanguageData,MATCH(LanguageChosen,Language[Language],0),FALSE) & \" - \" & B99","v":"Oil and Petroleum Products - KT"},2020]
["REN","TJ_NCV",null,"K_L",null,null,null,"Renewable Energies",{"$f":"VLOOKUP(D100, Param_Multilanguage!A:C, MATCH(LanguageChosen,Language[Language],0)+1, FALSE)","v":"Financial and insurance activities; real estate activities"},{"$f":"VLOOKUP(H100,LanguageData,MATCH(LanguageChosen,Language[Language],0),FALSE) & \" - \" & B100","v":"Renewable Energies - TJ_NCV"},2020,null,null,"Sum of Value","Column Labels"]
["COAL","KT",null,"K_L",null,null,null,"Solid Fossil Fuels",{"$f":"VLOOKUP(D101, Param_Multilanguage!A:C, MATCH(LanguageChosen,Language[Language],0)+1, FALSE)","v":"Financial and insurance activities; real estate activities"},{"$f":"VLOOKUP(H101,LanguageData,MATCH(LanguageChosen,Language[Language],0),FALSE) & \" - \" & B101","v":"Solid Fossil Fuels - KT"},2020,null,null,null,"Derived Heat - TJ_NCV","Electricity - GWH","Hydrogen - TJ_NCV","Natural Gas - TJ_GCV","Non Renewable Waste - TJ_NCV","Oil and Petroleum Products - KT","Renewable Energies - TJ_NCV","Solid Fossil Fuels - KT"]
["NONREN","TJ_NCV",null,"K_L",null,null,null,"Non Renewable Waste",{"$f":"VLOOKUP(D102, Param_Multilanguage!A:C, MATCH(LanguageChosen,Language[Language],0)+1, FALSE)","v":"Financial and insurance activities; real estate activities"},{"$f":"VLOOKUP(H102,LanguageData,MATCH(LanguageChosen,Language[Language],0),FALSE) & \" - \" & B102","v":"Non Renewable Waste - TJ_NCV"},2020,null,null,"Row Labels","Services total","Services total","Services total","Services total","Services total","Services total","Services total","Services total"]
["HYDROGEN","TJ_NCV",null,"K_L",null,null,null,"Hydrogen",{"$f":"VLOOKUP(D103, Param_Multilanguage!A:C, MATCH(LanguageChosen,Language[Language],0)+1, FALSE)","v":"Financial and insurance activities; real estate activities"},{"$f":"VLOOKUP(H103,LanguageData,MATCH(LanguageChosen,Language[Language],0),FALSE) & \" - \" & B103","v":"Hydrogen - TJ_NCV"},2020,null,null,2020]
["ELECTR","GWH",null,"M_S",null,null,null,"Electricity",{"$f":"VLOOKUP(D104, Param_Multilanguage!A:C, MATCH(LanguageChosen,Language[Language],0)+1, FALSE)","v":"Professional, scientific and technical activities; other services"},{"$f":"VLOOKUP(H104,LanguageData,MATCH(LanguageChosen,Language[Language],0),FALSE) & \" - \" & B104","v":"Electricity - GWH"},2020,null,null,2021]
["NATGAS","TJ_GCV",null,"M_S",null,null,null,"Natural Gas",{"$f":"VLOOKUP(D105, Param_Multilanguage!A:C, MATCH(LanguageChosen,Language[Language],0)+1, FALSE)","v":"Professional, scientific and technical activities; other services"},{"$f":"VLOOKUP(H105,LanguageData,MATCH(LanguageChosen,Language[Language],0),FALSE) & \" - \" & B105","v":"Natural Gas - TJ_GCV"},2020,null,null,2022]
["HEAT","TJ_NCV",null,"M_S",null,null,null,"Derived Heat",{"$f":"VLOOKUP(D106, Param_Multilanguage!A:C, MATCH(LanguageChosen,Language[Language],0)+1, FALSE)","v":"Professional, scientific and technical activities; other services"},{"$f":"VLOOKUP(H106,LanguageData,MATCH(LanguageChosen,Language[Language],0),FALSE) & \" - \" & B106","v":"Derived Heat - TJ_NCV"},2020,null,null,2023]
["TOTALOIL","KT",null,"M_S",null,null,null,"Oil and Petroleum Products",{"$f":"VLOOKUP(D107, Param_Multilanguage!A:C, MATCH(LanguageChosen,Language[Language],0)+1, FALSE)","v":"Professional, scientific and technical activities; other services"},{"$f":"VLOOKUP(H107,LanguageData,MATCH(LanguageChosen,Language[Language],0),FALSE) & \" - \" & B107","v":"Oil and Petroleum Products - KT"},2020,null,null,2024]
["REN","TJ_NCV",null,"M_S",null,null,null,"Renewable Energies",{"$f":"VLOOKUP(D108, Param_Multilanguage!A:C, MATCH(LanguageChosen,Language[Language],0)+1, FALSE)","v":"Professional, scientific and technical activities; other services"},{"$f":"VLOOKUP(H108,LanguageData,MATCH(LanguageChosen,Language[Language],0),FALSE) & \" - \" & B108","v":"Renewable Energies - TJ_NCV"},2020]
["COAL","KT",null,"M_S",null,null,null,"Solid Fossil Fuels",{"$f":"VLOOKUP(D109, Param_Multilanguage!A:C, MATCH(LanguageChosen,Language[Language],0)+1, FALSE)","v":"Professional, scientific and technical activities; other services"},{"$f":"VLOOKUP(H109,LanguageData,MATCH(LanguageChosen,Language[Language],0),FALSE) & \" - \" & B109","v":"Solid Fossil Fuels - KT"},2020]
["NONREN","TJ_NCV",null,"M_S",null,null,null,"Non Renewable Waste",{"$f":"VLOOKUP(D110, Param_Multilanguage!A:C, MATCH(LanguageChosen,Language[Language],0)+1, FALSE)","v":"Professional, scientific and technical activities; other services"},{"$f":"VLOOKUP(H110,LanguageData,MATCH(LanguageChosen,Language[Language],0),FALSE) & \" - \" & B110","v":"Non Renewable Waste - TJ_NCV"},2020]
["HYDROGEN","TJ_NCV",null,"M_S",null,null,null,"Hydrogen",{"$f":"VLOOKUP(D111, Param_Multilanguage!A:C, MATCH(LanguageChosen,Language[Language],0)+1, FALSE)","v":"Professional, scientific and technical activities; other services"},{"$f":"VLOOKUP(H111,LanguageData,MATCH(LanguageChosen,Language[Language],0),FALSE) & \" - \" & B111","v":"Hydrogen - TJ_NCV"},2020]
["ELECTR","GWH",null,"N",null,null,null,"Electricity",{"$f":"VLOOKUP(D112, Param_Multilanguage!A:C, MATCH(LanguageChosen,Language[Language],0)+1, FALSE)","v":"Administrative and support services activities"},{"$f":"VLOOKUP(H112,LanguageData,MATCH(LanguageChosen,Language[Language],0),FALSE) & \" - \" & B112","v":"Electricity - GWH"},2020]
["NATGAS","TJ_GCV",null,"N",null,null,null,"Natural Gas",{"$f":"VLOOKUP(D113, Param_Multilanguage!A:C, MATCH(LanguageChosen,Language[Language],0)+1, FALSE)","v":"Administrative and support services activities"},{"$f":"VLOOKUP(H113,LanguageData,MATCH(LanguageChosen,Language[Language],0),FALSE) & \" - \" & B113","v":"Natural Gas - TJ_GCV"},2020]
["HEAT","TJ_NCV",null,"N",null,null,null,"Derived Heat",{"$f":"VLOOKUP(D114, Param_Multilanguage!A:C, MATCH(LanguageChosen,Language[Language],0)+1, FALSE)","v":"Administrative and support services activities"},{"$f":"VLOOKUP(H114,LanguageData,MATCH(LanguageChosen,Language[Language],0),FALSE) & \" - \" & B114","v":"Derived Heat - TJ_NCV"},2020]
["TOTALOIL","KT",null,"N",null,null,null,"Oil and Petroleum Products",{"$f":"VLOOKUP(D115, Param_Multilanguage!A:C, MATCH(LanguageChosen,Language[Language],0)+1, FALSE)","v":"Administrative and support services activities"},{"$f":"VLOOKUP(H115,LanguageData,MATCH(LanguageChosen,Language[Language],0),FALSE) & \" - \" & B115","v":"Oil and Petroleum Products - KT"},2020]
["REN","TJ_NCV",null,"N",null,null,null,"Renewable Energies",{"$f":"VLOOKUP(D116, Param_Multilanguage!A:C, MATCH(LanguageChosen,Language[Language],0)+1, FALSE)","v":"Administrative and support services activities"},{"$f":"VLOOKUP(H116,LanguageData,MATCH(LanguageChosen,Language[Language],0),FALSE) & \" - \" & B116","v":"Renewable Energies - TJ_NCV"},2020]
["COAL","KT",null,"N",null,null,null,"Solid Fossil Fuels",{"$f":"VLOOKUP(D117, Param_Multilanguage!A:C, MATCH(LanguageChosen,Language[Language],0)+1, FALSE)","v":"Administrative and support services activities"},{"$f":"VLOOKUP(H117,LanguageData,MATCH(LanguageChosen,Language[Language],0),FALSE) & \" - \" & B117","v":"Solid Fossil Fuels - KT"},2020]
["NONREN","TJ_NCV",null,"N",null,null,null,"Non Renewable Waste",{"$f":"VLOOKUP(D118, Param_Multilanguage!A:C, MATCH(LanguageChosen,Language[Language],0)+1, FALSE)","v":"Administrative and support services activities"},{"$f":"VLOOKUP(H118,LanguageData,MATCH(LanguageChosen,Language[Language],0),FALSE) & \" - \" & B118","v":"Non Renewable Waste - TJ_NCV"},2020]
["HYDROGEN","TJ_NCV",null,"N",null,null,null,"Hydrogen",{"$f":"VLOOKUP(D119, Param_Multilanguage!A:C, MATCH(LanguageChosen,Language[Language],0)+1, FALSE)","v":"Administrative and support services activities"},{"$f":"VLOOKUP(H119,LanguageData,MATCH(LanguageChosen,Language[Language],0),FALSE) & \" - \" & B119","v":"Hydrogen - TJ_NCV"},2020]
["ELECTR","GWH",null,"O",null,null,null,"Electricity",{"$f":"VLOOKUP(D120, Param_Multilanguage!A:C, MATCH(LanguageChosen,Language[Language],0)+1, FALSE)","v":"Public administration and defence; compulsory social security"},{"$f":"VLOOKUP(H120,LanguageData,MATCH(LanguageChosen,Language[Language],0),FALSE) & \" - \" & B120","v":"Electricity - GWH"},2020]
["NATGAS","TJ_GCV",null,"O",null,null,null,"Natural Gas",{"$f":"VLOOKUP(D121, Param_Multilanguage!A:C, MATCH(LanguageChosen,Language[Language],0)+1, FALSE)","v":"Public administration and defence; compulsory social security"},{"$f":"VLOOKUP(H121,LanguageData,MATCH(LanguageChosen,Language[Language],0),FALSE) & \" - \" & B121","v":"Natural Gas - TJ_GCV"},2020]
["HEAT","TJ_NCV",null,"O",null,null,null,"Derived Heat",{"$f":"VLOOKUP(D122, Param_Multilanguage!A:C, MATCH(LanguageChosen,Language[Language],0)+1, FALSE)","v":"Public administration and defence; compulsory social security"},{"$f":"VLOOKUP(H122,LanguageData,MATCH(LanguageChosen,Language[Language],0),FALSE) & \" - \" & B122","v":"Derived Heat - TJ_NCV"},2020]
["TOTALOIL","KT",null,"O",null,null,null,"Oil and Petroleum Products",{"$f":"VLOOKUP(D123, Param_Multilanguage!A:C, MATCH(LanguageChosen,Language[Language],0)+1, FALSE)","v":"Public administration and defence; compulsory social security"},{"$f":"VLOOKUP(H123,LanguageData,MATCH(LanguageChosen,Language[Language],0),FALSE) & \" - \" & B123","v":"Oil and Petroleum Products - KT"},2020]
["REN","TJ_NCV",null,"O",null,null,null,"Renewable Energies",{"$f":"VLOOKUP(D124, Param_Multilanguage!A:C, MATCH(LanguageChosen,Language[Language],0)+1, FALSE)","v":"Public administration and defence; compulsory social security"},{"$f":"VLOOKUP(H124,LanguageData,MATCH(LanguageChosen,Language[Language],0),FALSE) & \" - \" & B124","v":"Renewable Energies - TJ_NCV"},2020]
["COAL","KT",null,"O",null,null,null,"Solid Fossil Fuels",{"$f":"VLOOKUP(D125, Param_Multilanguage!A:C, MATCH(LanguageChosen,Language[Language],0)+1, FALSE)","v":"Public administration and defence; compulsory social security"},{"$f":"VLOOKUP(H125,LanguageData,MATCH(LanguageChosen,Language[Language],0),FALSE) & \" - \" & B125","v":"Solid Fossil Fuels - KT"},2020]
["NONREN","TJ_NCV",null,"O",null,null,null,"Non Renewable Waste",{"$f":"VLOOKUP(D126, Param_Multilanguage!A:C, MATCH(LanguageChosen,Language[Language],0)+1, FALSE)","v":"Public administration and defence; compulsory social security"},{"$f":"VLOOKUP(H126,LanguageData,MATCH(LanguageChosen,Language[Language],0),FALSE) & \" - \" & B126","v":"Non Renewable Waste - TJ_NCV"},2020]
["HYDROGEN","TJ_NCV",null,"O",null,null,null,"Hydrogen",{"$f":"VLOOKUP(D127, Param_Multilanguage!A:C, MATCH(LanguageChosen,Language[Language],0)+1, FALSE)","v":"Public administration and defence; compulsory social security"},{"$f":"VLOOKUP(H127,LanguageData,MATCH(LanguageChosen,Language[Language],0),FALSE) & \" - \" & B127","v":"Hydrogen - TJ_NCV"},2020]
["ELECTR","GWH",null,"P",null,null,null,"Electricity",{"$f":"VLOOKUP(D128, Param_Multilanguage!A:C, MATCH(LanguageChosen,Language[Language],0)+1, FALSE)","v":"Education"},{"$f":"VLOOKUP(H128,LanguageData,MATCH(LanguageChosen,Language[Language],0),FALSE) & \" - \" & B128","v":"Electricity - GWH"},2020]
["NATGAS","TJ_GCV",null,"P",null,null,null,"Natural Gas",{"$f":"VLOOKUP(D129, Param_Multilanguage!A:C, MATCH(LanguageChosen,Language[Language],0)+1, FALSE)","v":"Education"},{"$f":"VLOOKUP(H129,LanguageData,MATCH(LanguageChosen,Language[Language],0),FALSE) & \" - \" & B129","v":"Natural Gas - TJ_GCV"},2020]
["HEAT","TJ_NCV",null,"P",null,null,null,"Derived Heat",{"$f":"VLOOKUP(D130, Param_Multilanguage!A:C, MATCH(LanguageChosen,Language[Language],0)+1, FALSE)","v":"Education"},{"$f":"VLOOKUP(H130,LanguageData,MATCH(LanguageChosen,Language[Language],0),FALSE) & \" - \" & B130","v":"Derived Heat - TJ_NCV"},2020]
["TOTALOIL","KT",null,"P",null,null,null,"Oil and Petroleum Products",{"$f":"VLOOKUP(D131, Param_Multilanguage!A:C, MATCH(LanguageChosen,Language[Language],0)+1, FALSE)","v":"Education"},{"$f":"VLOOKUP(H131,LanguageData,MATCH(LanguageChosen,Language[Language],0),FALSE) & \" - \" & B131","v":"Oil and Petroleum Products - KT"},2020]
["REN","TJ_NCV",null,"P",null,null,null,"Renewable Energies",{"$f":"VLOOKUP(D132, Param_Multilanguage!A:C, MATCH(LanguageChosen,Language[Language],0)+1, FALSE)","v":"Education"},{"$f":"VLOOKUP(H132,LanguageData,MATCH(LanguageChosen,Language[Language],0),FALSE) & \" - \" & B132","v":"Renewable Energies - TJ_NCV"},2020]
["COAL","KT",null,"P",null,null,null,"Solid Fossil Fuels",{"$f":"VLOOKUP(D133, Param_Multilanguage!A:C, MATCH(LanguageChosen,Language[Language],0)+1, FALSE)","v":"Education"},{"$f":"VLOOKUP(H133,LanguageData,MATCH(LanguageChosen,Language[Language],0),FALSE) & \" - \" & B133","v":"Solid Fossil Fuels - KT"},2020]
["NONREN","TJ_NCV",null,"P",null,null,null,"Non Renewable Waste",{"$f":"VLOOKUP(D134, Param_Multilanguage!A:C, MATCH(LanguageChosen,Language[Language],0)+1, FALSE)","v":"Education"},{"$f":"VLOOKUP(H134,LanguageData,MATCH(LanguageChosen,Language[Language],0),FALSE) & \" - \" & B134","v":"Non Renewable Waste - TJ_NCV"},2020]
["HYDROGEN","TJ_NCV",null,"P",null,null,null,"Hydrogen",{"$f":"VLOOKUP(D135, Param_Multilanguage!A:C, MATCH(LanguageChosen,Language[Language],0)+1, FALSE)","v":"Education"},{"$f":"VLOOKUP(H135,LanguageData,MATCH(LanguageChosen,Language[Language],0),FALSE) & \" - \" & B135","v":"Hydrogen - TJ_NCV"},2020]
["ELECTR","GWH",null,"Q",null,null,null,"Electricity",{"$f":"VLOOKUP(D136, Param_Multilanguage!A:C, MATCH(LanguageChosen,Language[Language],0)+1, FALSE)","v":"Human health and social work activities"},{"$f":"VLOOKUP(H136,LanguageData,MATCH(LanguageChosen,Language[Language],0),FALSE) & \" - \" & B136","v":"Electricity - GWH"},2020]
["NATGAS","TJ_GCV",null,"Q",null,null,null,"Natural Gas",{"$f":"VLOOKUP(D137, Param_Multilanguage!A:C, MATCH(LanguageChosen,Language[Language],0)+1, FALSE)","v":"Human health and social work activities"},{"$f":"VLOOKUP(H137,LanguageData,MATCH(LanguageChosen,Language[Language],0),FALSE) & \" - \" & B137","v":"Natural Gas - TJ_GCV"},2020]
["HEAT","TJ_NCV",null,"Q",null,null,null,"Derived Heat",{"$f":"VLOOKUP(D138, Param_Multilanguage!A:C, MATCH(LanguageChosen,Language[Language],0)+1, FALSE)","v":"Human health and social work activities"},{"$f":"VLOOKUP(H138,LanguageData,MATCH(LanguageChosen,Language[Language],0),FALSE) & \" - \" & B138","v":"Derived Heat - TJ_NCV"},2020]
["TOTALOIL","KT",null,"Q",null,null,null,"Oil and Petroleum Products",{"$f":"VLOOKUP(D139, Param_Multilanguage!A:C, MATCH(LanguageChosen,Language[Language],0)+1, FALSE)","v":"Human health and social work activities"},{"$f":"VLOOKUP(H139,LanguageData,MATCH(LanguageChosen,Language[Language],0),FALSE) & \" - \" & B139","v":"Oil and Petroleum Products - KT"},2020]
["REN","TJ_NCV",null,"Q",null,null,null,"Renewable Energies",{"$f":"VLOOKUP(D140, Param_Multilanguage!A:C, MATCH(LanguageChosen,Language[Language],0)+1, FALSE)","v":"Human health and social work activities"},{"$f":"VLOOKUP(H140,LanguageData,MATCH(LanguageChosen,Language[Language],0),FALSE) & \" - \" & B140","v":"Renewable Energies - TJ_NCV"},2020]
["COAL","KT",null,"Q",null,null,null,"Solid Fossil Fuels",{"$f":"VLOOKUP(D141, Param_Multilanguage!A:C, MATCH(LanguageChosen,Language[Language],0)+1, FALSE)","v":"Human health and social work activities"},{"$f":"VLOOKUP(H141,LanguageData,MATCH(LanguageChosen,Language[Language],0),FALSE) & \" - \" & B141","v":"Solid Fossil Fuels - KT"},2020]
["NONREN","TJ_NCV",null,"Q",null,null,null,"Non Renewable Waste",{"$f":"VLOOKUP(D142, Param_Multilanguage!A:C, MATCH(LanguageChosen,Language[Language],0)+1, FALSE)","v":"Human health and social work activities"},{"$f":"VLOOKUP(H142,LanguageData,MATCH(LanguageChosen,Language[Language],0),FALSE) & \" - \" & B142","v":"Non Renewable Waste - TJ_NCV"},2020]
["HYDROGEN","TJ_NCV",null,"Q",null,null,null,"Hydrogen",{"$f":"VLOOKUP(D143, Param_Multilanguage!A:C, MATCH(LanguageChosen,Language[Language],0)+1, FALSE)","v":"Human health and social work activities"},{"$f":"VLOOKUP(H143,LanguageData,MATCH(LanguageChosen,Language[Language],0),FALSE) & \" - \" & B143","v":"Hydrogen - TJ_NCV"},2020]
["ELECTR","GWH",null,"Q861",null,null,null,"Electricity",{"$f":"VLOOKUP(D144, Param_Multilanguage!A:C, MATCH(LanguageChosen,Language[Language],0)+1, FALSE)","v":"Of which: Hospital activities"},{"$f":"VLOOKUP(H144,LanguageData,MATCH(LanguageChosen,Language[Language],0),FALSE) & \" - \" & B144","v":"Electricity - GWH"},2020]
["NATGAS","TJ_GCV",null,"Q861",null,null,null,"Natural Gas",{"$f":"VLOOKUP(D145, Param_Multilanguage!A:C, MATCH(LanguageChosen,Language[Language],0)+1, FALSE)","v":"Of which: Hospital activities"},{"$f":"VLOOKUP(H145,LanguageData,MATCH(LanguageChosen,Language[Language],0),FALSE) & \" - \" & B145","v":"Natural Gas - TJ_GCV"},2020]
["HEAT","TJ_NCV",null,"Q861",null,null,null,"Derived Heat",{"$f":"VLOOKUP(D146, Param_Multilanguage!A:C, MATCH(LanguageChosen,Language[Language],0)+1, FALSE)","v":"Of which: Hospital activities"},{"$f":"VLOOKUP(H146,LanguageData,MATCH(LanguageChosen,Language[Language],0),FALSE) & \" - \" & B146","v":"Derived Heat - TJ_NCV"},2020]
["TOTALOIL","KT",null,"Q861",null,null,null,"Oil and Petroleum Products",{"$f":"VLOOKUP(D147, Param_Multilanguage!A:C, MATCH(LanguageChosen,Language[Language],0)+1, FALSE)","v":"Of which: Hospital activities"},{"$f":"VLOOKUP(H147,LanguageData,MATCH(LanguageChosen,Language[Language],0),FALSE) & \" - \" & B147","v":"Oil and Petroleum Products - KT"},2020]
["REN","TJ_NCV",null,"Q861",null,null,null,"Renewable Energies",{"$f":"VLOOKUP(D148, Param_Multilanguage!A:C, MATCH(LanguageChosen,Language[Language],0)+1, FALSE)","v":"Of which: Hospital activities"},{"$f":"VLOOKUP(H148,LanguageData,MATCH(LanguageChosen,Language[Language],0),FALSE) & \" - \" & B148","v":"Renewable Energies - TJ_NCV"},2020]
["COAL","KT",null,"Q861",null,null,null,"Solid Fossil Fuels",{"$f":"VLOOKUP(D149, Param_Multilanguage!A:C, MATCH(LanguageChosen,Language[Language],0)+1, FALSE)","v":"Of which: Hospital activities"},{"$f":"VLOOKUP(H149,LanguageData,MATCH(LanguageChosen,Language[Language],0),FALSE) & \" - \" & B149","v":"Solid Fossil Fuels - KT"},2020]
["NONREN","TJ_NCV",null,"Q861",null,null,null,"Non Renewable Waste",{"$f":"VLOOKUP(D150, Param_Multilanguage!A:C, MATCH(LanguageChosen,Language[Language],0)+1, FALSE)","v":"Of which: Hospital activities"},{"$f":"VLOOKUP(H150,LanguageData,MATCH(LanguageChosen,Language[Language],0),FALSE) & \" - \" & B150","v":"Non Renewable Waste - TJ_NCV"},2020]
["HYDROGEN","TJ_NCV",null,"Q861",null,null,null,"Hydrogen",{"$f":"VLOOKUP(D151, Param_Multilanguage!A:C, MATCH(LanguageChosen,Language[Language],0)+1, FALSE)","v":"Of which: Hospital activities"},{"$f":"VLOOKUP(H151,LanguageData,MATCH(LanguageChosen,Language[Language],0),FALSE) & \" - \" & B151","v":"Hydrogen - TJ_NCV"},2020]
["ELECTR","GWH",null,"R",null,null,null,"Electricity",{"$f":"VLOOKUP(D152, Param_Multilanguage!A:C, MATCH(LanguageChosen,Language[Language],0)+1, FALSE)","v":"Arts, entertainment and recreation"},{"$f":"VLOOKUP(H152,LanguageData,MATCH(LanguageChosen,Language[Language],0),FALSE) & \" - \" & B152","v":"Electricity - GWH"},2020]
["NATGAS","TJ_GCV",null,"R",null,null,null,"Natural Gas",{"$f":"VLOOKUP(D153, Param_Multilanguage!A:C, MATCH(LanguageChosen,Language[Language],0)+1, FALSE)","v":"Arts, entertainment and recreation"},{"$f":"VLOOKUP(H153,LanguageData,MATCH(LanguageChosen,Language[Language],0),FALSE) & \" - \" & B153","v":"Natural Gas - TJ_GCV"},2020]
["HEAT","TJ_NCV",null,"R",null,null,null,"Derived Heat",{"$f":"VLOOKUP(D154, Param_Multilanguage!A:C, MATCH(LanguageChosen,Language[Language],0)+1, FALSE)","v":"Arts, entertainment and recreation"},{"$f":"VLOOKUP(H154,LanguageData,MATCH(LanguageChosen,Language[Language],0),FALSE) & \" - \" & B154","v":"Derived Heat - TJ_NCV"},2020]
["TOTALOIL","KT",null,"R",null,null,null,"Oil and Petroleum Products",{"$f":"VLOOKUP(D155, Param_Multilanguage!A:C, MATCH(LanguageChosen,Language[Language],0)+1, FALSE)","v":"Arts, entertainment and recreation"},{"$f":"VLOOKUP(H155,LanguageData,MATCH(LanguageChosen,Language[Language],0),FALSE) & \" - \" & B155","v":"Oil and Petroleum Products - KT"},2020]
["REN","TJ_NCV",null,"R",null,null,null,"Renewable Energies",{"$f":"VLOOKUP(D156, Param_Multilanguage!A:C, MATCH(LanguageChosen,Language[Language],0)+1, FALSE)","v":"Arts, entertainment and recreation"},{"$f":"VLOOKUP(H156,LanguageData,MATCH(LanguageChosen,Language[Language],0),FALSE) & \" - \" & B156","v":"Renewable Energies - TJ_NCV"},2020]
["COAL","KT",null,"R",null,null,null,"Solid Fossil Fuels",{"$f":"VLOOKUP(D157, Param_Multilanguage!A:C, MATCH(LanguageChosen,Language[Language],0)+1, FALSE)","v":"Arts, entertainment and recreation"},{"$f":"VLOOKUP(H157,LanguageData,MATCH(LanguageChosen,Language[Language],0),FALSE) & \" - \" & B157","v":"Solid Fossil Fuels - KT"},2020]
["NONREN","TJ_NCV",null,"R",null,null,null,"Non Renewable Waste",{"$f":"VLOOKUP(D158, Param_Multilanguage!A:C, MATCH(LanguageChosen,Language[Language],0)+1, FALSE)","v":"Arts, entertainment and recreation"},{"$f":"VLOOKUP(H158,LanguageData,MATCH(LanguageChosen,Language[Language],0),FALSE) & \" - \" & B158","v":"Non Renewable Waste - TJ_NCV"},2020]
["HYDROGEN","TJ_NCV",null,"R",null,null,null,"Hydrogen",{"$f":"VLOOKUP(D159, Param_Multilanguage!A:C, MATCH(LanguageChosen,Language[Language],0)+1, FALSE)","v":"Arts, entertainment and recreation"},{"$f":"VLOOKUP(H159,LanguageData,MATCH(LanguageChosen,Language[Language],0),FALSE) & \" - \" & B159","v":"Hydrogen - TJ_NCV"},2020]
["ELECTR","GWH",null,"R93",null,null,null,"Electricity",{"$f":"VLOOKUP(D160, Param_Multilanguage!A:C, MATCH(LanguageChosen,Language[Language],0)+1, FALSE)","v":"Of which: Sports activities and amusement and recreation activities"},{"$f":"VLOOKUP(H160,LanguageData,MATCH(LanguageChosen,Language[Language],0),FALSE) & \" - \" & B160","v":"Electricity - GWH"},2020]
["NATGAS","TJ_GCV",null,"R93",null,null,null,"Natural Gas",{"$f":"VLOOKUP(D161, Param_Multilanguage!A:C, MATCH(LanguageChosen,Language[Language],0)+1, FALSE)","v":"Of which: Sports activities and amusement and recreation activities"},{"$f":"VLOOKUP(H161,LanguageData,MATCH(LanguageChosen,Language[Language],0),FALSE) & \" - \" & B161","v":"Natural Gas - TJ_GCV"},2020]
["HEAT","TJ_NCV",null,"R93",null,null,null,"Derived Heat",{"$f":"VLOOKUP(D162, Param_Multilanguage!A:C, MATCH(LanguageChosen,Language[Language],0)+1, FALSE)","v":"Of which: Sports activities and amusement and recreation activities"},{"$f":"VLOOKUP(H162,LanguageData,MATCH(LanguageChosen,Language[Language],0),FALSE) & \" - \" & B162","v":"Derived Heat - TJ_NCV"},2020]
["TOTALOIL","KT",null,"R93",null,null,null,"Oil and Petroleum Products",{"$f":"VLOOKUP(D163, Param_Multilanguage!A:C, MATCH(LanguageChosen,Language[Language],0)+1, FALSE)","v":"Of which: Sports activities and amusement and recreation activities"},{"$f":"VLOOKUP(H163,LanguageData,MATCH(LanguageChosen,Language[Language],0),FALSE) & \" - \" & B163","v":"Oil and Petroleum Products - KT"},2020]
["REN","TJ_NCV",null,"R93",null,null,null,"Renewable Energies",{"$f":"VLOOKUP(D164, Param_Multilanguage!A:C, MATCH(LanguageChosen,Language[Language],0)+1, FALSE)","v":"Of which: Sports activities and amusement and recreation activities"},{"$f":"VLOOKUP(H164,LanguageData,MATCH(LanguageChosen,Language[Language],0),FALSE) & \" - \" & B164","v":"Renewable Energies - TJ_NCV"},2020]
["COAL","KT",null,"R93",null,null,null,"Solid Fossil Fuels",{"$f":"VLOOKUP(D165, Param_Multilanguage!A:C, MATCH(LanguageChosen,Language[Language],0)+1, FALSE)","v":"Of which: Sports activities and amusement and recreation activities"},{"$f":"VLOOKUP(H165,LanguageData,MATCH(LanguageChosen,Language[Language],0),FALSE) & \" - \" & B165","v":"Solid Fossil Fuels - KT"},2020]
["NONREN","TJ_NCV",null,"R93",null,null,null,"Non Renewable Waste",{"$f":"VLOOKUP(D166, Param_Multilanguage!A:C, MATCH(LanguageChosen,Language[Language],0)+1, FALSE)","v":"Of which: Sports activities and amusement and recreation activities"},{"$f":"VLOOKUP(H166,LanguageData,MATCH(LanguageChosen,Language[Language],0),FALSE) & \" - \" & B166","v":"Non Renewable Waste - TJ_NCV"},2020]
["HYDROGEN","TJ_NCV",null,"R93",null,null,null,"Hydrogen",{"$f":"VLOOKUP(D167, Param_Multilanguage!A:C, MATCH(LanguageChosen,Language[Language],0)+1, FALSE)","v":"Of which: Sports activities and amusement and recreation activities"},{"$f":"VLOOKUP(H167,LanguageData,MATCH(LanguageChosen,Language[Language],0),FALSE) & \" - \" & B167","v":"Hydrogen - TJ_NCV"},2020]
["ELECTR","GWH",null,"U",null,null,null,"Electricity",{"$f":"VLOOKUP(D168, Param_Multilanguage!A:C, MATCH(LanguageChosen,Language[Language],0)+1, FALSE)","v":"Activities of extra-territorial organisations and bodies"},{"$f":"VLOOKUP(H168,LanguageData,MATCH(LanguageChosen,Language[Language],0),FALSE) & \" - \" & B168","v":"Electricity - GWH"},2020]
["NATGAS","TJ_GCV",null,"U",null,null,null,"Natural Gas",{"$f":"VLOOKUP(D169, Param_Multilanguage!A:C, MATCH(LanguageChosen,Language[Language],0)+1, FALSE)","v":"Activities of extra-territorial organisations and bodies"},{"$f":"VLOOKUP(H169,LanguageData,MATCH(LanguageChosen,Language[Language],0),FALSE) & \" - \" & B169","v":"Natural Gas - TJ_GCV"},2020]
["HEAT","TJ_NCV",null,"U",null,null,null,"Derived Heat",{"$f":"VLOOKUP(D170, Param_Multilanguage!A:C, MATCH(LanguageChosen,Language[Language],0)+1, FALSE)","v":"Activities of extra-territorial organisations and bodies"},{"$f":"VLOOKUP(H170,LanguageData,MATCH(LanguageChosen,Language[Language],0),FALSE) & \" - \" & B170","v":"Derived Heat - TJ_NCV"},2020]
["TOTALOIL","KT",null,"U",null,null,null,"Oil and Petroleum Products",{"$f":"VLOOKUP(D171, Param_Multilanguage!A:C, MATCH(LanguageChosen,Language[Language],0)+1, FALSE)","v":"Activities of extra-territorial organisations and bodies"},{"$f":"VLOOKUP(H171,LanguageData,MATCH(LanguageChosen,Language[Language],0),FALSE) & \" - \" & B171","v":"Oil and Petroleum Products - KT"},2020]
["REN","TJ_NCV",null,"U",null,null,null,"Renewable Energies",{"$f":"VLOOKUP(D172, Param_Multilanguage!A:C, MATCH(LanguageChosen,Language[Language],0)+1, FALSE)","v":"Activities of extra-territorial organisations and bodies"},{"$f":"VLOOKUP(H172,LanguageData,MATCH(LanguageChosen,Language[Language],0),FALSE) & \" - \" & B172","v":"Renewable Energies - TJ_NCV"},2020]
["COAL","KT",null,"U",null,null,null,"Solid Fossil Fuels",{"$f":"VLOOKUP(D173, Param_Multilanguage!A:C, MATCH(LanguageChosen,Language[Language],0)+1, FALSE)","v":"Activities of extra-territorial organisations and bodies"},{"$f":"VLOOKUP(H173,LanguageData,MATCH(LanguageChosen,Language[Language],0),FALSE) & \" - \" & B173","v":"Solid Fossil Fuels - KT"},2020]
["NONREN","TJ_NCV",null,"U",null,null,null,"Non Renewable Waste",{"$f":"VLOOKUP(D174, Param_Multilanguage!A:C, MATCH(LanguageChosen,Language[Language],0)+1, FALSE)","v":"Activities of extra-territorial organisations and bodies"},{"$f":"VLOOKUP(H174,LanguageData,MATCH(LanguageChosen,Language[Language],0),FALSE) & \" - \" & B174","v":"Non Renewable Waste - TJ_NCV"},2020]
["HYDROGEN","TJ_NCV",null,"U",null,null,null,"Hydrogen",{"$f":"VLOOKUP(D175, Param_Multilanguage!A:C, MATCH(LanguageChosen,Language[Language],0)+1, FALSE)","v":"Activities of extra-territorial organisations and bodies"},{"$f":"VLOOKUP(H175,LanguageData,MATCH(LanguageChosen,Language[Language],0),FALSE) & \" - \" & B175","v":"Hydrogen - TJ_NCV"},2020]
["ELECTR","GWH",null,"DATAC",null,null,null,"Electricity",{"$f":"VLOOKUP(D176, Param_Multilanguage!A:C, MATCH(LanguageChosen,Language[Language],0)+1, FALSE)","v":"Data centres"},{"$f":"VLOOKUP(H176,LanguageData,MATCH(LanguageChosen,Language[Language],0),FALSE) & \" - \" & B176","v":"Electricity - GWH"},2020]
["NATGAS","TJ_GCV",null,"DATAC",null,null,null,"Natural Gas",{"$f":"VLOOKUP(D177, Param_Multilanguage!A:C, MATCH(LanguageChosen,Language[Language],0)+1, FALSE)","v":"Data centres"},{"$f":"VLOOKUP(H177,LanguageData,MATCH(LanguageChosen,Language[Language],0),FALSE) & \" - \" & B177","v":"Natural Gas - TJ_GCV"},2020]
["HEAT","TJ_NCV",null,"DATAC",null,null,null,"Derived Heat",{"$f":"VLOOKUP(D178, Param_Multilanguage!A:C, MATCH(LanguageChosen,Language[Language],0)+1, FALSE)","v":"Data centres"},{"$f":"VLOOKUP(H178,LanguageData,MATCH(LanguageChosen,Language[Language],0),FALSE) & \" - \" & B178","v":"Derived Heat - TJ_NCV"},2020]
["TOTALOIL","KT",null,"DATAC",null,null,null,"Oil and Petroleum Products",{"$f":"VLOOKUP(D179, Param_Multilanguage!A:C, MATCH(LanguageChosen,Language[Language],0)+1, FALSE)","v":"Data centres"},{"$f":"VLOOKUP(H179,LanguageData,MATCH(LanguageChosen,Language[Language],0),FALSE) & \" - \" & B179","v":"Oil and Petroleum Products - KT"},2020]
["REN","TJ_NCV",null,"DATAC",null,null,null,"Renewable Energies",{"$f":"VLOOKUP(D180, Param_Multilanguage!A:C, MATCH(LanguageChosen,Language[Language],0)+1, FALSE)","v":"Data centres"},{"$f":"VLOOKUP(H180,LanguageData,MATCH(LanguageChosen,Language[Language],0),FALSE) & \" - \" & B180","v":"Renewable Energies - TJ_NCV"},2020]
["COAL","KT",null,"DATAC",null,null,null,"Solid Fossil Fuels",{"$f":"VLOOKUP(D181, Param_Multilanguage!A:C, MATCH(LanguageChosen,Language[Language],0)+1, FALSE)","v":"Data centres"},{"$f":"VLOOKUP(H181,LanguageData,MATCH(LanguageChosen,Language[Language],0),FALSE) & \" - \" & B181","v":"Solid Fossil Fuels - KT"},2020]
["NONREN","TJ_NCV",null,"DATAC",null,null,null,"Non Renewable Waste",{"$f":"VLOOKUP(D182, Param_Multilanguage!A:C, MATCH(LanguageChosen,Language[Language],0)+1, FALSE)","v":"Data centres"},{"$f":"VLOOKUP(H182,LanguageData,MATCH(LanguageChosen,Language[Language],0),FALSE) & \" - \" & B182","v":"Non Renewable Waste - TJ_NCV"},2020]
["HYDROGEN","TJ_NCV",null,"DATAC",null,null,null,"Hydrogen",{"$f":"VLOOKUP(D183, Param_Multilanguage!A:C, MATCH(LanguageChosen,Language[Language],0)+1, FALSE)","v":"Data centres"},{"$f":"VLOOKUP(H183,LanguageData,MATCH(LanguageChosen,Language[Language],0),FALSE) & \" - \" & B183","v":"Hydrogen - TJ_NCV"},2020]
["ELECTR","GWH",null,"TOTSER",null,null,null,"Electricity",{"$f":"VLOOKUP(D184, Param_Multilanguage!A:C, MATCH(LanguageChosen,Language[Language],0)+1, FALSE)","v":"Services total"},{"$f":"VLOOKUP(H184,LanguageData,MATCH(LanguageChosen,Language[Language],0),FALSE) & \" - \" & B184","v":"Electricity - GWH"},2020]
["NATGAS","TJ_GCV",null,"TOTSER",null,null,null,"Natural Gas",{"$f":"VLOOKUP(D185, Param_Multilanguage!A:C, MATCH(LanguageChosen,Language[Language],0)+1, FALSE)","v":"Services total"},{"$f":"VLOOKUP(H185,LanguageData,MATCH(LanguageChosen,Language[Language],0),FALSE) & \" - \" & B185","v":"Natural Gas - TJ_GCV"},2020]
["HEAT","TJ_NCV",null,"TOTSER",null,null,null,"Derived Heat",{"$f":"VLOOKUP(D186, Param_Multilanguage!A:C, MATCH(LanguageChosen,Language[Language],0)+1, FALSE)","v":"Services total"},{"$f":"VLOOKUP(H186,LanguageData,MATCH(LanguageChosen,Language[Language],0),FALSE) & \" - \" & B186","v":"Derived Heat - TJ_NCV"},2020]
["TOTALOIL","KT",null,"TOTSER",null,null,null,"Oil and Petroleum Products",{"$f":"VLOOKUP(D187, Param_Multilanguage!A:C, MATCH(LanguageChosen,Language[Language],0)+1, FALSE)","v":"Services total"},{"$f":"VLOOKUP(H187,LanguageData,MATCH(LanguageChosen,Language[Language],0),FALSE) & \" - \" & B187","v":"Oil and Petroleum Products - KT"},2020]
["REN","TJ_NCV",null,"TOTSER",null,null,null,"Renewable Energies",{"$f":"VLOOKUP(D188, Param_Multilanguage!A:C, MATCH(LanguageChosen,Language[Language],0)+1, FALSE)","v":"Services total"},{"$f":"VLOOKUP(H188,LanguageData,MATCH(LanguageChosen,Language[Language],0),FALSE) & \" - \" & B188","v":"Renewable Energies - TJ_NCV"},2020]
["COAL","KT",null,"TOTSER",null,null,null,"Solid Fossil Fuels",{"$f":"VLOOKUP(D189, Param_Multilanguage!A:C, MATCH(LanguageChosen,Language[Language],0)+1, FALSE)","v":"Services total"},{"$f":"VLOOKUP(H189,LanguageData,MATCH(LanguageChosen,Language[Language],0),FALSE) & \" - \" & B189","v":"Solid Fossil Fuels - KT"},2020]
["NONREN","TJ_NCV",null,"TOTSER",null,null,null,"Non Renewable Waste",{"$f":"VLOOKUP(D190, Param_Multilanguage!A:C, MATCH(LanguageChosen,Language[Language],0)+1, FALSE)","v":"Services total"},{"$f":"VLOOKUP(H190,LanguageData,MATCH(LanguageChosen,Language[Language],0),FALSE) & \" - \" & B190","v":"Non Renewable Waste - TJ_NCV"},2020]
["HYDROGEN","TJ_NCV",null,"TOTSER",null,null,null,"Hydrogen",{"$f":"VLOOKUP(D191, Param_Multilanguage!A:C, MATCH(LanguageChosen,Language[Language],0)+1, FALSE)","v":"Services total"},{"$f":"VLOOKUP(H191,LanguageData,MATCH(LanguageChosen,Language[Language],0),FALSE) & \" - \" & B191","v":"Hydrogen - TJ_NCV"},2020]
["ELECTR","GWH",null,"C33",null,null,null,"Electricity",{"$f":"VLOOKUP(D192, Param_Multilanguage!A:C, MATCH(LanguageChosen,Language[Language],0)+1, FALSE)","v":"Repair and installation of machinery and equipment"},{"$f":"VLOOKUP(H192,LanguageData,MATCH(LanguageChosen,Language[Language],0),FALSE) & \" - \" & B192","v":"Electricity - GWH"},2021]
["NATGAS","TJ_GCV",null,"C33",null,null,null,"Natural Gas",{"$f":"VLOOKUP(D193, Param_Multilanguage!A:C, MATCH(LanguageChosen,Language[Language],0)+1, FALSE)","v":"Repair and installation of machinery and equipment"},{"$f":"VLOOKUP(H193,LanguageData,MATCH(LanguageChosen,Language[Language],0),FALSE) & \" - \" & B193","v":"Natural Gas - TJ_GCV"},2021]
["HEAT","TJ_NCV",null,"C33",null,null,null,"Derived Heat",{"$f":"VLOOKUP(D194, Param_Multilanguage!A:C, MATCH(LanguageChosen,Language[Language],0)+1, FALSE)","v":"Repair and installation of machinery and equipment"},{"$f":"VLOOKUP(H194,LanguageData,MATCH(LanguageChosen,Language[Language],0),FALSE) & \" - \" & B194","v":"Derived Heat - TJ_NCV"},2021]
["TOTALOIL","KT",null,"C33",null,null,null,"Oil and Petroleum Products",{"$f":"VLOOKUP(D195, Param_Multilanguage!A:C, MATCH(LanguageChosen,Language[Language],0)+1, FALSE)","v":"Repair and installation of machinery and equipment"},{"$f":"VLOOKUP(H195,LanguageData,MATCH(LanguageChosen,Language[Language],0),FALSE) & \" - \" & B195","v":"Oil and Petroleum Products - KT"},2021]
["REN","TJ_NCV",null,"C33",null,null,null,"Renewable Energies",{"$f":"VLOOKUP(D196, Param_Multilanguage!A:C, MATCH(LanguageChosen,Language[Language],0)+1, FALSE)","v":"Repair and installation of machinery and equipment"},{"$f":"VLOOKUP(H196,LanguageData,MATCH(LanguageChosen,Language[Language],0),FALSE) & \" - \" & B196","v":"Renewable Energies - TJ_NCV"},2021]
["COAL","KT",null,"C33",null,null,null,"Solid Fossil Fuels",{"$f":"VLOOKUP(D197, Param_Multilanguage!A:C, MATCH(LanguageChosen,Language[Language],0)+1, FALSE)","v":"Repair and installation of machinery and equipment"},{"$f":"VLOOKUP(H197,LanguageData,MATCH(LanguageChosen,Language[Language],0),FALSE) & \" - \" & B197","v":"Solid Fossil Fuels - KT"},2021]
["NONREN","TJ_NCV",null,"C33",null,null,null,"Non Renewable Waste",{"$f":"VLOOKUP(D198, Param_Multilanguage!A:C, MATCH(LanguageChosen,Language[Language],0)+1, FALSE)","v":"Repair and installation of machinery and equipment"},{"$f":"VLOOKUP(H198,LanguageData,MATCH(LanguageChosen,Language[Language],0),FALSE) & \" - \" & B198","v":"Non Renewable Waste - TJ_NCV"},2021]
["HYDROGEN","TJ_NCV",null,"C33",null,null,null,"Hydrogen",{"$f":"VLOOKUP(D199, Param_Multilanguage!A:C, MATCH(LanguageChosen,Language[Language],0)+1, FALSE)","v":"Repair and installation of machinery and equipment"},{"$f":"VLOOKUP(H199,LanguageData,MATCH(LanguageChosen,Language[Language],0),FALSE) & \" - \" & B199","v":"Hydrogen - TJ_NCV"},2021]
["ELECTR","GWH",null,"E",null,null,null,"Electricity",{"$f":"VLOOKUP(D200, Param_Multilanguage!A:C, MATCH(LanguageChosen,Language[Language],0)+1, FALSE)","v":"Water supply; sewerage, waste management and remediation activities"},{"$f":"VLOOKUP(H200,LanguageData,MATCH(LanguageChosen,Language[Language],0),FALSE) & \" - \" & B200","v":"Electricity - GWH"},2021]
["NATGAS","TJ_GCV",null,"E",null,null,null,"Natural Gas",{"$f":"VLOOKUP(D201, Param_Multilanguage!A:C, MATCH(LanguageChosen,Language[Language],0)+1, FALSE)","v":"Water supply; sewerage, waste management and remediation activities"},{"$f":"VLOOKUP(H201,LanguageData,MATCH(LanguageChosen,Language[Language],0),FALSE) & \" - \" & B201","v":"Natural Gas - TJ_GCV"},2021]
["HEAT","TJ_NCV",null,"E",null,null,null,"Derived Heat",{"$f":"VLOOKUP(D202, Param_Multilanguage!A:C, MATCH(LanguageChosen,Language[Language],0)+1, FALSE)","v":"Water supply; sewerage, waste management and remediation activities"},{"$f":"VLOOKUP(H202,LanguageData,MATCH(LanguageChosen,Language[Language],0),FALSE) & \" - \" & B202","v":"Derived Heat - TJ_NCV"},2021]
["TOTALOIL","KT",null,"E",null,null,null,"Oil and Petroleum Products",{"$f":"VLOOKUP(D203, Param_Multilanguage!A:C, MATCH(LanguageChosen,Language[Language],0)+1, FALSE)","v":"Water supply; sewerage, waste management and remediation activities"},{"$f":"VLOOKUP(H203,LanguageData,MATCH(LanguageChosen,Language[Language],0),FALSE) & \" - \" & B203","v":"Oil and Petroleum Products - KT"},2021]
["REN","TJ_NCV",null,"E",null,null,null,"Renewable Energies",{"$f":"VLOOKUP(D204, Param_Multilanguage!A:C, MATCH(LanguageChosen,Language[Language],0)+1, FALSE)","v":"Water supply; sewerage, waste management and remediation activities"},{"$f":"VLOOKUP(H204,LanguageData,MATCH(LanguageChosen,Language[Language],0),FALSE) & \" - \" & B204","v":"Renewable Energies - TJ_NCV"},2021]
["COAL","KT",null,"E",null,null,null,"Solid Fossil Fuels",{"$f":"VLOOKUP(D205, Param_Multilanguage!A:C, MATCH(LanguageChosen,Language[Language],0)+1, FALSE)","v":"Water supply; sewerage, waste management and remediation activities"},{"$f":"VLOOKUP(H205,LanguageData,MATCH(LanguageChosen,Language[Language],0),FALSE) & \" - \" & B205","v":"Solid Fossil Fuels - KT"},2021]
["NONREN","TJ_NCV",null,"E",null,null,null,"Non Renewable Waste",{"$f":"VLOOKUP(D206, Param_Multilanguage!A:C, MATCH(LanguageChosen,Language[Language],0)+1, FALSE)","v":"Water supply; sewerage, waste management and remediation activities"},{"$f":"VLOOKUP(H206,LanguageData,MATCH(LanguageChosen,Language[Language],0),FALSE) & \" - \" & B206","v":"Non Renewable Waste - TJ_NCV"},2021]
["HYDROGEN","TJ_NCV",null,"E",null,null,null,"Hydrogen",{"$f":"VLOOKUP(D207, Param_Multilanguage!A:C, MATCH(LanguageChosen,Language[Language],0)+1, FALSE)","v":"Water supply; sewerage, waste management and remediation activities"},{"$f":"VLOOKUP(H207,LanguageData,MATCH(LanguageChosen,Language[Language],0),FALSE) & \" - \" & B207","v":"Hydrogen - TJ_NCV"},2021]
["ELECTR","GWH",null,"G",null,null,null,"Electricity",{"$f":"VLOOKUP(D208, Param_Multilanguage!A:C, MATCH(LanguageChosen,Language[Language],0)+1, FALSE)","v":"Wholesale and retail trade; repair of motor vehicles and motorcycles"},{"$f":"VLOOKUP(H208,LanguageData,MATCH(LanguageChosen,Language[Language],0),FALSE) & \" - \" & B208","v":"Electricity - GWH"},2021]
["NATGAS","TJ_GCV",null,"G",null,null,null,"Natural Gas",{"$f":"VLOOKUP(D209, Param_Multilanguage!A:C, MATCH(LanguageChosen,Language[Language],0)+1, FALSE)","v":"Wholesale and retail trade; repair of motor vehicles and motorcycles"},{"$f":"VLOOKUP(H209,LanguageData,MATCH(LanguageChosen,Language[Language],0),FALSE) & \" - \" & B209","v":"Natural Gas - TJ_GCV"},2021]
["HEAT","TJ_NCV",null,"G",null,null,null,"Derived Heat",{"$f":"VLOOKUP(D210, Param_Multilanguage!A:C, MATCH(LanguageChosen,Language[Language],0)+1, FALSE)","v":"Wholesale and retail trade; repair of motor vehicles and motorcycles"},{"$f":"VLOOKUP(H210,LanguageData,MATCH(LanguageChosen,Language[Language],0),FALSE) & \" - \" & B210","v":"Derived Heat - TJ_NCV"},2021]
["TOTALOIL","KT",null,"G",null,null,null,"Oil and Petroleum Products",{"$f":"VLOOKUP(D211, Param_Multilanguage!A:C, MATCH(LanguageChosen,Language[Language],0)+1, FALSE)","v":"Wholesale and retail trade; repair of motor vehicles and motorcycles"},{"$f":"VLOOKUP(H211,LanguageData,MATCH(LanguageChosen,Language[Language],0),FALSE) & \" - \" & B211","v":"Oil and Petroleum Products - KT"},2021]
["REN","TJ_NCV",null,"G",null,null,null,"Renewable Energies",{"$f":"VLOOKUP(D212, Param_Multilanguage!A:C, MATCH(LanguageChosen,Language[Language],0)+1, FALSE)","v":"Wholesale and retail trade; repair of motor vehicles and motorcycles"},{"$f":"VLOOKUP(H212,LanguageData,MATCH(LanguageChosen,Language[Language],0),FALSE) & \" - \" & B212","v":"Renewable Energies - TJ_NCV"},2021]
["COAL","KT",null,"G",null,null,null,"Solid Fossil Fuels",{"$f":"VLOOKUP(D213, Param_Multilanguage!A:C, MATCH(LanguageChosen,Language[Language],0)+1, FALSE)","v":"Wholesale and retail trade; repair of motor vehicles and motorcycles"},{"$f":"VLOOKUP(H213,LanguageData,MATCH(LanguageChosen,Language[Language],0),FALSE) & \" - \" & B213","v":"Solid Fossil Fuels - KT"},2021]
["NONREN","TJ_NCV",null,"G",null,null,null,"Non Renewable Waste",{"$f":"VLOOKUP(D214, Param_Multilanguage!A:C, MATCH(LanguageChosen,Language[Language],0)+1, FALSE)","v":"Wholesale and retail trade; repair of motor vehicles and motorcycles"},{"$f":"VLOOKUP(H214,LanguageData,MATCH(LanguageChosen,Language[Language],0),FALSE) & \" - \" & B214","v":"Non Renewable Waste - TJ_NCV"},2021]
["HYDROGEN","TJ_NCV",null,"G",null,null,null,"Hydrogen",{"$f":"VLOOKUP(D215, Param_Multilanguage!A:C, MATCH(LanguageChosen,Language[Language],0)+1, FALSE)","v":"Wholesale and retail trade; repair of motor vehicles and motorcycles"},{"$f":"VLOOKUP(H215,LanguageData,MATCH(LanguageChosen,Language[Language],0),FALSE) & \" - \" & B215","v":"Hydrogen - TJ_NCV"},2021]
["ELECTR","GWH",null,"G46",null,null,null,"Electricity",{"$f":"VLOOKUP(D216, Param_Multilanguage!A:C, MATCH(LanguageChosen,Language[Language],0)+1, FALSE)","v":"Wholesale trade, except of motor vehicles and motorcycles"},{"$f":"VLOOKUP(H216,LanguageData,MATCH(LanguageChosen,Language[Language],0),FALSE) & \" - \" & B216","v":"Electricity - GWH"},2021]
["NATGAS","TJ_GCV",null,"G46",null,null,null,"Natural Gas",{"$f":"VLOOKUP(D217, Param_Multilanguage!A:C, MATCH(LanguageChosen,Language[Language],0)+1, FALSE)","v":"Wholesale trade, except of motor vehicles and motorcycles"},{"$f":"VLOOKUP(H217,LanguageData,MATCH(LanguageChosen,Language[Language],0),FALSE) & \" - \" & B217","v":"Natural Gas - TJ_GCV"},2021]
["HEAT","TJ_NCV",null,"G46",null,null,null,"Derived Heat",{"$f":"VLOOKUP(D218, Param_Multilanguage!A:C, MATCH(LanguageChosen,Language[Language],0)+1, FALSE)","v":"Wholesale trade, except of motor vehicles and motorcycles"},{"$f":"VLOOKUP(H218,LanguageData,MATCH(LanguageChosen,Language[Language],0),FALSE) & \" - \" & B218","v":"Derived Heat - TJ_NCV"},2021]
["TOTALOIL","KT",null,"G46",null,null,null,"Oil and Petroleum Products",{"$f":"VLOOKUP(D219, Param_Multilanguage!A:C, MATCH(LanguageChosen,Language[Language],0)+1, FALSE)","v":"Wholesale trade, except of motor vehicles and motorcycles"},{"$f":"VLOOKUP(H219,LanguageData,MATCH(LanguageChosen,Language[Language],0),FALSE) & \" - \" & B219","v":"Oil and Petroleum Products - KT"},2021]
["REN","TJ_NCV",null,"G46",null,null,null,"Renewable Energies",{"$f":"VLOOKUP(D220, Param_Multilanguage!A:C, MATCH(LanguageChosen,Language[Language],0)+1, FALSE)","v":"Wholesale trade, except of motor vehicles and motorcycles"},{"$f":"VLOOKUP(H220,LanguageData,MATCH(LanguageChosen,Language[Language],0),FALSE) & \" - \" & B220","v":"Renewable Energies - TJ_NCV"},2021]
["COAL","KT",null,"G46",null,null,null,"Solid Fossil Fuels",{"$f":"VLOOKUP(D221, Param_Multilanguage!A:C, MATCH(LanguageChosen,Language[Language],0)+1, FALSE)","v":"Wholesale trade, except of motor vehicles and motorcycles"},{"$f":"VLOOKUP(H221,LanguageData,MATCH(LanguageChosen,Language[Language],0),FALSE) & \" - \" & B221","v":"Solid Fossil Fuels - KT"},2021]
["NONREN","TJ_NCV",null,"G46",null,null,null,"Non Renewable Waste",{"$f":"VLOOKUP(D222, Param_Multilanguage!A:C, MATCH(LanguageChosen,Language[Language],0)+1, FALSE)","v":"Wholesale trade, except of motor vehicles and motorcycles"},{"$f":"VLOOKUP(H222,LanguageData,MATCH(LanguageChosen,Language[Language],0),FALSE) & \" - \" & B222","v":"Non Renewable Waste - TJ_NCV"},2021]
["HYDROGEN","TJ_NCV",null,"G46",null,null,null,"Hydrogen",{"$f":"VLOOKUP(D223, Param_Multilanguage!A:C, MATCH(LanguageChosen,Language[Language],0)+1, FALSE)","v":"Wholesale trade, except of motor vehicles and motorcycles"},{"$f":"VLOOKUP(H223,LanguageData,MATCH(LanguageChosen,Language[Language],0),FALSE) & \" - \" & B223","v":"Hydrogen - TJ_NCV"},2021]
["ELECTR","GWH",null,"G47",null,null,null,"Electricity",{"$f":"VLOOKUP(D224, Param_Multilanguage!A:C, MATCH(LanguageChosen,Language[Language],0)+1, FALSE)","v":"Retail trade, except of motor vehicles and motorcycles"},{"$f":"VLOOKUP(H224,LanguageData,MATCH(LanguageChosen,Language[Language],0),FALSE) & \" - \" & B224","v":"Electricity - GWH"},2021]
["NATGAS","TJ_GCV",null,"G47",null,null,null,"Natural Gas",{"$f":"VLOOKUP(D225, Param_Multilanguage!A:C, MATCH(LanguageChosen,Language[Language],0)+1, FALSE)","v":"Retail trade, except of motor vehicles and motorcycles"},{"$f":"VLOOKUP(H225,LanguageData,MATCH(LanguageChosen,Language[Language],0),FALSE) & \" - \" & B225","v":"Natural Gas - TJ_GCV"},2021]
["HEAT","TJ_NCV",null,"G47",null,null,null,"Derived Heat",{"$f":"VLOOKUP(D226, Param_Multilanguage!A:C, MATCH(LanguageChosen,Language[Language],0)+1, FALSE)","v":"Retail trade, except of motor vehicles and motorcycles"},{"$f":"VLOOKUP(H226,LanguageData,MATCH(LanguageChosen,Language[Language],0),FALSE) & \" - \" & B226","v":"Derived Heat - TJ_NCV"},2021]
["TOTALOIL","KT",null,"G47",null,null,null,"Oil and Petroleum Products",{"$f":"VLOOKUP(D227, Param_Multilanguage!A:C, MATCH(LanguageChosen,Language[Language],0)+1, FALSE)","v":"Retail trade, except of motor vehicles and motorcycles"},{"$f":"VLOOKUP(H227,LanguageData,MATCH(LanguageChosen,Language[Language],0),FALSE) & \" - \" & B227","v":"Oil and Petroleum Products - KT"},2021]
["REN","TJ_NCV",null,"G47",null,null,null,"Renewable Energies",{"$f":"VLOOKUP(D228, Param_Multilanguage!A:C, MATCH(LanguageChosen,Language[Language],0)+1, FALSE)","v":"Retail trade, except of motor vehicles and motorcycles"},{"$f":"VLOOKUP(H228,LanguageData,MATCH(LanguageChosen,Language[Language],0),FALSE) & \" - \" & B228","v":"Renewable Energies - TJ_NCV"},2021]
["COAL","KT",null,"G47",null,null,null,"Solid Fossil Fuels",{"$f":"VLOOKUP(D229, Param_Multilanguage!A:C, MATCH(LanguageChosen,Language[Language],0)+1, FALSE)","v":"Retail trade, except of motor vehicles and motorcycles"},{"$f":"VLOOKUP(H229,LanguageData,MATCH(LanguageChosen,Language[Language],0),FALSE) & \" - \" & B229","v":"Solid Fossil Fuels - KT"},2021]
["NONREN","TJ_NCV",null,"G47",null,null,null,"Non Renewable Waste",{"$f":"VLOOKUP(D230, Param_Multilanguage!A:C, MATCH(LanguageChosen,Language[Language],0)+1, FALSE)","v":"Retail trade, except of motor vehicles and motorcycles"},{"$f":"VLOOKUP(H230,LanguageData,MATCH(LanguageChosen,Language[Language],0),FALSE) & \" - \" & B230","v":"Non Renewable Waste - TJ_NCV"},2021]
["HYDROGEN","TJ_NCV",null,"G47",null,null,null,"Hydrogen",{"$f":"VLOOKUP(D231, Param_Multilanguage!A:C, MATCH(LanguageChosen,Language[Language],0)+1, FALSE)","v":"Retail trade, except of motor vehicles and motorcycles"},{"$f":"VLOOKUP(H231,LanguageData,MATCH(LanguageChosen,Language[Language],0),FALSE) & \" - \" & B231","v":"Hydrogen - TJ_NCV"},2021]
["ELECTR","GWH",null,"H52",null,null,null,"Electricity",{"$f":"VLOOKUP(D232, Param_Multilanguage!A:C, MATCH(LanguageChosen,Language[Language],0)+1, FALSE)","v":"Warehousing and support activities for transportation"},{"$f":"VLOOKUP(H232,LanguageData,MATCH(LanguageChosen,Language[Language],0),FALSE) & \" - \" & B232","v":"Electricity - GWH"},2021]
["NATGAS","TJ_GCV",null,"H52",null,null,null,"Natural Gas",{"$f":"VLOOKUP(D233, Param_Multilanguage!A:C, MATCH(LanguageChosen,Language[Language],0)+1, FALSE)","v":"Warehousing and support activities for transportation"},{"$f":"VLOOKUP(H233,LanguageData,MATCH(LanguageChosen,Language[Language],0),FALSE) & \" - \" & B233","v":"Natural Gas - TJ_GCV"},2021]
["HEAT","TJ_NCV",null,"H52",null,null,null,"Derived Heat",{"$f":"VLOOKUP(D234, Param_Multilanguage!A:C, MATCH(LanguageChosen,Language[Language],0)+1, FALSE)","v":"Warehousing and support activities for transportation"},{"$f":"VLOOKUP(H234,LanguageData,MATCH(LanguageChosen,Language[Language],0),FALSE) & \" - \" & B234","v":"Derived Heat - TJ_NCV"},2021]
["TOTALOIL","KT",null,"H52",null,null,null,"Oil and Petroleum Products",{"$f":"VLOOKUP(D235, Param_Multilanguage!A:C, MATCH(LanguageChosen,Language[Language],0)+1, FALSE)","v":"Warehousing and support activities for transportation"},{"$f":"VLOOKUP(H235,LanguageData,MATCH(LanguageChosen,Language[Language],0),FALSE) & \" - \" & B235","v":"Oil and Petroleum Products - KT"},2021]
["REN","TJ_NCV",null,"H52",null,null,null,"Renewable Energies",{"$f":"VLOOKUP(D236, Param_Multilanguage!A:C, MATCH(LanguageChosen,Language[Language],0)+1, FALSE)","v":"Warehousing and support activities for transportation"},{"$f":"VLOOKUP(H236,LanguageData,MATCH(LanguageChosen,Language[Language],0),FALSE) & \" - \" & B236","v":"Renewable Energies - TJ_NCV"},2021]
["COAL","KT",null,"H52",null,null,null,"Solid Fossil Fuels",{"$f":"VLOOKUP(D237, Param_Multilanguage!A:C, MATCH(LanguageChosen,Language[Language],0)+1, FALSE)","v":"Warehousing and support activities for transportation"},{"$f":"VLOOKUP(H237,LanguageData,MATCH(LanguageChosen,Language[Language],0),FALSE) & \" - \" & B237","v":"Solid Fossil Fuels - KT"},2021]
["NONREN","TJ_NCV",null,"H52",null,null,null,"Non Renewable Waste",{"$f":"VLOOKUP(D238, Param_Multilanguage!A:C, MATCH(LanguageChosen,Language[Language],0)+1, FALSE)","v":"Warehousing and support activities for transportation"},{"$f":"VLOOKUP(H238,LanguageData,MATCH(LanguageChosen,Language[Language],0),FALSE) & \" - \" & B238","v":"Non Renewable Waste - TJ_NCV"},2021]
["HYDROGEN","TJ_NCV",null,"H52",null,null,null,"Hydrogen",{"$f":"VLOOKUP(D239, Param_Multilanguage!A:C, MATCH(LanguageChosen,Language[Language],0)+1, FALSE)","v":"Warehousing and support activities for transportation"},{"$f":"VLOOKUP(H239,LanguageData,MATCH(LanguageChosen,Language[Language],0),FALSE) & \" - \" & B239","v":"Hydrogen - TJ_NCV"},2021]
["ELECTR","GWH",null,"H53",null,null,null,"Electricity",{"$f":"VLOOKUP(D240, Param_Multilanguage!A:C, MATCH(LanguageChosen,Language[Language],0)+1, FALSE)","v":"Postal and courier activities"},{"$f":"VLOOKUP(H240,LanguageData,MATCH(LanguageChosen,Language[Language],0),FALSE) & \" - \" & B240","v":"Electricity - GWH"},2021]
["NATGAS","TJ_GCV",null,"H53",null,null,null,"Natural Gas",{"$f":"VLOOKUP(D241, Param_Multilanguage!A:C, MATCH(LanguageChosen,Language[Language],0)+1, FALSE)","v":"Postal and courier activities"},{"$f":"VLOOKUP(H241,LanguageData,MATCH(LanguageChosen,Language[Language],0),FALSE) & \" - \" & B241","v":"Natural Gas - TJ_GCV"},2021]
["HEAT","TJ_NCV",null,"H53",null,null,null,"Derived Heat",{"$f":"VLOOKUP(D242, Param_Multilanguage!A:C, MATCH(LanguageChosen,Language[Language],0)+1, FALSE)","v":"Postal and courier activities"},{"$f":"VLOOKUP(H242,LanguageData,MATCH(LanguageChosen,Language[Language],0),FALSE) & \" - \" & B242","v":"Derived Heat - TJ_NCV"},2021]
["TOTALOIL","KT",null,"H53",null,null,null,"Oil and Petroleum Products",{"$f":"VLOOKUP(D243, Param_Multilanguage!A:C, MATCH(LanguageChosen,Language[Language],0)+1, FALSE)","v":"Postal and courier activities"},{"$f":"VLOOKUP(H243,LanguageData,MATCH(LanguageChosen,Language[Language],0),FALSE) & \" - \" & B243","v":"Oil and Petroleum Products - KT"},2021]
["REN","TJ_NCV",null,"H53",null,null,null,"Renewable Energies",{"$f":"VLOOKUP(D244, Param_Multilanguage!A:C, MATCH(LanguageChosen,Language[Language],0)+1, FALSE)","v":"Postal and courier activities"},{"$f":"VLOOKUP(H244,LanguageData,MATCH(LanguageChosen,Language[Language],0),FALSE) & \" - \" & B244","v":"Renewable Energies - TJ_NCV"},2021]
["COAL","KT",null,"H53",null,null,null,"Solid Fossil Fuels",{"$f":"VLOOKUP(D245, Param_Multilanguage!A:C, MATCH(LanguageChosen,Language[Language],0)+1, FALSE)","v":"Postal and courier activities"},{"$f":"VLOOKUP(H245,LanguageData,MATCH(LanguageChosen,Language[Language],0),FALSE) & \" - \" & B245","v":"Solid Fossil Fuels - KT"},2021]
["NONREN","TJ_NCV",null,"H53",null,null,null,"Non Renewable Waste",{"$f":"VLOOKUP(D246, Param_Multilanguage!A:C, MATCH(LanguageChosen,Language[Language],0)+1, FALSE)","v":"Postal and courier activities"},{"$f":"VLOOKUP(H246,LanguageData,MATCH(LanguageChosen,Language[Language],0),FALSE) & \" - \" & B246","v":"Non Renewable Waste - TJ_NCV"},2021]
["HYDROGEN","TJ_NCV",null,"H53",null,null,null,"Hydrogen",{"$f":"VLOOKUP(D247, Param_Multilanguage!A:C, MATCH(LanguageChosen,Language[Language],0)+1, FALSE)","v":"Postal and courier activities"},{"$f":"VLOOKUP(H247,LanguageData,MATCH(LanguageChosen,Language[Language],0),FALSE) & \" - \" & B247","v":"Hydrogen - TJ_NCV"},2021]
["ELECTR","GWH",null,"I",null,null,null,"Electricity",{"$f":"VLOOKUP(D248, Param_Multilanguage!A:C, MATCH(LanguageChosen,Language[Language],0)+1, FALSE)","v":"Accommodation and food services activities"},{"$f":"VLOOKUP(H248,LanguageData,MATCH(LanguageChosen,Language[Language],0),FALSE) & \" - \" & B248","v":"Electricity - GWH"},2021]
["NATGAS","TJ_GCV",null,"I",null,null,null,"Natural Gas",{"$f":"VLOOKUP(D249, Param_Multilanguage!A:C, MATCH(LanguageChosen,Language[Language],0)+1, FALSE)","v":"Accommodation and food services activities"},{"$f":"VLOOKUP(H249,LanguageData,MATCH(LanguageChosen,Language[Language],0),FALSE) & \" - \" & B249","v":"Natural Gas - TJ_GCV"},2021]
["HEAT","TJ_NCV",null,"I",null,null,null,"Derived Heat",{"$f":"VLOOKUP(D250, Param_Multilanguage!A:C, MATCH(LanguageChosen,Language[Language],0)+1, FALSE)","v":"Accommodation and food services activities"},{"$f":"VLOOKUP(H250,LanguageData,MATCH(LanguageChosen,Language[Language],0),FALSE) & \" - \" & B250","v":"Derived Heat - TJ_NCV"},2021]
["TOTALOIL","KT",null,"I",null,null,null,"Oil and Petroleum Products",{"$f":"VLOOKUP(D251, Param_Multilanguage!A:C, MATCH(LanguageChosen,Language[Language],0)+1, FALSE)","v":"Accommodation and food services activities"},{"$f":"VLOOKUP(H251,LanguageData,MATCH(LanguageChosen,Language[Language],0),FALSE) & \" - \" & B251","v":"Oil and Petroleum Products - KT"},2021]
["REN","TJ_NCV",null,"I",null,null,null,"Renewable Energies",{"$f":"VLOOKUP(D252, Param_Multilanguage!A:C, MATCH(LanguageChosen,Language[Language],0)+1, FALSE)","v":"Accommodation and food services activities"},{"$f":"VLOOKUP(H252,LanguageData,MATCH(LanguageChosen,Language[Language],0),FALSE) & \" - \" & B252","v":"Renewable Energies - TJ_NCV"},2021]
["COAL","KT",null,"I",null,null,null,"Solid Fossil Fuels",{"$f":"VLOOKUP(D253, Param_Multilanguage!A:C, MATCH(LanguageChosen,Language[Language],0)+1, FALSE)","v":"Accommodation and food services activities"},{"$f":"VLOOKUP(H253,LanguageData,MATCH(LanguageChosen,Language[Language],0),FALSE) & \" - \" & B253","v":"Solid Fossil Fuels - KT"},2021]
["NONREN","TJ_NCV",null,"I",null,null,null,"Non Renewable Waste",{"$f":"VLOOKUP(D254, Param_Multilanguage!A:C, MATCH(LanguageChosen,Language[Language],0)+1, FALSE)","v":"Accommodation and food services activities"},{"$f":"VLOOKUP(H254,LanguageData,MATCH(LanguageChosen,Language[Language],0),FALSE) & \" - \" & B254","v":"Non Renewable Waste - TJ_NCV"},2021]
["HYDROGEN","TJ_NCV",null,"I",null,null,null,"Hydrogen",{"$f":"VLOOKUP(D255, Param_Multilanguage!A:C, MATCH(LanguageChosen,Language[Language],0)+1, FALSE)","v":"Accommodation and food services activities"},{"$f":"VLOOKUP(H255,LanguageData,MATCH(LanguageChosen,Language[Language],0),FALSE) & \" - \" & B255","v":"Hydrogen - TJ_NCV"},2021]
["ELECTR","GWH",null,"I55",null,null,null,"Electricity",{"$f":"VLOOKUP(D256, Param_Multilanguage!A:C, MATCH(LanguageChosen,Language[Language],0)+1, FALSE)","v":"Accommodation"},{"$f":"VLOOKUP(H256,LanguageData,MATCH(LanguageChosen,Language[Language],0),FALSE) & \" - \" & B256","v":"Electricity - GWH"},2021]
["NATGAS","TJ_GCV",null,"I55",null,null,null,"Natural Gas",{"$f":"VLOOKUP(D257, Param_Multilanguage!A:C, MATCH(LanguageChosen,Language[Language],0)+1, FALSE)","v":"Accommodation"},{"$f":"VLOOKUP(H257,LanguageData,MATCH(LanguageChosen,Language[Language],0),FALSE) & \" - \" & B257","v":"Natural Gas - TJ_GCV"},2021]
["HEAT","TJ_NCV",null,"I55",null,null,null,"Derived Heat",{"$f":"VLOOKUP(D258, Param_Multilanguage!A:C, MATCH(LanguageChosen,Language[Language],0)+1, FALSE)","v":"Accommodation"},{"$f":"VLOOKUP(H258,LanguageData,MATCH(LanguageChosen,Language[Language],0),FALSE) & \" - \" & B258","v":"Derived Heat - TJ_NCV"},2021]
["TOTALOIL","KT",null,"I55",null,null,null,"Oil and Petroleum Products",{"$f":"VLOOKUP(D259, Param_Multilanguage!A:C, MATCH(LanguageChosen,Language[Language],0)+1, FALSE)","v":"Accommodation"},{"$f":"VLOOKUP(H259,LanguageData,MATCH(LanguageChosen,Language[Language],0),FALSE) & \" - \" & B259","v":"Oil and Petroleum Products - KT"},2021]
["REN","TJ_NCV",null,"I55",null,null,null,"Renewable Energies",{"$f":"VLOOKUP(D260, Param_Multilanguage!A:C, MATCH(LanguageChosen,Language[Language],0)+1, FALSE)","v":"Accommodation"},{"$f":"VLOOKUP(H260,LanguageData,MATCH(LanguageChosen,Language[Language],0),FALSE) & \" - \" & B260","v":"Renewable Energies - TJ_NCV"},2021]
["COAL","KT",null,"I55",null,null,null,"Solid Fossil Fuels",{"$f":"VLOOKUP(D261, Param_Multilanguage!A:C, MATCH(LanguageChosen,Language[Language],0)+1, FALSE)","v":"Accommodation"},{"$f":"VLOOKUP(H261,LanguageData,MATCH(LanguageChosen,Language[Language],0),FALSE) & \" - \" & B261","v":"Solid Fossil Fuels - KT"},2021]
["NONREN","TJ_NCV",null,"I55",null,null,null,"Non Renewable Waste",{"$f":"VLOOKUP(D262, Param_Multilanguage!A:C, MATCH(LanguageChosen,Language[Language],0)+1, FALSE)","v":"Accommodation"},{"$f":"VLOOKUP(H262,LanguageData,MATCH(LanguageChosen,Language[Language],0),FALSE) & \" - \" & B262","v":"Non Renewable Waste - TJ_NCV"},2021]
["HYDROGEN","TJ_NCV",null,"I55",null,null,null,"Hydrogen",{"$f":"VLOOKUP(D263, Param_Multilanguage!A:C, MATCH(LanguageChosen,Language[Language],0)+1, FALSE)","v":"Accommodation"},{"$f":"VLOOKUP(H263,LanguageData,MATCH(LanguageChosen,Language[Language],0),FALSE) & \" - \" & B263","v":"Hydrogen - TJ_NCV"},2021]
["ELECTR","GWH",null,"I56",null,null,null,"Electricity",{"$f":"VLOOKUP(D264, Param_Multilanguage!A:C, MATCH(LanguageChosen,Language[Language],0)+1, FALSE)","v":"Food and beverage services activities"},{"$f":"VLOOKUP(H264,LanguageData,MATCH(LanguageChosen,Language[Language],0),FALSE) & \" - \" & B264","v":"Electricity - GWH"},2021]
["NATGAS","TJ_GCV",null,"I56",null,null,null,"Natural Gas",{"$f":"VLOOKUP(D265, Param_Multilanguage!A:C, MATCH(LanguageChosen,Language[Language],0)+1, FALSE)","v":"Food and beverage services activities"},{"$f":"VLOOKUP(H265,LanguageData,MATCH(LanguageChosen,Language[Language],0),FALSE) & \" - \" & B265","v":"Natural Gas - TJ_GCV"},2021]
["HEAT","TJ_NCV",null,"I56",null,null,null,"Derived Heat",{"$f":"VLOOKUP(D266, Param_Multilanguage!A:C, MATCH(LanguageChosen,Language[Language],0)+1, FALSE)","v":"Food and beverage services activities"},{"$f":"VLOOKUP(H266,LanguageData,MATCH(LanguageChosen,Language[Language],0),FALSE) & \" - \" & B266","v":"Derived Heat - TJ_NCV"},2021]
["TOTALOIL","KT",null,"I56",null,null,null,"Oil and Petroleum Products",{"$f":"VLOOKUP(D267, Param_Multilanguage!A:C, MATCH(LanguageChosen,Language[Language],0)+1, FALSE)","v":"Food and beverage services activities"},{"$f":"VLOOKUP(H267,LanguageData,MATCH(LanguageChosen,Language[Language],0),FALSE) & \" - \" & B267","v":"Oil and Petroleum Products - KT"},2021]
["REN","TJ_NCV",null,"I56",null,null,null,"Renewable Energies",{"$f":"VLOOKUP(D268, Param_Multilanguage!A:C, MATCH(LanguageChosen,Language[Language],0)+1, FALSE)","v":"Food and beverage services activities"},{"$f":"VLOOKUP(H268,LanguageData,MATCH(LanguageChosen,Language[Language],0),FALSE) & \" - \" & B268","v":"Renewable Energies - TJ_NCV"},2021]
["COAL","KT",null,"I56",null,null,null,"Solid Fossil Fuels",{"$f":"VLOOKUP(D269, Param_Multilanguage!A:C, MATCH(LanguageChosen,Language[Language],0)+1, FALSE)","v":"Food and beverage services activities"},{"$f":"VLOOKUP(H269,LanguageData,MATCH(LanguageChosen,Language[Language],0),FALSE) & \" - \" & B269","v":"Solid Fossil Fuels - KT"},2021]
["NONREN","TJ_NCV",null,"I56",null,null,null,"Non Renewable Waste",{"$f":"VLOOKUP(D270, Param_Multilanguage!A:C, MATCH(LanguageChosen,Language[Language],0)+1, FALSE)","v":"Food and beverage services activities"},{"$f":"VLOOKUP(H270,LanguageData,MATCH(LanguageChosen,Language[Language],0),FALSE) & \" - \" & B270","v":"Non Renewable Waste - TJ_NCV"},2021]
["HYDROGEN","TJ_NCV",null,"I56",null,null,null,"Hydrogen",{"$f":"VLOOKUP(D271, Param_Multilanguage!A:C, MATCH(LanguageChosen,Language[Language],0)+1, FALSE)","v":"Food and beverage services activities"},{"$f":"VLOOKUP(H271,LanguageData,MATCH(LanguageChosen,Language[Language],0),FALSE) & \" - \" & B271","v":"Hydrogen - TJ_NCV"},2021]
["ELECTR","GWH",null,"J",null,null,null,"Electricity",{"$f":"VLOOKUP(D272, Param_Multilanguage!A:C, MATCH(LanguageChosen,Language[Language],0)+1, FALSE)","v":"Information and communication"},{"$f":"VLOOKUP(H272,LanguageData,MATCH(LanguageChosen,Language[Language],0),FALSE) & \" - \" & B272","v":"Electricity - GWH"},2021]
["NATGAS","TJ_GCV",null,"J",null,null,null,"Natural Gas",{"$f":"VLOOKUP(D273, Param_Multilanguage!A:C, MATCH(LanguageChosen,Language[Language],0)+1, FALSE)","v":"Information and communication"},{"$f":"VLOOKUP(H273,LanguageData,MATCH(LanguageChosen,Language[Language],0),FALSE) & \" - \" & B273","v":"Natural Gas - TJ_GCV"},2021]
["HEAT","TJ_NCV",null,"J",null,null,null,"Derived Heat",{"$f":"VLOOKUP(D274, Param_Multilanguage!A:C, MATCH(LanguageChosen,Language[Language],0)+1, FALSE)","v":"Information and communication"},{"$f":"VLOOKUP(H274,LanguageData,MATCH(LanguageChosen,Language[Language],0),FALSE) & \" - \" & B274","v":"Derived Heat - TJ_NCV"},2021]
["TOTALOIL","KT",null,"J",null,null,null,"Oil and Petroleum Products",{"$f":"VLOOKUP(D275, Param_Multilanguage!A:C, MATCH(LanguageChosen,Language[Language],0)+1, FALSE)","v":"Information and communication"},{"$f":"VLOOKUP(H275,LanguageData,MATCH(LanguageChosen,Language[Language],0),FALSE) & \" - \" & B275","v":"Oil and Petroleum Products - KT"},2021]
["REN","TJ_NCV",null,"J",null,null,null,"Renewable Energies",{"$f":"VLOOKUP(D276, Param_Multilanguage!A:C, MATCH(LanguageChosen,Language[Language],0)+1, FALSE)","v":"Information and communication"},{"$f":"VLOOKUP(H276,LanguageData,MATCH(LanguageChosen,Language[Language],0),FALSE) & \" - \" & B276","v":"Renewable Energies - TJ_NCV"},2021]
["COAL","KT",null,"J",null,null,null,"Solid Fossil Fuels",{"$f":"VLOOKUP(D277, Param_Multilanguage!A:C, MATCH(LanguageChosen,Language[Language],0)+1, FALSE)","v":"Information and communication"},{"$f":"VLOOKUP(H277,LanguageData,MATCH(LanguageChosen,Language[Language],0),FALSE) & \" - \" & B277","v":"Solid Fossil Fuels - KT"},2021]
["NONREN","TJ_NCV",null,"J",null,null,null,"Non Renewable Waste",{"$f":"VLOOKUP(D278, Param_Multilanguage!A:C, MATCH(LanguageChosen,Language[Language],0)+1, FALSE)","v":"Information and communication"},{"$f":"VLOOKUP(H278,LanguageData,MATCH(LanguageChosen,Language[Language],0),FALSE) & \" - \" & B278","v":"Non Renewable Waste - TJ_NCV"},2021]
["HYDROGEN","TJ_NCV",null,"J",null,null,null,"Hydrogen",{"$f":"VLOOKUP(D279, Param_Multilanguage!A:C, MATCH(LanguageChosen,Language[Language],0)+1, FALSE)","v":"Information and communication"},{"$f":"VLOOKUP(H279,LanguageData,MATCH(LanguageChosen,Language[Language],0),FALSE) & \" - \" & B279","v":"Hydrogen - TJ_NCV"},2021]
["ELECTR","GWH",null,"K_L",null,null,null,"Electricity",{"$f":"VLOOKUP(D280, Param_Multilanguage!A:C, MATCH(LanguageChosen,Language[Language],0)+1, FALSE)","v":"Financial and insurance activities; real estate activities"},{"$f":"VLOOKUP(H280,LanguageData,MATCH(LanguageChosen,Language[Language],0),FALSE) & \" - \" & B280","v":"Electricity - GWH"},2021]
["NATGAS","TJ_GCV",null,"K_L",null,null,null,"Natural Gas",{"$f":"VLOOKUP(D281, Param_Multilanguage!A:C, MATCH(LanguageChosen,Language[Language],0)+1, FALSE)","v":"Financial and insurance activities; real estate activities"},{"$f":"VLOOKUP(H281,LanguageData,MATCH(LanguageChosen,Language[Language],0),FALSE) & \" - \" & B281","v":"Natural Gas - TJ_GCV"},2021]
["HEAT","TJ_NCV",null,"K_L",null,null,null,"Derived Heat",{"$f":"VLOOKUP(D282, Param_Multilanguage!A:C, MATCH(LanguageChosen,Language[Language],0)+1, FALSE)","v":"Financial and insurance activities; real estate activities"},{"$f":"VLOOKUP(H282,LanguageData,MATCH(LanguageChosen,Language[Language],0),FALSE) & \" - \" & B282","v":"Derived Heat - TJ_NCV"},2021]
["TOTALOIL","KT",null,"K_L",null,null,null,"Oil and Petroleum Products",{"$f":"VLOOKUP(D283, Param_Multilanguage!A:C, MATCH(LanguageChosen,Language[Language],0)+1, FALSE)","v":"Financial and insurance activities; real estate activities"},{"$f":"VLOOKUP(H283,LanguageData,MATCH(LanguageChosen,Language[Language],0),FALSE) & \" - \" & B283","v":"Oil and Petroleum Products - KT"},2021]
["REN","TJ_NCV",null,"K_L",null,null,null,"Renewable Energies",{"$f":"VLOOKUP(D284, Param_Multilanguage!A:C, MATCH(LanguageChosen,Language[Language],0)+1, FALSE)","v":"Financial and insurance activities; real estate activities"},{"$f":"VLOOKUP(H284,LanguageData,MATCH(LanguageChosen,Language[Language],0),FALSE) & \" - \" & B284","v":"Renewable Energies - TJ_NCV"},2021]
["COAL","KT",null,"K_L",null,null,null,"Solid Fossil Fuels",{"$f":"VLOOKUP(D285, Param_Multilanguage!A:C, MATCH(LanguageChosen,Language[Language],0)+1, FALSE)","v":"Financial and insurance activities; real estate activities"},{"$f":"VLOOKUP(H285,LanguageData,MATCH(LanguageChosen,Language[Language],0),FALSE) & \" - \" & B285","v":"Solid Fossil Fuels - KT"},2021]
["NONREN","TJ_NCV",null,"K_L",null,null,null,"Non Renewable Waste",{"$f":"VLOOKUP(D286, Param_Multilanguage!A:C, MATCH(LanguageChosen,Language[Language],0)+1, FALSE)","v":"Financial and insurance activities; real estate activities"},{"$f":"VLOOKUP(H286,LanguageData,MATCH(LanguageChosen,Language[Language],0),FALSE) & \" - \" & B286","v":"Non Renewable Waste - TJ_NCV"},2021]
["HYDROGEN","TJ_NCV",null,"K_L",null,null,null,"Hydrogen",{"$f":"VLOOKUP(D287, Param_Multilanguage!A:C, MATCH(LanguageChosen,Language[Language],0)+1, FALSE)","v":"Financial and insurance activities; real estate activities"},{"$f":"VLOOKUP(H287,LanguageData,MATCH(LanguageChosen,Language[Language],0),FALSE) & \" - \" & B287","v":"Hydrogen - TJ_NCV"},2021]
["ELECTR","GWH",null,"M_S",null,null,null,"Electricity",{"$f":"VLOOKUP(D288, Param_Multilanguage!A:C, MATCH(LanguageChosen,Language[Language],0)+1, FALSE)","v":"Professional, scientific and technical activities; other services"},{"$f":"VLOOKUP(H288,LanguageData,MATCH(LanguageChosen,Language[Language],0),FALSE) & \" - \" & B288","v":"Electricity - GWH"},2021]
["NATGAS","TJ_GCV",null,"M_S",null,null,null,"Natural Gas",{"$f":"VLOOKUP(D289, Param_Multilanguage!A:C, MATCH(LanguageChosen,Language[Language],0)+1, FALSE)","v":"Professional, scientific and technical activities; other services"},{"$f":"VLOOKUP(H289,LanguageData,MATCH(LanguageChosen,Language[Language],0),FALSE) & \" - \" & B289","v":"Natural Gas - TJ_GCV"},2021]
["HEAT","TJ_NCV",null,"M_S",null,null,null,"Derived Heat",{"$f":"VLOOKUP(D290, Param_Multilanguage!A:C, MATCH(LanguageChosen,Language[Language],0)+1, FALSE)","v":"Professional, scientific and technical activities; other services"},{"$f":"VLOOKUP(H290,LanguageData,MATCH(LanguageChosen,Language[Language],0),FALSE) & \" - \" & B290","v":"Derived Heat - TJ_NCV"},2021]
["TOTALOIL","KT",null,"M_S",null,null,null,"Oil and Petroleum Products",{"$f":"VLOOKUP(D291, Param_Multilanguage!A:C, MATCH(LanguageChosen,Language[Language],0)+1, FALSE)","v":"Professional, scientific and technical activities; other services"},{"$f":"VLOOKUP(H291,LanguageData,MATCH(LanguageChosen,Language[Language],0),FALSE) & \" - \" & B291","v":"Oil and Petroleum Products - KT"},2021]
["REN","TJ_NCV",null,"M_S",null,null,null,"Renewable Energies",{"$f":"VLOOKUP(D292, Param_Multilanguage!A:C, MATCH(LanguageChosen,Language[Language],0)+1, FALSE)","v":"Professional, scientific and technical activities; other services"},{"$f":"VLOOKUP(H292,LanguageData,MATCH(LanguageChosen,Language[Language],0),FALSE) & \" - \" & B292","v":"Renewable Energies - TJ_NCV"},2021]
["COAL","KT",null,"M_S",null,null,null,"Solid Fossil Fuels",{"$f":"VLOOKUP(D293, Param_Multilanguage!A:C, MATCH(LanguageChosen,Language[Language],0)+1, FALSE)","v":"Professional, scientific and technical activities; other services"},{"$f":"VLOOKUP(H293,LanguageData,MATCH(LanguageChosen,Language[Language],0),FALSE) & \" - \" & B293","v":"Solid Fossil Fuels - KT"},2021]
["NONREN","TJ_NCV",null,"M_S",null,null,null,"Non Renewable Waste",{"$f":"VLOOKUP(D294, Param_Multilanguage!A:C, MATCH(LanguageChosen,Language[Language],0)+1, FALSE)","v":"Professional, scientific and technical activities; other services"},{"$f":"VLOOKUP(H294,LanguageData,MATCH(LanguageChosen,Language[Language],0),FALSE) & \" - \" & B294","v":"Non Renewable Waste - TJ_NCV"},2021]
["HYDROGEN","TJ_NCV",null,"M_S",null,null,null,"Hydrogen",{"$f":"VLOOKUP(D295, Param_Multilanguage!A:C, MATCH(LanguageChosen,Language[Language],0)+1, FALSE)","v":"Professional, scientific and technical activities; other services"},{"$f":"VLOOKUP(H295,LanguageData,MATCH(LanguageChosen,Language[Language],0),FALSE) & \" - \" & B295","v":"Hydrogen - TJ_NCV"},2021]
["ELECTR","GWH",null,"N",null,null,null,"Electricity",{"$f":"VLOOKUP(D296, Param_Multilanguage!A:C, MATCH(LanguageChosen,Language[Language],0)+1, FALSE)","v":"Administrative and support services activities"},{"$f":"VLOOKUP(H296,LanguageData,MATCH(LanguageChosen,Language[Language],0),FALSE) & \" - \" & B296","v":"Electricity - GWH"},2021]
["NATGAS","TJ_GCV",null,"N",null,null,null,"Natural Gas",{"$f":"VLOOKUP(D297, Param_Multilanguage!A:C, MATCH(LanguageChosen,Language[Language],0)+1, FALSE)","v":"Administrative and support services activities"},{"$f":"VLOOKUP(H297,LanguageData,MATCH(LanguageChosen,Language[Language],0),FALSE) & \" - \" & B297","v":"Natural Gas - TJ_GCV"},2021]
["HEAT","TJ_NCV",null,"N",null,null,null,"Derived Heat",{"$f":"VLOOKUP(D298, Param_Multilanguage!A:C, MATCH(LanguageChosen,Language[Language],0)+1, FALSE)","v":"Administrative and support services activities"},{"$f":"VLOOKUP(H298,LanguageData,MATCH(LanguageChosen,Language[Language],0),FALSE) & \" - \" & B298","v":"Derived Heat - TJ_NCV"},2021]
["TOTALOIL","KT",null,"N",null,null,null,"Oil and Petroleum Products",{"$f":"VLOOKUP(D299, Param_Multilanguage!A:C, MATCH(LanguageChosen,Language[Language],0)+1, FALSE)","v":"Administrative and support services activities"},{"$f":"VLOOKUP(H299,LanguageData,MATCH(LanguageChosen,Language[Language],0),FALSE) & \" - \" & B299","v":"Oil and Petroleum Products - KT"},2021]
["REN","TJ_NCV",null,"N",null,null,null,"Renewable Energies",{"$f":"VLOOKUP(D300, Param_Multilanguage!A:C, MATCH(LanguageChosen,Language[Language],0)+1, FALSE)","v":"Administrative and support services activities"},{"$f":"VLOOKUP(H300,LanguageData,MATCH(LanguageChosen,Language[Language],0),FALSE) & \" - \" & B300","v":"Renewable Energies - TJ_NCV"},2021]
["COAL","KT",null,"N",null,null,null,"Solid Fossil Fuels",{"$f":"VLOOKUP(D301, Param_Multilanguage!A:C, MATCH(LanguageChosen,Language[Language],0)+1, FALSE)","v":"Administrative and support services activities"},{"$f":"VLOOKUP(H301,LanguageData,MATCH(LanguageChosen,Language[Language],0),FALSE) & \" - \" & B301","v":"Solid Fossil Fuels - KT"},2021]
["NONREN","TJ_NCV",null,"N",null,null,null,"Non Renewable Waste",{"$f":"VLOOKUP(D302, Param_Multilanguage!A:C, MATCH(LanguageChosen,Language[Language],0)+1, FALSE)","v":"Administrative and support services activities"},{"$f":"VLOOKUP(H302,LanguageData,MATCH(LanguageChosen,Language[Language],0),FALSE) & \" - \" & B302","v":"Non Renewable Waste - TJ_NCV"},2021]
["HYDROGEN","TJ_NCV",null,"N",null,null,null,"Hydrogen",{"$f":"VLOOKUP(D303, Param_Multilanguage!A:C, MATCH(LanguageChosen,Language[Language],0)+1, FALSE)","v":"Administrative and support services activities"},{"$f":"VLOOKUP(H303,LanguageData,MATCH(LanguageChosen,Language[Language],0),FALSE) & \" - \" & B303","v":"Hydrogen - TJ_NCV"},2021]
["ELECTR","GWH",null,"O",null,null,null,"Electricity",{"$f":"VLOOKUP(D304, Param_Multilanguage!A:C, MATCH(LanguageChosen,Language[Language],0)+1, FALSE)","v":"Public administration and defence; compulsory social security"},{"$f":"VLOOKUP(H304,LanguageData,MATCH(LanguageChosen,Language[Language],0),FALSE) & \" - \" & B304","v":"Electricity - GWH"},2021]
["NATGAS","TJ_GCV",null,"O",null,null,null,"Natural Gas",{"$f":"VLOOKUP(D305, Param_Multilanguage!A:C, MATCH(LanguageChosen,Language[Language],0)+1, FALSE)","v":"Public administration and defence; compulsory social security"},{"$f":"VLOOKUP(H305,LanguageData,MATCH(LanguageChosen,Language[Language],0),FALSE) & \" - \" & B305","v":"Natural Gas - TJ_GCV"},2021]
["HEAT","TJ_NCV",null,"O",null,null,null,"Derived Heat",{"$f":"VLOOKUP(D306, Param_Multilanguage!A:C, MATCH(LanguageChosen,Language[Language],0)+1, FALSE)","v":"Public administration and defence; compulsory social security"},{"$f":"VLOOKUP(H306,LanguageData,MATCH(LanguageChosen,Language[Language],0),FALSE) & \" - \" & B306","v":"Derived Heat - TJ_NCV"},2021]
["TOTALOIL","KT",null,"O",null,null,null,"Oil and Petroleum Products",{"$f":"VLOOKUP(D307, Param_Multilanguage!A:C, MATCH(LanguageChosen,Language[Language],0)+1, FALSE)","v":"Public administration and defence; compulsory social security"},{"$f":"VLOOKUP(H307,LanguageData,MATCH(LanguageChosen,Language[Language],0),FALSE) & \" - \" & B307","v":"Oil and Petroleum Products - KT"},2021]
["REN","TJ_NCV",null,"O",null,null,null,"Renewable Energies",{"$f":"VLOOKUP(D308, Param_Multilanguage!A:C, MATCH(LanguageChosen,Language[Language],0)+1, FALSE)","v":"Public administration and defence; compulsory social security"},{"$f":"VLOOKUP(H308,LanguageData,MATCH(LanguageChosen,Language[Language],0),FALSE) & \" - \" & B308","v":"Renewable Energies - TJ_NCV"},2021]
["COAL","KT",null,"O",null,null,null,"Solid Fossil Fuels",{"$f":"VLOOKUP(D309, Param_Multilanguage!A:C, MATCH(LanguageChosen,Language[Language],0)+1, FALSE)","v":"Public administration and defence; compulsory social security"},{"$f":"VLOOKUP(H309,LanguageData,MATCH(LanguageChosen,Language[Language],0),FALSE) & \" - \" & B309","v":"Solid Fossil Fuels - KT"},2021]
["NONREN","TJ_NCV",null,"O",null,null,null,"Non Renewable Waste",{"$f":"VLOOKUP(D310, Param_Multilanguage!A:C, MATCH(LanguageChosen,Language[Language],0)+1, FALSE)","v":"Public administration and defence; compulsory social security"},{"$f":"VLOOKUP(H310,LanguageData,MATCH(LanguageChosen,Language[Language],0),FALSE) & \" - \" & B310","v":"Non Renewable Waste - TJ_NCV"},2021]
["HYDROGEN","TJ_NCV",null,"O",null,null,null,"Hydrogen",{"$f":"VLOOKUP(D311, Param_Multilanguage!A:C, MATCH(LanguageChosen,Language[Language],0)+1, FALSE)","v":"Public administration and defence; compulsory social security"},{"$f":"VLOOKUP(H311,LanguageData,MATCH(LanguageChosen,Language[Language],0),FALSE) & \" - \" & B311","v":"Hydrogen - TJ_NCV"},2021]
["ELECTR","GWH",null,"P",null,null,null,"Electricity",{"$f":"VLOOKUP(D312, Param_Multilanguage!A:C, MATCH(LanguageChosen,Language[Language],0)+1, FALSE)","v":"Education"},{"$f":"VLOOKUP(H312,LanguageData,MATCH(LanguageChosen,Language[Language],0),FALSE) & \" - \" & B312","v":"Electricity - GWH"},2021]
["NATGAS","TJ_GCV",null,"P",null,null,null,"Natural Gas",{"$f":"VLOOKUP(D313, Param_Multilanguage!A:C, MATCH(LanguageChosen,Language[Language],0)+1, FALSE)","v":"Education"},{"$f":"VLOOKUP(H313,LanguageData,MATCH(LanguageChosen,Language[Language],0),FALSE) & \" - \" & B313","v":"Natural Gas - TJ_GCV"},2021]
["HEAT","TJ_NCV",null,"P",null,null,null,"Derived Heat",{"$f":"VLOOKUP(D314, Param_Multilanguage!A:C, MATCH(LanguageChosen,Language[Language],0)+1, FALSE)","v":"Education"},{"$f":"VLOOKUP(H314,LanguageData,MATCH(LanguageChosen,Language[Language],0),FALSE) & \" - \" & B314","v":"Derived Heat - TJ_NCV"},2021]
["TOTALOIL","KT",null,"P",null,null,null,"Oil and Petroleum Products",{"$f":"VLOOKUP(D315, Param_Multilanguage!A:C, MATCH(LanguageChosen,Language[Language],0)+1, FALSE)","v":"Education"},{"$f":"VLOOKUP(H315,LanguageData,MATCH(LanguageChosen,Language[Language],0),FALSE) & \" - \" & B315","v":"Oil and Petroleum Products - KT"},2021]
["REN","TJ_NCV",null,"P",null,null,null,"Renewable Energies",{"$f":"VLOOKUP(D316, Param_Multilanguage!A:C, MATCH(LanguageChosen,Language[Language],0)+1, FALSE)","v":"Education"},{"$f":"VLOOKUP(H316,LanguageData,MATCH(LanguageChosen,Language[Language],0),FALSE) & \" - \" & B316","v":"Renewable Energies - TJ_NCV"},2021]
["COAL","KT",null,"P",null,null,null,"Solid Fossil Fuels",{"$f":"VLOOKUP(D317, Param_Multilanguage!A:C, MATCH(LanguageChosen,Language[Language],0)+1, FALSE)","v":"Education"},{"$f":"VLOOKUP(H317,LanguageData,MATCH(LanguageChosen,Language[Language],0),FALSE) & \" - \" & B317","v":"Solid Fossil Fuels - KT"},2021]
["NONREN","TJ_NCV",null,"P",null,null,null,"Non Renewable Waste",{"$f":"VLOOKUP(D318, Param_Multilanguage!A:C, MATCH(LanguageChosen,Language[Language],0)+1, FALSE)","v":"Education"},{"$f":"VLOOKUP(H318,LanguageData,MATCH(LanguageChosen,Language[Language],0),FALSE) & \" - \" & B318","v":"Non Renewable Waste - TJ_NCV"},2021]
["HYDROGEN","TJ_NCV",null,"P",null,null,null,"Hydrogen",{"$f":"VLOOKUP(D319, Param_Multilanguage!A:C, MATCH(LanguageChosen,Language[Language],0)+1, FALSE)","v":"Education"},{"$f":"VLOOKUP(H319,LanguageData,MATCH(LanguageChosen,Language[Language],0),FALSE) & \" - \" & B319","v":"Hydrogen - TJ_NCV"},2021]
["ELECTR","GWH",null,"Q",null,null,null,"Electricity",{"$f":"VLOOKUP(D320, Param_Multilanguage!A:C, MATCH(LanguageChosen,Language[Language],0)+1, FALSE)","v":"Human health and social work activities"},{"$f":"VLOOKUP(H320,LanguageData,MATCH(LanguageChosen,Language[Language],0),FALSE) & \" - \" & B320","v":"Electricity - GWH"},2021]
["NATGAS","TJ_GCV",null,"Q",null,null,null,"Natural Gas",{"$f":"VLOOKUP(D321, Param_Multilanguage!A:C, MATCH(LanguageChosen,Language[Language],0)+1, FALSE)","v":"Human health and social work activities"},{"$f":"VLOOKUP(H321,LanguageData,MATCH(LanguageChosen,Language[Language],0),FALSE) & \" - \" & B321","v":"Natural Gas - TJ_GCV"},2021]
["HEAT","TJ_NCV",null,"Q",null,null,null,"Derived Heat",{"$f":"VLOOKUP(D322, Param_Multilanguage!A:C, MATCH(LanguageChosen,Language[Language],0)+1, FALSE)","v":"Human health and social work activities"},{"$f":"VLOOKUP(H322,LanguageData,MATCH(LanguageChosen,Language[Language],0),FALSE) & \" - \" & B322","v":"Derived Heat - TJ_NCV"},2021]
["TOTALOIL","KT",null,"Q",null,null,null,"Oil and Petroleum Products",{"$f":"VLOOKUP(D323, Param_Multilanguage!A:C, MATCH(LanguageChosen,Language[Language],0)+1, FALSE)","v":"Human health and social work activities"},{"$f":"VLOOKUP(H323,LanguageData,MATCH(LanguageChosen,Language[Language],0),FALSE) & \" - \" & B323","v":"Oil and Petroleum Products - KT"},2021]
["REN","TJ_NCV",null,"Q",null,null,null,"Renewable Energies",{"$f":"VLOOKUP(D324, Param_Multilanguage!A:C, MATCH(LanguageChosen,Language[Language],0)+1, FALSE)","v":"Human health and social work activities"},{"$f":"VLOOKUP(H324,LanguageData,MATCH(LanguageChosen,Language[Language],0),FALSE) & \" - \" & B324","v":"Renewable Energies - TJ_NCV"},2021]
["COAL","KT",null,"Q",null,null,null,"Solid Fossil Fuels",{"$f":"VLOOKUP(D325, Param_Multilanguage!A:C, MATCH(LanguageChosen,Language[Language],0)+1, FALSE)","v":"Human health and social work activities"},{"$f":"VLOOKUP(H325,LanguageData,MATCH(LanguageChosen,Language[Language],0),FALSE) & \" - \" & B325","v":"Solid Fossil Fuels - KT"},2021]
["NONREN","TJ_NCV",null,"Q",null,null,null,"Non Renewable Waste",{"$f":"VLOOKUP(D326, Param_Multilanguage!A:C, MATCH(LanguageChosen,Language[Language],0)+1, FALSE)","v":"Human health and social work activities"},{"$f":"VLOOKUP(H326,LanguageData,MATCH(LanguageChosen,Language[Language],0),FALSE) & \" - \" & B326","v":"Non Renewable Waste - TJ_NCV"},2021]
["HYDROGEN","TJ_NCV",null,"Q",null,null,null,"Hydrogen",{"$f":"VLOOKUP(D327, Param_Multilanguage!A:C, MATCH(LanguageChosen,Language[Language],0)+1, FALSE)","v":"Human health and social work activities"},{"$f":"VLOOKUP(H327,LanguageData,MATCH(LanguageChosen,Language[Language],0),FALSE) & \" - \" & B327","v":"Hydrogen - TJ_NCV"},2021]
["ELECTR","GWH",null,"Q861",null,null,null,"Electricity",{"$f":"VLOOKUP(D328, Param_Multilanguage!A:C, MATCH(LanguageChosen,Language[Language],0)+1, FALSE)","v":"Of which: Hospital activities"},{"$f":"VLOOKUP(H328,LanguageData,MATCH(LanguageChosen,Language[Language],0),FALSE) & \" - \" & B328","v":"Electricity - GWH"},2021]
["NATGAS","TJ_GCV",null,"Q861",null,null,null,"Natural Gas",{"$f":"VLOOKUP(D329, Param_Multilanguage!A:C, MATCH(LanguageChosen,Language[Language],0)+1, FALSE)","v":"Of which: Hospital activities"},{"$f":"VLOOKUP(H329,LanguageData,MATCH(LanguageChosen,Language[Language],0),FALSE) & \" - \" & B329","v":"Natural Gas - TJ_GCV"},2021]
["HEAT","TJ_NCV",null,"Q861",null,null,null,"Derived Heat",{"$f":"VLOOKUP(D330, Param_Multilanguage!A:C, MATCH(LanguageChosen,Language[Language],0)+1, FALSE)","v":"Of which: Hospital activities"},{"$f":"VLOOKUP(H330,LanguageData,MATCH(LanguageChosen,Language[Language],0),FALSE) & \" - \" & B330","v":"Derived Heat - TJ_NCV"},2021]
["TOTALOIL","KT",null,"Q861",null,null,null,"Oil and Petroleum Products",{"$f":"VLOOKUP(D331, Param_Multilanguage!A:C, MATCH(LanguageChosen,Language[Language],0)+1, FALSE)","v":"Of which: Hospital activities"},{"$f":"VLOOKUP(H331,LanguageData,MATCH(LanguageChosen,Language[Language],0),FALSE) & \" - \" & B331","v":"Oil and Petroleum Products - KT"},2021]
["REN","TJ_NCV",null,"Q861",null,null,null,"Renewable Energies",{"$f":"VLOOKUP(D332, Param_Multilanguage!A:C, MATCH(LanguageChosen,Language[Language],0)+1, FALSE)","v":"Of which: Hospital activities"},{"$f":"VLOOKUP(H332,LanguageData,MATCH(LanguageChosen,Language[Language],0),FALSE) & \" - \" & B332","v":"Renewable Energies - TJ_NCV"},2021]
["COAL","KT",null,"Q861",null,null,null,"Solid Fossil Fuels",{"$f":"VLOOKUP(D333, Param_Multilanguage!A:C, MATCH(LanguageChosen,Language[Language],0)+1, FALSE)","v":"Of which: Hospital activities"},{"$f":"VLOOKUP(H333,LanguageData,MATCH(LanguageChosen,Language[Language],0),FALSE) & \" - \" & B333","v":"Solid Fossil Fuels - KT"},2021]
["NONREN","TJ_NCV",null,"Q861",null,null,null,"Non Renewable Waste",{"$f":"VLOOKUP(D334, Param_Multilanguage!A:C, MATCH(LanguageChosen,Language[Language],0)+1, FALSE)","v":"Of which: Hospital activities"},{"$f":"VLOOKUP(H334,LanguageData,MATCH(LanguageChosen,Language[Language],0),FALSE) & \" - \" & B334","v":"Non Renewable Waste - TJ_NCV"},2021]
["HYDROGEN","TJ_NCV",null,"Q861",null,null,null,"Hydrogen",{"$f":"VLOOKUP(D335, Param_Multilanguage!A:C, MATCH(LanguageChosen,Language[Language],0)+1, FALSE)","v":"Of which: Hospital activities"},{"$f":"VLOOKUP(H335,LanguageData,MATCH(LanguageChosen,Language[Language],0),FALSE) & \" - \" & B335","v":"Hydrogen - TJ_NCV"},2021]
["ELECTR","GWH",null,"R",null,null,null,"Electricity",{"$f":"VLOOKUP(D336, Param_Multilanguage!A:C, MATCH(LanguageChosen,Language[Language],0)+1, FALSE)","v":"Arts, entertainment and recreation"},{"$f":"VLOOKUP(H336,LanguageData,MATCH(LanguageChosen,Language[Language],0),FALSE) & \" - \" & B336","v":"Electricity - GWH"},2021]
["NATGAS","TJ_GCV",null,"R",null,null,null,"Natural Gas",{"$f":"VLOOKUP(D337, Param_Multilanguage!A:C, MATCH(LanguageChosen,Language[Language],0)+1, FALSE)","v":"Arts, entertainment and recreation"},{"$f":"VLOOKUP(H337,LanguageData,MATCH(LanguageChosen,Language[Language],0),FALSE) & \" - \" & B337","v":"Natural Gas - TJ_GCV"},2021]
["HEAT","TJ_NCV",null,"R",null,null,null,"Derived Heat",{"$f":"VLOOKUP(D338, Param_Multilanguage!A:C, MATCH(LanguageChosen,Language[Language],0)+1, FALSE)","v":"Arts, entertainment and recreation"},{"$f":"VLOOKUP(H338,LanguageData,MATCH(LanguageChosen,Language[Language],0),FALSE) & \" - \" & B338","v":"Derived Heat - TJ_NCV"},2021]
["TOTALOIL","KT",null,"R",null,null,null,"Oil and Petroleum Products",{"$f":"VLOOKUP(D339, Param_Multilanguage!A:C, MATCH(LanguageChosen,Language[Language],0)+1, FALSE)","v":"Arts, entertainment and recreation"},{"$f":"VLOOKUP(H339,LanguageData,MATCH(LanguageChosen,Language[Language],0),FALSE) & \" - \" & B339","v":"Oil and Petroleum Products - KT"},2021]
["REN","TJ_NCV",null,"R",null,null,null,"Renewable Energies",{"$f":"VLOOKUP(D340, Param_Multilanguage!A:C, MATCH(LanguageChosen,Language[Language],0)+1, FALSE)","v":"Arts, entertainment and recreation"},{"$f":"VLOOKUP(H340,LanguageData,MATCH(LanguageChosen,Language[Language],0),FALSE) & \" - \" & B340","v":"Renewable Energies - TJ_NCV"},2021]
["COAL","KT",null,"R",null,null,null,"Solid Fossil Fuels",{"$f":"VLOOKUP(D341, Param_Multilanguage!A:C, MATCH(LanguageChosen,Language[Language],0)+1, FALSE)","v":"Arts, entertainment and recreation"},{"$f":"VLOOKUP(H341,LanguageData,MATCH(LanguageChosen,Language[Language],0),FALSE) & \" - \" & B341","v":"Solid Fossil Fuels - KT"},2021]
["NONREN","TJ_NCV",null,"R",null,null,null,"Non Renewable Waste",{"$f":"VLOOKUP(D342, Param_Multilanguage!A:C, MATCH(LanguageChosen,Language[Language],0)+1, FALSE)","v":"Arts, entertainment and recreation"},{"$f":"VLOOKUP(H342,LanguageData,MATCH(LanguageChosen,Language[Language],0),FALSE) & \" - \" & B342","v":"Non Renewable Waste - TJ_NCV"},2021]
["HYDROGEN","TJ_NCV",null,"R",null,null,null,"Hydrogen",{"$f":"VLOOKUP(D343, Param_Multilanguage!A:C, MATCH(LanguageChosen,Language[Language],0)+1, FALSE)","v":"Arts, entertainment and recreation"},{"$f":"VLOOKUP(H343,LanguageData,MATCH(LanguageChosen,Language[Language],0),FALSE) & \" - \" & B343","v":"Hydrogen - TJ_NCV"},2021]
["ELECTR","GWH",null,"R93",null,null,null,"Electricity",{"$f":"VLOOKUP(D344, Param_Multilanguage!A:C, MATCH(LanguageChosen,Language[Language],0)+1, FALSE)","v":"Of which: Sports activities and amusement and recreation activities"},{"$f":"VLOOKUP(H344,LanguageData,MATCH(LanguageChosen,Language[Language],0),FALSE) & \" - \" & B344","v":"Electricity - GWH"},2021]
["NATGAS","TJ_GCV",null,"R93",null,null,null,"Natural Gas",{"$f":"VLOOKUP(D345, Param_Multilanguage!A:C, MATCH(LanguageChosen,Language[Language],0)+1, FALSE)","v":"Of which: Sports activities and amusement and recreation activities"},{"$f":"VLOOKUP(H345,LanguageData,MATCH(LanguageChosen,Language[Language],0),FALSE) & \" - \" & B345","v":"Natural Gas - TJ_GCV"},2021]
["HEAT","TJ_NCV",null,"R93",null,null,null,"Derived Heat",{"$f":"VLOOKUP(D346, Param_Multilanguage!A:C, MATCH(LanguageChosen,Language[Language],0)+1, FALSE)","v":"Of which: Sports activities and amusement and recreation activities"},{"$f":"VLOOKUP(H346,LanguageData,MATCH(LanguageChosen,Language[Language],0),FALSE) & \" - \" & B346","v":"Derived Heat - TJ_NCV"},2021]
["TOTALOIL","KT",null,"R93",null,null,null,"Oil and Petroleum Products",{"$f":"VLOOKUP(D347, Param_Multilanguage!A:C, MATCH(LanguageChosen,Language[Language],0)+1, FALSE)","v":"Of which: Sports activities and amusement and recreation activities"},{"$f":"VLOOKUP(H347,LanguageData,MATCH(LanguageChosen,Language[Language],0),FALSE) & \" - \" & B347","v":"Oil and Petroleum Products - KT"},2021]
["REN","TJ_NCV",null,"R93",null,null,null,"Renewable Energies",{"$f":"VLOOKUP(D348, Param_Multilanguage!A:C, MATCH(LanguageChosen,Language[Language],0)+1, FALSE)","v":"Of which: Sports activities and amusement and recreation activities"},{"$f":"VLOOKUP(H348,LanguageData,MATCH(LanguageChosen,Language[Language],0),FALSE) & \" - \" & B348","v":"Renewable Energies - TJ_NCV"},2021]
["COAL","KT",null,"R93",null,null,null,"Solid Fossil Fuels",{"$f":"VLOOKUP(D349, Param_Multilanguage!A:C, MATCH(LanguageChosen,Language[Language],0)+1, FALSE)","v":"Of which: Sports activities and amusement and recreation activities"},{"$f":"VLOOKUP(H349,LanguageData,MATCH(LanguageChosen,Language[Language],0),FALSE) & \" - \" & B349","v":"Solid Fossil Fuels - KT"},2021]
["NONREN","TJ_NCV",null,"R93",null,null,null,"Non Renewable Waste",{"$f":"VLOOKUP(D350, Param_Multilanguage!A:C, MATCH(LanguageChosen,Language[Language],0)+1, FALSE)","v":"Of which: Sports activities and amusement and recreation activities"},{"$f":"VLOOKUP(H350,LanguageData,MATCH(LanguageChosen,Language[Language],0),FALSE) & \" - \" & B350","v":"Non Renewable Waste - TJ_NCV"},2021]
["HYDROGEN","TJ_NCV",null,"R93",null,null,null,"Hydrogen",{"$f":"VLOOKUP(D351, Param_Multilanguage!A:C, MATCH(LanguageChosen,Language[Language],0)+1, FALSE)","v":"Of which: Sports activities and amusement and recreation activities"},{"$f":"VLOOKUP(H351,LanguageData,MATCH(LanguageChosen,Language[Language],0),FALSE) & \" - \" & B351","v":"Hydrogen - TJ_NCV"},2021]
["ELECTR","GWH",null,"U",null,null,null,"Electricity",{"$f":"VLOOKUP(D352, Param_Multilanguage!A:C, MATCH(LanguageChosen,Language[Language],0)+1, FALSE)","v":"Activities of extra-territorial organisations and bodies"},{"$f":"VLOOKUP(H352,LanguageData,MATCH(LanguageChosen,Language[Language],0),FALSE) & \" - \" & B352","v":"Electricity - GWH"},2021]
["NATGAS","TJ_GCV",null,"U",null,null,null,"Natural Gas",{"$f":"VLOOKUP(D353, Param_Multilanguage!A:C, MATCH(LanguageChosen,Language[Language],0)+1, FALSE)","v":"Activities of extra-territorial organisations and bodies"},{"$f":"VLOOKUP(H353,LanguageData,MATCH(LanguageChosen,Language[Language],0),FALSE) & \" - \" & B353","v":"Natural Gas - TJ_GCV"},2021]
["HEAT","TJ_NCV",null,"U",null,null,null,"Derived Heat",{"$f":"VLOOKUP(D354, Param_Multilanguage!A:C, MATCH(LanguageChosen,Language[Language],0)+1, FALSE)","v":"Activities of extra-territorial organisations and bodies"},{"$f":"VLOOKUP(H354,LanguageData,MATCH(LanguageChosen,Language[Language],0),FALSE) & \" - \" & B354","v":"Derived Heat - TJ_NCV"},2021]
["TOTALOIL","KT",null,"U",null,null,null,"Oil and Petroleum Products",{"$f":"VLOOKUP(D355, Param_Multilanguage!A:C, MATCH(LanguageChosen,Language[Language],0)+1, FALSE)","v":"Activities of extra-territorial organisations and bodies"},{"$f":"VLOOKUP(H355,LanguageData,MATCH(LanguageChosen,Language[Language],0),FALSE) & \" - \" & B355","v":"Oil and Petroleum Products - KT"},2021]
["REN","TJ_NCV",null,"U",null,null,null,"Renewable Energies",{"$f":"VLOOKUP(D356, Param_Multilanguage!A:C, MATCH(LanguageChosen,Language[Language],0)+1, FALSE)","v":"Activities of extra-territorial organisations and bodies"},{"$f":"VLOOKUP(H356,LanguageData,MATCH(LanguageChosen,Language[Language],0),FALSE) & \" - \" & B356","v":"Renewable Energies - TJ_NCV"},2021]
["COAL","KT",null,"U",null,null,null,"Solid Fossil Fuels",{"$f":"VLOOKUP(D357, Param_Multilanguage!A:C, MATCH(LanguageChosen,Language[Language],0)+1, FALSE)","v":"Activities of extra-territorial organisations and bodies"},{"$f":"VLOOKUP(H357,LanguageData,MATCH(LanguageChosen,Language[Language],0),FALSE) & \" - \" & B357","v":"Solid Fossil Fuels - KT"},2021]
["NONREN","TJ_NCV",null,"U",null,null,null,"Non Renewable Waste",{"$f":"VLOOKUP(D358, Param_Multilanguage!A:C, MATCH(LanguageChosen,Language[Language],0)+1, FALSE)","v":"Activities of extra-territorial organisations and bodies"},{"$f":"VLOOKUP(H358,LanguageData,MATCH(LanguageChosen,Language[Language],0),FALSE) & \" - \" & B358","v":"Non Renewable Waste - TJ_NCV"},2021]
["HYDROGEN","TJ_NCV",null,"U",null,null,null,"Hydrogen",{"$f":"VLOOKUP(D359, Param_Multilanguage!A:C, MATCH(LanguageChosen,Language[Language],0)+1, FALSE)","v":"Activities of extra-territorial organisations and bodies"},{"$f":"VLOOKUP(H359,LanguageData,MATCH(LanguageChosen,Language[Language],0),FALSE) & \" - \" & B359","v":"Hydrogen - TJ_NCV"},2021]
["ELECTR","GWH",null,"DATAC",null,null,null,"Electricity",{"$f":"VLOOKUP(D360, Param_Multilanguage!A:C, MATCH(LanguageChosen,Language[Language],0)+1, FALSE)","v":"Data centres"},{"$f":"VLOOKUP(H360,LanguageData,MATCH(LanguageChosen,Language[Language],0),FALSE) & \" - \" & B360","v":"Electricity - GWH"},2021]
["NATGAS","TJ_GCV",null,"DATAC",null,null,null,"Natural Gas",{"$f":"VLOOKUP(D361, Param_Multilanguage!A:C, MATCH(LanguageChosen,Language[Language],0)+1, FALSE)","v":"Data centres"},{"$f":"VLOOKUP(H361,LanguageData,MATCH(LanguageChosen,Language[Language],0),FALSE) & \" - \" & B361","v":"Natural Gas - TJ_GCV"},2021]
["HEAT","TJ_NCV",null,"DATAC",null,null,null,"Derived Heat",{"$f":"VLOOKUP(D362, Param_Multilanguage!A:C, MATCH(LanguageChosen,Language[Language],0)+1, FALSE)","v":"Data centres"},{"$f":"VLOOKUP(H362,LanguageData,MATCH(LanguageChosen,Language[Language],0),FALSE) & \" - \" & B362","v":"Derived Heat - TJ_NCV"},2021]
["TOTALOIL","KT",null,"DATAC",null,null,null,"Oil and Petroleum Products",{"$f":"VLOOKUP(D363, Param_Multilanguage!A:C, MATCH(LanguageChosen,Language[Language],0)+1, FALSE)","v":"Data centres"},{"$f":"VLOOKUP(H363,LanguageData,MATCH(LanguageChosen,Language[Language],0),FALSE) & \" - \" & B363","v":"Oil and Petroleum Products - KT"},2021]
["REN","TJ_NCV",null,"DATAC",null,null,null,"Renewable Energies",{"$f":"VLOOKUP(D364, Param_Multilanguage!A:C, MATCH(LanguageChosen,Language[Language],0)+1, FALSE)","v":"Data centres"},{"$f":"VLOOKUP(H364,LanguageData,MATCH(LanguageChosen,Language[Language],0),FALSE) & \" - \" & B364","v":"Renewable Energies - TJ_NCV"},2021]
["COAL","KT",null,"DATAC",null,null,null,"Solid Fossil Fuels",{"$f":"VLOOKUP(D365, Param_Multilanguage!A:C, MATCH(LanguageChosen,Language[Language],0)+1, FALSE)","v":"Data centres"},{"$f":"VLOOKUP(H365,LanguageData,MATCH(LanguageChosen,Language[Language],0),FALSE) & \" - \" & B365","v":"Solid Fossil Fuels - KT"},2021]
["NONREN","TJ_NCV",null,"DATAC",null,null,null,"Non Renewable Waste",{"$f":"VLOOKUP(D366, Param_Multilanguage!A:C, MATCH(LanguageChosen,Language[Language],0)+1, FALSE)","v":"Data centres"},{"$f":"VLOOKUP(H366,LanguageData,MATCH(LanguageChosen,Language[Language],0),FALSE) & \" - \" & B366","v":"Non Renewable Waste - TJ_NCV"},2021]
["HYDROGEN","TJ_NCV",null,"DATAC",null,null,null,"Hydrogen",{"$f":"VLOOKUP(D367, Param_Multilanguage!A:C, MATCH(LanguageChosen,Language[Language],0)+1, FALSE)","v":"Data centres"},{"$f":"VLOOKUP(H367,LanguageData,MATCH(LanguageChosen,Language[Language],0),FALSE) & \" - \" & B367","v":"Hydrogen - TJ_NCV"},2021]
["ELECTR","GWH",null,"TOTSER",null,null,null,"Electricity",{"$f":"VLOOKUP(D368, Param_Multilanguage!A:C, MATCH(LanguageChosen,Language[Language],0)+1, FALSE)","v":"Services total"},{"$f":"VLOOKUP(H368,LanguageData,MATCH(LanguageChosen,Language[Language],0),FALSE) & \" - \" & B368","v":"Electricity - GWH"},2021]
["NATGAS","TJ_GCV",null,"TOTSER",null,null,null,"Natural Gas",{"$f":"VLOOKUP(D369, Param_Multilanguage!A:C, MATCH(LanguageChosen,Language[Language],0)+1, FALSE)","v":"Services total"},{"$f":"VLOOKUP(H369,LanguageData,MATCH(LanguageChosen,Language[Language],0),FALSE) & \" - \" & B369","v":"Natural Gas - TJ_GCV"},2021]
["HEAT","TJ_NCV",null,"TOTSER",null,null,null,"Derived Heat",{"$f":"VLOOKUP(D370, Param_Multilanguage!A:C, MATCH(LanguageChosen,Language[Language],0)+1, FALSE)","v":"Services total"},{"$f":"VLOOKUP(H370,LanguageData,MATCH(LanguageChosen,Language[Language],0),FALSE) & \" - \" & B370","v":"Derived Heat - TJ_NCV"},2021]
["TOTALOIL","KT",null,"TOTSER",null,null,null,"Oil and Petroleum Products",{"$f":"VLOOKUP(D371, Param_Multilanguage!A:C, MATCH(LanguageChosen,Language[Language],0)+1, FALSE)","v":"Services total"},{"$f":"VLOOKUP(H371,LanguageData,MATCH(LanguageChosen,Language[Language],0),FALSE) & \" - \" & B371","v":"Oil and Petroleum Products - KT"},2021]
["REN","TJ_NCV",null,"TOTSER",null,null,null,"Renewable Energies",{"$f":"VLOOKUP(D372, Param_Multilanguage!A:C, MATCH(LanguageChosen,Language[Language],0)+1, FALSE)","v":"Services total"},{"$f":"VLOOKUP(H372,LanguageData,MATCH(LanguageChosen,Language[Language],0),FALSE) & \" - \" & B372","v":"Renewable Energies - TJ_NCV"},2021]
["COAL","KT",null,"TOTSER",null,null,null,"Solid Fossil Fuels",{"$f":"VLOOKUP(D373, Param_Multilanguage!A:C, MATCH(LanguageChosen,Language[Language],0)+1, FALSE)","v":"Services total"},{"$f":"VLOOKUP(H373,LanguageData,MATCH(LanguageChosen,Language[Language],0),FALSE) & \" - \" & B373","v":"Solid Fossil Fuels - KT"},2021]
["NONREN","TJ_NCV",null,"TOTSER",null,null,null,"Non Renewable Waste",{"$f":"VLOOKUP(D374, Param_Multilanguage!A:C, MATCH(LanguageChosen,Language[Language],0)+1, FALSE)","v":"Services total"},{"$f":"VLOOKUP(H374,LanguageData,MATCH(LanguageChosen,Language[Language],0),FALSE) & \" - \" & B374","v":"Non Renewable Waste - TJ_NCV"},2021]
["HYDROGEN","TJ_NCV",null,"TOTSER",null,null,null,"Hydrogen",{"$f":"VLOOKUP(D375, Param_Multilanguage!A:C, MATCH(LanguageChosen,Language[Language],0)+1, FALSE)","v":"Services total"},{"$f":"VLOOKUP(H375,LanguageData,MATCH(LanguageChosen,Language[Language],0),FALSE) & \" - \" & B375","v":"Hydrogen - TJ_NCV"},2021]
["ELECTR","GWH",null,"C33",null,null,null,"Electricity",{"$f":"VLOOKUP(D376, Param_Multilanguage!A:C, MATCH(LanguageChosen,Language[Language],0)+1, FALSE)","v":"Repair and installation of machinery and equipment"},{"$f":"VLOOKUP(H376,LanguageData,MATCH(LanguageChosen,Language[Language],0),FALSE) & \" - \" & B376","v":"Electricity - GWH"},2022]
["NATGAS","TJ_GCV",null,"C33",null,null,null,"Natural Gas",{"$f":"VLOOKUP(D377, Param_Multilanguage!A:C, MATCH(LanguageChosen,Language[Language],0)+1, FALSE)","v":"Repair and installation of machinery and equipment"},{"$f":"VLOOKUP(H377,LanguageData,MATCH(LanguageChosen,Language[Language],0),FALSE) & \" - \" & B377","v":"Natural Gas - TJ_GCV"},2022]
["HEAT","TJ_NCV",null,"C33",null,null,null,"Derived Heat",{"$f":"VLOOKUP(D378, Param_Multilanguage!A:C, MATCH(LanguageChosen,Language[Language],0)+1, FALSE)","v":"Repair and installation of machinery and equipment"},{"$f":"VLOOKUP(H378,LanguageData,MATCH(LanguageChosen,Language[Language],0),FALSE) & \" - \" & B378","v":"Derived Heat - TJ_NCV"},2022]
["TOTALOIL","KT",null,"C33",null,null,null,"Oil and Petroleum Products",{"$f":"VLOOKUP(D379, Param_Multilanguage!A:C, MATCH(LanguageChosen,Language[Language],0)+1, FALSE)","v":"Repair and installation of machinery and equipment"},{"$f":"VLOOKUP(H379,LanguageData,MATCH(LanguageChosen,Language[Language],0),FALSE) & \" - \" & B379","v":"Oil and Petroleum Products - KT"},2022]
["REN","TJ_NCV",null,"C33",null,null,null,"Renewable Energies",{"$f":"VLOOKUP(D380, Param_Multilanguage!A:C, MATCH(LanguageChosen,Language[Language],0)+1, FALSE)","v":"Repair and installation of machinery and equipment"},{"$f":"VLOOKUP(H380,LanguageData,MATCH(LanguageChosen,Language[Language],0),FALSE) & \" - \" & B380","v":"Renewable Energies - TJ_NCV"},2022]
["COAL","KT",null,"C33",null,null,null,"Solid Fossil Fuels",{"$f":"VLOOKUP(D381, Param_Multilanguage!A:C, MATCH(LanguageChosen,Language[Language],0)+1, FALSE)","v":"Repair and installation of machinery and equipment"},{"$f":"VLOOKUP(H381,LanguageData,MATCH(LanguageChosen,Language[Language],0),FALSE) & \" - \" & B381","v":"Solid Fossil Fuels - KT"},2022]
["NONREN","TJ_NCV",null,"C33",null,null,null,"Non Renewable Waste",{"$f":"VLOOKUP(D382, Param_Multilanguage!A:C, MATCH(LanguageChosen,Language[Language],0)+1, FALSE)","v":"Repair and installation of machinery and equipment"},{"$f":"VLOOKUP(H382,LanguageData,MATCH(LanguageChosen,Language[Language],0),FALSE) & \" - \" & B382","v":"Non Renewable Waste - TJ_NCV"},2022]
["HYDROGEN","TJ_NCV",null,"C33",null,null,null,"Hydrogen",{"$f":"VLOOKUP(D383, Param_Multilanguage!A:C, MATCH(LanguageChosen,Language[Language],0)+1, FALSE)","v":"Repair and installation of machinery and equipment"},{"$f":"VLOOKUP(H383,LanguageData,MATCH(LanguageChosen,Language[Language],0),FALSE) & \" - \" & B383","v":"Hydrogen - TJ_NCV"},2022]
["ELECTR","GWH",null,"E",null,null,null,"Electricity",{"$f":"VLOOKUP(D384, Param_Multilanguage!A:C, MATCH(LanguageChosen,Language[Language],0)+1, FALSE)","v":"Water supply; sewerage, waste management and remediation activities"},{"$f":"VLOOKUP(H384,LanguageData,MATCH(LanguageChosen,Language[Language],0),FALSE) & \" - \" & B384","v":"Electricity - GWH"},2022]
["NATGAS","TJ_GCV",null,"E",null,null,null,"Natural Gas",{"$f":"VLOOKUP(D385, Param_Multilanguage!A:C, MATCH(LanguageChosen,Language[Language],0)+1, FALSE)","v":"Water supply; sewerage, waste management and remediation activities"},{"$f":"VLOOKUP(H385,LanguageData,MATCH(LanguageChosen,Language[Language],0),FALSE) & \" - \" & B385","v":"Natural Gas - TJ_GCV"},2022]
["HEAT","TJ_NCV",null,"E",null,null,null,"Derived Heat",{"$f":"VLOOKUP(D386, Param_Multilanguage!A:C, MATCH(LanguageChosen,Language[Language],0)+1, FALSE)","v":"Water supply; sewerage, waste management and remediation activities"},{"$f":"VLOOKUP(H386,LanguageData,MATCH(LanguageChosen,Language[Language],0),FALSE) & \" - \" & B386","v":"Derived Heat - TJ_NCV"},2022]
["TOTALOIL","KT",null,"E",null,null,null,"Oil and Petroleum Products",{"$f":"VLOOKUP(D387, Param_Multilanguage!A:C, MATCH(LanguageChosen,Language[Language],0)+1, FALSE)","v":"Water supply; sewerage, waste management and remediation activities"},{"$f":"VLOOKUP(H387,LanguageData,MATCH(LanguageChosen,Language[Language],0),FALSE) & \" - \" & B387","v":"Oil and Petroleum Products - KT"},2022]
["REN","TJ_NCV",null,"E",null,null,null,"Renewable Energies",{"$f":"VLOOKUP(D388, Param_Multilanguage!A:C, MATCH(LanguageChosen,Language[Language],0)+1, FALSE)","v":"Water supply; sewerage, waste management and remediation activities"},{"$f":"VLOOKUP(H388,LanguageData,MATCH(LanguageChosen,Language[Language],0),FALSE) & \" - \" & B388","v":"Renewable Energies - TJ_NCV"},2022]
["COAL","KT",null,"E",null,null,null,"Solid Fossil Fuels",{"$f":"VLOOKUP(D389, Param_Multilanguage!A:C, MATCH(LanguageChosen,Language[Language],0)+1, FALSE)","v":"Water supply; sewerage, waste management and remediation activities"},{"$f":"VLOOKUP(H389,LanguageData,MATCH(LanguageChosen,Language[Language],0),FALSE) & \" - \" & B389","v":"Solid Fossil Fuels - KT"},2022]
["NONREN","TJ_NCV",null,"E",null,null,null,"Non Renewable Waste",{"$f":"VLOOKUP(D390, Param_Multilanguage!A:C, MATCH(LanguageChosen,Language[Language],0)+1, FALSE)","v":"Water supply; sewerage, waste management and remediation activities"},{"$f":"VLOOKUP(H390,LanguageData,MATCH(LanguageChosen,Language[Language],0),FALSE) & \" - \" & B390","v":"Non Renewable Waste - TJ_NCV"},2022]
["HYDROGEN","TJ_NCV",null,"E",null,null,null,"Hydrogen",{"$f":"VLOOKUP(D391, Param_Multilanguage!A:C, MATCH(LanguageChosen,Language[Language],0)+1, FALSE)","v":"Water supply; sewerage, waste management and remediation activities"},{"$f":"VLOOKUP(H391,LanguageData,MATCH(LanguageChosen,Language[Language],0),FALSE) & \" - \" & B391","v":"Hydrogen - TJ_NCV"},2022]
["ELECTR","GWH",null,"G",null,null,null,"Electricity",{"$f":"VLOOKUP(D392, Param_Multilanguage!A:C, MATCH(LanguageChosen,Language[Language],0)+1, FALSE)","v":"Wholesale and retail trade; repair of motor vehicles and motorcycles"},{"$f":"VLOOKUP(H392,LanguageData,MATCH(LanguageChosen,Language[Language],0),FALSE) & \" - \" & B392","v":"Electricity - GWH"},2022]
["NATGAS","TJ_GCV",null,"G",null,null,null,"Natural Gas",{"$f":"VLOOKUP(D393, Param_Multilanguage!A:C, MATCH(LanguageChosen,Language[Language],0)+1, FALSE)","v":"Wholesale and retail trade; repair of motor vehicles and motorcycles"},{"$f":"VLOOKUP(H393,LanguageData,MATCH(LanguageChosen,Language[Language],0),FALSE) & \" - \" & B393","v":"Natural Gas - TJ_GCV"},2022]
["HEAT","TJ_NCV",null,"G",null,null,null,"Derived Heat",{"$f":"VLOOKUP(D394, Param_Multilanguage!A:C, MATCH(LanguageChosen,Language[Language],0)+1, FALSE)","v":"Wholesale and retail trade; repair of motor vehicles and motorcycles"},{"$f":"VLOOKUP(H394,LanguageData,MATCH(LanguageChosen,Language[Language],0),FALSE) & \" - \" & B394","v":"Derived Heat - TJ_NCV"},2022]
["TOTALOIL","KT",null,"G",null,null,null,"Oil and Petroleum Products",{"$f":"VLOOKUP(D395, Param_Multilanguage!A:C, MATCH(LanguageChosen,Language[Language],0)+1, FALSE)","v":"Wholesale and retail trade; repair of motor vehicles and motorcycles"},{"$f":"VLOOKUP(H395,LanguageData,MATCH(LanguageChosen,Language[Language],0),FALSE) & \" - \" & B395","v":"Oil and Petroleum Products - KT"},2022]
["REN","TJ_NCV",null,"G",null,null,null,"Renewable Energies",{"$f":"VLOOKUP(D396, Param_Multilanguage!A:C, MATCH(LanguageChosen,Language[Language],0)+1, FALSE)","v":"Wholesale and retail trade; repair of motor vehicles and motorcycles"},{"$f":"VLOOKUP(H396,LanguageData,MATCH(LanguageChosen,Language[Language],0),FALSE) & \" - \" & B396","v":"Renewable Energies - TJ_NCV"},2022]
["COAL","KT",null,"G",null,null,null,"Solid Fossil Fuels",{"$f":"VLOOKUP(D397, Param_Multilanguage!A:C, MATCH(LanguageChosen,Language[Language],0)+1, FALSE)","v":"Wholesale and retail trade; repair of motor vehicles and motorcycles"},{"$f":"VLOOKUP(H397,LanguageData,MATCH(LanguageChosen,Language[Language],0),FALSE) & \" - \" & B397","v":"Solid Fossil Fuels - KT"},2022]
["NONREN","TJ_NCV",null,"G",null,null,null,"Non Renewable Waste",{"$f":"VLOOKUP(D398, Param_Multilanguage!A:C, MATCH(LanguageChosen,Language[Language],0)+1, FALSE)","v":"Wholesale and retail trade; repair of motor vehicles and motorcycles"},{"$f":"VLOOKUP(H398,LanguageData,MATCH(LanguageChosen,Language[Language],0),FALSE) & \" - \" & B398","v":"Non Renewable Waste - TJ_NCV"},2022]
["HYDROGEN","TJ_NCV",null,"G",null,null,null,"Hydrogen",{"$f":"VLOOKUP(D399, Param_Multilanguage!A:C, MATCH(LanguageChosen,Language[Language],0)+1, FALSE)","v":"Wholesale and retail trade; repair of motor vehicles and motorcycles"},{"$f":"VLOOKUP(H399,LanguageData,MATCH(LanguageChosen,Language[Language],0),FALSE) & \" - \" & B399","v":"Hydrogen - TJ_NCV"},2022]
["ELECTR","GWH",null,"G46",null,null,null,"Electricity",{"$f":"VLOOKUP(D400, Param_Multilanguage!A:C, MATCH(LanguageChosen,Language[Language],0)+1, FALSE)","v":"Wholesale trade, except of motor vehicles and motorcycles"},{"$f":"VLOOKUP(H400,LanguageData,MATCH(LanguageChosen,Language[Language],0),FALSE) & \" - \" & B400","v":"Electricity - GWH"},2022]
["NATGAS","TJ_GCV",null,"G46",null,null,null,"Natural Gas",{"$f":"VLOOKUP(D401, Param_Multilanguage!A:C, MATCH(LanguageChosen,Language[Language],0)+1, FALSE)","v":"Wholesale trade, except of motor vehicles and motorcycles"},{"$f":"VLOOKUP(H401,LanguageData,MATCH(LanguageChosen,Language[Language],0),FALSE) & \" - \" & B401","v":"Natural Gas - TJ_GCV"},2022]
["HEAT","TJ_NCV",null,"G46",null,null,null,"Derived Heat",{"$f":"VLOOKUP(D402, Param_Multilanguage!A:C, MATCH(LanguageChosen,Language[Language],0)+1, FALSE)","v":"Wholesale trade, except of motor vehicles and motorcycles"},{"$f":"VLOOKUP(H402,LanguageData,MATCH(LanguageChosen,Language[Language],0),FALSE) & \" - \" & B402","v":"Derived Heat - TJ_NCV"},2022]
["TOTALOIL","KT",null,"G46",null,null,null,"Oil and Petroleum Products",{"$f":"VLOOKUP(D403, Param_Multilanguage!A:C, MATCH(LanguageChosen,Language[Language],0)+1, FALSE)","v":"Wholesale trade, except of motor vehicles and motorcycles"},{"$f":"VLOOKUP(H403,LanguageData,MATCH(LanguageChosen,Language[Language],0),FALSE) & \" - \" & B403","v":"Oil and Petroleum Products - KT"},2022]
["REN","TJ_NCV",null,"G46",null,null,null,"Renewable Energies",{"$f":"VLOOKUP(D404, Param_Multilanguage!A:C, MATCH(LanguageChosen,Language[Language],0)+1, FALSE)","v":"Wholesale trade, except of motor vehicles and motorcycles"},{"$f":"VLOOKUP(H404,LanguageData,MATCH(LanguageChosen,Language[Language],0),FALSE) & \" - \" & B404","v":"Renewable Energies - TJ_NCV"},2022]
["COAL","KT",null,"G46",null,null,null,"Solid Fossil Fuels",{"$f":"VLOOKUP(D405, Param_Multilanguage!A:C, MATCH(LanguageChosen,Language[Language],0)+1, FALSE)","v":"Wholesale trade, except of motor vehicles and motorcycles"},{"$f":"VLOOKUP(H405,LanguageData,MATCH(LanguageChosen,Language[Language],0),FALSE) & \" - \" & B405","v":"Solid Fossil Fuels - KT"},2022]
["NONREN","TJ_NCV",null,"G46",null,null,null,"Non Renewable Waste",{"$f":"VLOOKUP(D406, Param_Multilanguage!A:C, MATCH(LanguageChosen,Language[Language],0)+1, FALSE)","v":"Wholesale trade, except of motor vehicles and motorcycles"},{"$f":"VLOOKUP(H406,LanguageData,MATCH(LanguageChosen,Language[Language],0),FALSE) & \" - \" & B406","v":"Non Renewable Waste - TJ_NCV"},2022]
["HYDROGEN","TJ_NCV",null,"G46",null,null,null,"Hydrogen",{"$f":"VLOOKUP(D407, Param_Multilanguage!A:C, MATCH(LanguageChosen,Language[Language],0)+1, FALSE)","v":"Wholesale trade, except of motor vehicles and motorcycles"},{"$f":"VLOOKUP(H407,LanguageData,MATCH(LanguageChosen,Language[Language],0),FALSE) & \" - \" & B407","v":"Hydrogen - TJ_NCV"},2022]
["ELECTR","GWH",null,"G47",null,null,null,"Electricity",{"$f":"VLOOKUP(D408, Param_Multilanguage!A:C, MATCH(LanguageChosen,Language[Language],0)+1, FALSE)","v":"Retail trade, except of motor vehicles and motorcycles"},{"$f":"VLOOKUP(H408,LanguageData,MATCH(LanguageChosen,Language[Language],0),FALSE) & \" - \" & B408","v":"Electricity - GWH"},2022]
["NATGAS","TJ_GCV",null,"G47",null,null,null,"Natural Gas",{"$f":"VLOOKUP(D409, Param_Multilanguage!A:C, MATCH(LanguageChosen,Language[Language],0)+1, FALSE)","v":"Retail trade, except of motor vehicles and motorcycles"},{"$f":"VLOOKUP(H409,LanguageData,MATCH(LanguageChosen,Language[Language],0),FALSE) & \" - \" & B409","v":"Natural Gas - TJ_GCV"},2022]
["HEAT","TJ_NCV",null,"G47",null,null,null,"Derived Heat",{"$f":"VLOOKUP(D410, Param_Multilanguage!A:C, MATCH(LanguageChosen,Language[Language],0)+1, FALSE)","v":"Retail trade, except of motor vehicles and motorcycles"},{"$f":"VLOOKUP(H410,LanguageData,MATCH(LanguageChosen,Language[Language],0),FALSE) & \" - \" & B410","v":"Derived Heat - TJ_NCV"},2022]
["TOTALOIL","KT",null,"G47",null,null,null,"Oil and Petroleum Products",{"$f":"VLOOKUP(D411, Param_Multilanguage!A:C, MATCH(LanguageChosen,Language[Language],0)+1, FALSE)","v":"Retail trade, except of motor vehicles and motorcycles"},{"$f":"VLOOKUP(H411,LanguageData,MATCH(LanguageChosen,Language[Language],0),FALSE) & \" - \" & B411","v":"Oil and Petroleum Products - KT"},2022]
["REN","TJ_NCV",null,"G47",null,null,null,"Renewable Energies",{"$f":"VLOOKUP(D412, Param_Multilanguage!A:C, MATCH(LanguageChosen,Language[Language],0)+1, FALSE)","v":"Retail trade, except of motor vehicles and motorcycles"},{"$f":"VLOOKUP(H412,LanguageData,MATCH(LanguageChosen,Language[Language],0),FALSE) & \" - \" & B412","v":"Renewable Energies - TJ_NCV"},2022]
["COAL","KT",null,"G47",null,null,null,"Solid Fossil Fuels",{"$f":"VLOOKUP(D413, Param_Multilanguage!A:C, MATCH(LanguageChosen,Language[Language],0)+1, FALSE)","v":"Retail trade, except of motor vehicles and motorcycles"},{"$f":"VLOOKUP(H413,LanguageData,MATCH(LanguageChosen,Language[Language],0),FALSE) & \" - \" & B413","v":"Solid Fossil Fuels - KT"},2022]
["NONREN","TJ_NCV",null,"G47",null,null,null,"Non Renewable Waste",{"$f":"VLOOKUP(D414, Param_Multilanguage!A:C, MATCH(LanguageChosen,Language[Language],0)+1, FALSE)","v":"Retail trade, except of motor vehicles and motorcycles"},{"$f":"VLOOKUP(H414,LanguageData,MATCH(LanguageChosen,Language[Language],0),FALSE) & \" - \" & B414","v":"Non Renewable Waste - TJ_NCV"},2022]
["HYDROGEN","TJ_NCV",null,"G47",null,null,null,"Hydrogen",{"$f":"VLOOKUP(D415, Param_Multilanguage!A:C, MATCH(LanguageChosen,Language[Language],0)+1, FALSE)","v":"Retail trade, except of motor vehicles and motorcycles"},{"$f":"VLOOKUP(H415,LanguageData,MATCH(LanguageChosen,Language[Language],0),FALSE) & \" - \" & B415","v":"Hydrogen - TJ_NCV"},2022]
["ELECTR","GWH",null,"H52",null,null,null,"Electricity",{"$f":"VLOOKUP(D416, Param_Multilanguage!A:C, MATCH(LanguageChosen,Language[Language],0)+1, FALSE)","v":"Warehousing and support activities for transportation"},{"$f":"VLOOKUP(H416,LanguageData,MATCH(LanguageChosen,Language[Language],0),FALSE) & \" - \" & B416","v":"Electricity - GWH"},2022]
["NATGAS","TJ_GCV",null,"H52",null,null,null,"Natural Gas",{"$f":"VLOOKUP(D417, Param_Multilanguage!A:C, MATCH(LanguageChosen,Language[Language],0)+1, FALSE)","v":"Warehousing and support activities for transportation"},{"$f":"VLOOKUP(H417,LanguageData,MATCH(LanguageChosen,Language[Language],0),FALSE) & \" - \" & B417","v":"Natural Gas - TJ_GCV"},2022]
["HEAT","TJ_NCV",null,"H52",null,null,null,"Derived Heat",{"$f":"VLOOKUP(D418, Param_Multilanguage!A:C, MATCH(LanguageChosen,Language[Language],0)+1, FALSE)","v":"Warehousing and support activities for transportation"},{"$f":"VLOOKUP(H418,LanguageData,MATCH(LanguageChosen,Language[Language],0),FALSE) & \" - \" & B418","v":"Derived Heat - TJ_NCV"},2022]
["TOTALOIL","KT",null,"H52",null,null,null,"Oil and Petroleum Products",{"$f":"VLOOKUP(D419, Param_Multilanguage!A:C, MATCH(LanguageChosen,Language[Language],0)+1, FALSE)","v":"Warehousing and support activities for transportation"},{"$f":"VLOOKUP(H419,LanguageData,MATCH(LanguageChosen,Language[Language],0),FALSE) & \" - \" & B419","v":"Oil and Petroleum Products - KT"},2022]
["REN","TJ_NCV",null,"H52",null,null,null,"Renewable Energies",{"$f":"VLOOKUP(D420, Param_Multilanguage!A:C, MATCH(LanguageChosen,Language[Language],0)+1, FALSE)","v":"Warehousing and support activities for transportation"},{"$f":"VLOOKUP(H420,LanguageData,MATCH(LanguageChosen,Language[Language],0),FALSE) & \" - \" & B420","v":"Renewable Energies - TJ_NCV"},2022]
["COAL","KT",null,"H52",null,null,null,"Solid Fossil Fuels",{"$f":"VLOOKUP(D421, Param_Multilanguage!A:C, MATCH(LanguageChosen,Language[Language],0)+1, FALSE)","v":"Warehousing and support activities for transportation"},{"$f":"VLOOKUP(H421,LanguageData,MATCH(LanguageChosen,Language[Language],0),FALSE) & \" - \" & B421","v":"Solid Fossil Fuels - KT"},2022]
["NONREN","TJ_NCV",null,"H52",null,null,null,"Non Renewable Waste",{"$f":"VLOOKUP(D422, Param_Multilanguage!A:C, MATCH(LanguageChosen,Language[Language],0)+1, FALSE)","v":"Warehousing and support activities for transportation"},{"$f":"VLOOKUP(H422,LanguageData,MATCH(LanguageChosen,Language[Language],0),FALSE) & \" - \" & B422","v":"Non Renewable Waste - TJ_NCV"},2022]
["HYDROGEN","TJ_NCV",null,"H52",null,null,null,"Hydrogen",{"$f":"VLOOKUP(D423, Param_Multilanguage!A:C, MATCH(LanguageChosen,Language[Language],0)+1, FALSE)","v":"Warehousing and support activities for transportation"},{"$f":"VLOOKUP(H423,LanguageData,MATCH(LanguageChosen,Language[Language],0),FALSE) & \" - \" & B423","v":"Hydrogen - TJ_NCV"},2022]
["ELECTR","GWH",null,"H53",null,null,null,"Electricity",{"$f":"VLOOKUP(D424, Param_Multilanguage!A:C, MATCH(LanguageChosen,Language[Language],0)+1, FALSE)","v":"Postal and courier activities"},{"$f":"VLOOKUP(H424,LanguageData,MATCH(LanguageChosen,Language[Language],0),FALSE) & \" - \" & B424","v":"Electricity - GWH"},2022]
["NATGAS","TJ_GCV",null,"H53",null,null,null,"Natural Gas",{"$f":"VLOOKUP(D425, Param_Multilanguage!A:C, MATCH(LanguageChosen,Language[Language],0)+1, FALSE)","v":"Postal and courier activities"},{"$f":"VLOOKUP(H425,LanguageData,MATCH(LanguageChosen,Language[Language],0),FALSE) & \" - \" & B425","v":"Natural Gas - TJ_GCV"},2022]
["HEAT","TJ_NCV",null,"H53",null,null,null,"Derived Heat",{"$f":"VLOOKUP(D426, Param_Multilanguage!A:C, MATCH(LanguageChosen,Language[Language],0)+1, FALSE)","v":"Postal and courier activities"},{"$f":"VLOOKUP(H426,LanguageData,MATCH(LanguageChosen,Language[Language],0),FALSE) & \" - \" & B426","v":"Derived Heat - TJ_NCV"},2022]
["TOTALOIL","KT",null,"H53",null,null,null,"Oil and Petroleum Products",{"$f":"VLOOKUP(D427, Param_Multilanguage!A:C, MATCH(LanguageChosen,Language[Language],0)+1, FALSE)","v":"Postal and courier activities"},{"$f":"VLOOKUP(H427,LanguageData,MATCH(LanguageChosen,Language[Language],0),FALSE) & \" - \" & B427","v":"Oil and Petroleum Products - KT"},2022]
["REN","TJ_NCV",null,"H53",null,null,null,"Renewable Energies",{"$f":"VLOOKUP(D428, Param_Multilanguage!A:C, MATCH(LanguageChosen,Language[Language],0)+1, FALSE)","v":"Postal and courier activities"},{"$f":"VLOOKUP(H428,LanguageData,MATCH(LanguageChosen,Language[Language],0),FALSE) & \" - \" & B428","v":"Renewable Energies - TJ_NCV"},2022]
["COAL","KT",null,"H53",null,null,null,"Solid Fossil Fuels",{"$f":"VLOOKUP(D429, Param_Multilanguage!A:C, MATCH(LanguageChosen,Language[Language],0)+1, FALSE)","v":"Postal and courier activities"},{"$f":"VLOOKUP(H429,LanguageData,MATCH(LanguageChosen,Language[Language],0),FALSE) & \" - \" & B429","v":"Solid Fossil Fuels - KT"},2022]
["NONREN","TJ_NCV",null,"H53",null,null,null,"Non Renewable Waste",{"$f":"VLOOKUP(D430, Param_Multilanguage!A:C, MATCH(LanguageChosen,Language[Language],0)+1, FALSE)","v":"Postal and courier activities"},{"$f":"VLOOKUP(H430,LanguageData,MATCH(LanguageChosen,Language[Language],0),FALSE) & \" - \" & B430","v":"Non Renewable Waste - TJ_NCV"},2022]
["HYDROGEN","TJ_NCV",null,"H53",null,null,null,"Hydrogen",{"$f":"VLOOKUP(D431, Param_Multilanguage!A:C, MATCH(LanguageChosen,Language[Language],0)+1, FALSE)","v":"Postal and courier activities"},{"$f":"VLOOKUP(H431,LanguageData,MATCH(LanguageChosen,Language[Language],0),FALSE) & \" - \" & B431","v":"Hydrogen - TJ_NCV"},2022]
["ELECTR","GWH",null,"I",null,null,null,"Electricity",{"$f":"VLOOKUP(D432, Param_Multilanguage!A:C, MATCH(LanguageChosen,Language[Language],0)+1, FALSE)","v":"Accommodation and food services activities"},{"$f":"VLOOKUP(H432,LanguageData,MATCH(LanguageChosen,Language[Language],0),FALSE) & \" - \" & B432","v":"Electricity - GWH"},2022]
["NATGAS","TJ_GCV",null,"I",null,null,null,"Natural Gas",{"$f":"VLOOKUP(D433, Param_Multilanguage!A:C, MATCH(LanguageChosen,Language[Language],0)+1, FALSE)","v":"Accommodation and food services activities"},{"$f":"VLOOKUP(H433,LanguageData,MATCH(LanguageChosen,Language[Language],0),FALSE) & \" - \" & B433","v":"Natural Gas - TJ_GCV"},2022]
["HEAT","TJ_NCV",null,"I",null,null,null,"Derived Heat",{"$f":"VLOOKUP(D434, Param_Multilanguage!A:C, MATCH(LanguageChosen,Language[Language],0)+1, FALSE)","v":"Accommodation and food services activities"},{"$f":"VLOOKUP(H434,LanguageData,MATCH(LanguageChosen,Language[Language],0),FALSE) & \" - \" & B434","v":"Derived Heat - TJ_NCV"},2022]
["TOTALOIL","KT",null,"I",null,null,null,"Oil and Petroleum Products",{"$f":"VLOOKUP(D435, Param_Multilanguage!A:C, MATCH(LanguageChosen,Language[Language],0)+1, FALSE)","v":"Accommodation and food services activities"},{"$f":"VLOOKUP(H435,LanguageData,MATCH(LanguageChosen,Language[Language],0),FALSE) & \" - \" & B435","v":"Oil and Petroleum Products - KT"},2022]
["REN","TJ_NCV",null,"I",null,null,null,"Renewable Energies",{"$f":"VLOOKUP(D436, Param_Multilanguage!A:C, MATCH(LanguageChosen,Language[Language],0)+1, FALSE)","v":"Accommodation and food services activities"},{"$f":"VLOOKUP(H436,LanguageData,MATCH(LanguageChosen,Language[Language],0),FALSE) & \" - \" & B436","v":"Renewable Energies - TJ_NCV"},2022]
["COAL","KT",null,"I",null,null,null,"Solid Fossil Fuels",{"$f":"VLOOKUP(D437, Param_Multilanguage!A:C, MATCH(LanguageChosen,Language[Language],0)+1, FALSE)","v":"Accommodation and food services activities"},{"$f":"VLOOKUP(H437,LanguageData,MATCH(LanguageChosen,Language[Language],0),FALSE) & \" - \" & B437","v":"Solid Fossil Fuels - KT"},2022]
["NONREN","TJ_NCV",null,"I",null,null,null,"Non Renewable Waste",{"$f":"VLOOKUP(D438, Param_Multilanguage!A:C, MATCH(LanguageChosen,Language[Language],0)+1, FALSE)","v":"Accommodation and food services activities"},{"$f":"VLOOKUP(H438,LanguageData,MATCH(LanguageChosen,Language[Language],0),FALSE) & \" - \" & B438","v":"Non Renewable Waste - TJ_NCV"},2022]
["HYDROGEN","TJ_NCV",null,"I",null,null,null,"Hydrogen",{"$f":"VLOOKUP(D439, Param_Multilanguage!A:C, MATCH(LanguageChosen,Language[Language],0)+1, FALSE)","v":"Accommodation and food services activities"},{"$f":"VLOOKUP(H439,LanguageData,MATCH(LanguageChosen,Language[Language],0),FALSE) & \" - \" & B439","v":"Hydrogen - TJ_NCV"},2022]
["ELECTR","GWH",null,"I55",null,null,null,"Electricity",{"$f":"VLOOKUP(D440, Param_Multilanguage!A:C, MATCH(LanguageChosen,Language[Language],0)+1, FALSE)","v":"Accommodation"},{"$f":"VLOOKUP(H440,LanguageData,MATCH(LanguageChosen,Language[Language],0),FALSE) & \" - \" & B440","v":"Electricity - GWH"},2022]
["NATGAS","TJ_GCV",null,"I55",null,null,null,"Natural Gas",{"$f":"VLOOKUP(D441, Param_Multilanguage!A:C, MATCH(LanguageChosen,Language[Language],0)+1, FALSE)","v":"Accommodation"},{"$f":"VLOOKUP(H441,LanguageData,MATCH(LanguageChosen,Language[Language],0),FALSE) & \" - \" & B441","v":"Natural Gas - TJ_GCV"},2022]
["HEAT","TJ_NCV",null,"I55",null,null,null,"Derived Heat",{"$f":"VLOOKUP(D442, Param_Multilanguage!A:C, MATCH(LanguageChosen,Language[Language],0)+1, FALSE)","v":"Accommodation"},{"$f":"VLOOKUP(H442,LanguageData,MATCH(LanguageChosen,Language[Language],0),FALSE) & \" - \" & B442","v":"Derived Heat - TJ_NCV"},2022]
["TOTALOIL","KT",null,"I55",null,null,null,"Oil and Petroleum Products",{"$f":"VLOOKUP(D443, Param_Multilanguage!A:C, MATCH(LanguageChosen,Language[Language],0)+1, FALSE)","v":"Accommodation"},{"$f":"VLOOKUP(H443,LanguageData,MATCH(LanguageChosen,Language[Language],0),FALSE) & \" - \" & B443","v":"Oil and Petroleum Products - KT"},2022]
["REN","TJ_NCV",null,"I55",null,null,null,"Renewable Energies",{"$f":"VLOOKUP(D444, Param_Multilanguage!A:C, MATCH(LanguageChosen,Language[Language],0)+1, FALSE)","v":"Accommodation"},{"$f":"VLOOKUP(H444,LanguageData,MATCH(LanguageChosen,Language[Language],0),FALSE) & \" - \" & B444","v":"Renewable Energies - TJ_NCV"},2022]
["COAL","KT",null,"I55",null,null,null,"Solid Fossil Fuels",{"$f":"VLOOKUP(D445, Param_Multilanguage!A:C, MATCH(LanguageChosen,Language[Language],0)+1, FALSE)","v":"Accommodation"},{"$f":"VLOOKUP(H445,LanguageData,MATCH(LanguageChosen,Language[Language],0),FALSE) & \" - \" & B445","v":"Solid Fossil Fuels - KT"},2022]
["NONREN","TJ_NCV",null,"I55",null,null,null,"Non Renewable Waste",{"$f":"VLOOKUP(D446, Param_Multilanguage!A:C, MATCH(LanguageChosen,Language[Language],0)+1, FALSE)","v":"Accommodation"},{"$f":"VLOOKUP(H446,LanguageData,MATCH(LanguageChosen,Language[Language],0),FALSE) & \" - \" & B446","v":"Non Renewable Waste - TJ_NCV"},2022]
["HYDROGEN","TJ_NCV",null,"I55",null,null,null,"Hydrogen",{"$f":"VLOOKUP(D447, Param_Multilanguage!A:C, MATCH(LanguageChosen,Language[Language],0)+1, FALSE)","v":"Accommodation"},{"$f":"VLOOKUP(H447,LanguageData,MATCH(LanguageChosen,Language[Language],0),FALSE) & \" - \" & B447","v":"Hydrogen - TJ_NCV"},2022]
["ELECTR","GWH",null,"I56",null,null,null,"Electricity",{"$f":"VLOOKUP(D448, Param_Multilanguage!A:C, MATCH(LanguageChosen,Language[Language],0)+1, FALSE)","v":"Food and beverage services activities"},{"$f":"VLOOKUP(H448,LanguageData,MATCH(LanguageChosen,Language[Language],0),FALSE) & \" - \" & B448","v":"Electricity - GWH"},2022]
["NATGAS","TJ_GCV",null,"I56",null,null,null,"Natural Gas",{"$f":"VLOOKUP(D449, Param_Multilanguage!A:C, MATCH(LanguageChosen,Language[Language],0)+1, FALSE)","v":"Food and beverage services activities"},{"$f":"VLOOKUP(H449,LanguageData,MATCH(LanguageChosen,Language[Language],0),FALSE) & \" - \" & B449","v":"Natural Gas - TJ_GCV"},2022]
["HEAT","TJ_NCV",null,"I56",null,null,null,"Derived Heat",{"$f":"VLOOKUP(D450, Param_Multilanguage!A:C, MATCH(LanguageChosen,Language[Language],0)+1, FALSE)","v":"Food and beverage services activities"},{"$f":"VLOOKUP(H450,LanguageData,MATCH(LanguageChosen,Language[Language],0),FALSE) & \" - \" & B450","v":"Derived Heat - TJ_NCV"},2022]
["TOTALOIL","KT",null,"I56",null,null,null,"Oil and Petroleum Products",{"$f":"VLOOKUP(D451, Param_Multilanguage!A:C, MATCH(LanguageChosen,Language[Language],0)+1, FALSE)","v":"Food and beverage services activities"},{"$f":"VLOOKUP(H451,LanguageData,MATCH(LanguageChosen,Language[Language],0),FALSE) & \" - \" & B451","v":"Oil and Petroleum Products - KT"},2022]
["REN","TJ_NCV",null,"I56",null,null,null,"Renewable Energies",{"$f":"VLOOKUP(D452, Param_Multilanguage!A:C, MATCH(LanguageChosen,Language[Language],0)+1, FALSE)","v":"Food and beverage services activities"},{"$f":"VLOOKUP(H452,LanguageData,MATCH(LanguageChosen,Language[Language],0),FALSE) & \" - \" & B452","v":"Renewable Energies - TJ_NCV"},2022]
["COAL","KT",null,"I56",null,null,null,"Solid Fossil Fuels",{"$f":"VLOOKUP(D453, Param_Multilanguage!A:C, MATCH(LanguageChosen,Language[Language],0)+1, FALSE)","v":"Food and beverage services activities"},{"$f":"VLOOKUP(H453,LanguageData,MATCH(LanguageChosen,Language[Language],0),FALSE) & \" - \" & B453","v":"Solid Fossil Fuels - KT"},2022]
["NONREN","TJ_NCV",null,"I56",null,null,null,"Non Renewable Waste",{"$f":"VLOOKUP(D454, Param_Multilanguage!A:C, MATCH(LanguageChosen,Language[Language],0)+1, FALSE)","v":"Food and beverage services activities"},{"$f":"VLOOKUP(H454,LanguageData,MATCH(LanguageChosen,Language[Language],0),FALSE) & \" - \" & B454","v":"Non Renewable Waste - TJ_NCV"},2022]
["HYDROGEN","TJ_NCV",null,"I56",null,null,null,"Hydrogen",{"$f":"VLOOKUP(D455, Param_Multilanguage!A:C, MATCH(LanguageChosen,Language[Language],0)+1, FALSE)","v":"Food and beverage services activities"},{"$f":"VLOOKUP(H455,LanguageData,MATCH(LanguageChosen,Language[Language],0),FALSE) & \" - \" & B455","v":"Hydrogen - TJ_NCV"},2022]
["ELECTR","GWH",null,"J",null,null,null,"Electricity",{"$f":"VLOOKUP(D456, Param_Multilanguage!A:C, MATCH(LanguageChosen,Language[Language],0)+1, FALSE)","v":"Information and communication"},{"$f":"VLOOKUP(H456,LanguageData,MATCH(LanguageChosen,Language[Language],0),FALSE) & \" - \" & B456","v":"Electricity - GWH"},2022]
["NATGAS","TJ_GCV",null,"J",null,null,null,"Natural Gas",{"$f":"VLOOKUP(D457, Param_Multilanguage!A:C, MATCH(LanguageChosen,Language[Language],0)+1, FALSE)","v":"Information and communication"},{"$f":"VLOOKUP(H457,LanguageData,MATCH(LanguageChosen,Language[Language],0),FALSE) & \" - \" & B457","v":"Natural Gas - TJ_GCV"},2022]
["HEAT","TJ_NCV",null,"J",null,null,null,"Derived Heat",{"$f":"VLOOKUP(D458, Param_Multilanguage!A:C, MATCH(LanguageChosen,Language[Language],0)+1, FALSE)","v":"Information and communication"},{"$f":"VLOOKUP(H458,LanguageData,MATCH(LanguageChosen,Language[Language],0),FALSE) & \" - \" & B458","v":"Derived Heat - TJ_NCV"},2022]
["TOTALOIL","KT",null,"J",null,null,null,"Oil and Petroleum Products",{"$f":"VLOOKUP(D459, Param_Multilanguage!A:C, MATCH(LanguageChosen,Language[Language],0)+1, FALSE)","v":"Information and communication"},{"$f":"VLOOKUP(H459,LanguageData,MATCH(LanguageChosen,Language[Language],0),FALSE) & \" - \" & B459","v":"Oil and Petroleum Products - KT"},2022]
["REN","TJ_NCV",null,"J",null,null,null,"Renewable Energies",{"$f":"VLOOKUP(D460, Param_Multilanguage!A:C, MATCH(LanguageChosen,Language[Language],0)+1, FALSE)","v":"Information and communication"},{"$f":"VLOOKUP(H460,LanguageData,MATCH(LanguageChosen,Language[Language],0),FALSE) & \" - \" & B460","v":"Renewable Energies - TJ_NCV"},2022]
["COAL","KT",null,"J",null,null,null,"Solid Fossil Fuels",{"$f":"VLOOKUP(D461, Param_Multilanguage!A:C, MATCH(LanguageChosen,Language[Language],0)+1, FALSE)","v":"Information and communication"},{"$f":"VLOOKUP(H461,LanguageData,MATCH(LanguageChosen,Language[Language],0),FALSE) & \" - \" & B461","v":"Solid Fossil Fuels - KT"},2022]
["NONREN","TJ_NCV",null,"J",null,null,null,"Non Renewable Waste",{"$f":"VLOOKUP(D462, Param_Multilanguage!A:C, MATCH(LanguageChosen,Language[Language],0)+1, FALSE)","v":"Information and communication"},{"$f":"VLOOKUP(H462,LanguageData,MATCH(LanguageChosen,Language[Language],0),FALSE) & \" - \" & B462","v":"Non Renewable Waste - TJ_NCV"},2022]
["HYDROGEN","TJ_NCV",null,"J",null,null,null,"Hydrogen",{"$f":"VLOOKUP(D463, Param_Multilanguage!A:C, MATCH(LanguageChosen,Language[Language],0)+1, FALSE)","v":"Information and communication"},{"$f":"VLOOKUP(H463,LanguageData,MATCH(LanguageChosen,Language[Language],0),FALSE) & \" - \" & B463","v":"Hydrogen - TJ_NCV"},2022]
["ELECTR","GWH",null,"K_L",null,null,null,"Electricity",{"$f":"VLOOKUP(D464, Param_Multilanguage!A:C, MATCH(LanguageChosen,Language[Language],0)+1, FALSE)","v":"Financial and insurance activities; real estate activities"},{"$f":"VLOOKUP(H464,LanguageData,MATCH(LanguageChosen,Language[Language],0),FALSE) & \" - \" & B464","v":"Electricity - GWH"},2022]
["NATGAS","TJ_GCV",null,"K_L",null,null,null,"Natural Gas",{"$f":"VLOOKUP(D465, Param_Multilanguage!A:C, MATCH(LanguageChosen,Language[Language],0)+1, FALSE)","v":"Financial and insurance activities; real estate activities"},{"$f":"VLOOKUP(H465,LanguageData,MATCH(LanguageChosen,Language[Language],0),FALSE) & \" - \" & B465","v":"Natural Gas - TJ_GCV"},2022]
["HEAT","TJ_NCV",null,"K_L",null,null,null,"Derived Heat",{"$f":"VLOOKUP(D466, Param_Multilanguage!A:C, MATCH(LanguageChosen,Language[Language],0)+1, FALSE)","v":"Financial and insurance activities; real estate activities"},{"$f":"VLOOKUP(H466,LanguageData,MATCH(LanguageChosen,Language[Language],0),FALSE) & \" - \" & B466","v":"Derived Heat - TJ_NCV"},2022]
["TOTALOIL","KT",null,"K_L",null,null,null,"Oil and Petroleum Products",{"$f":"VLOOKUP(D467, Param_Multilanguage!A:C, MATCH(LanguageChosen,Language[Language],0)+1, FALSE)","v":"Financial and insurance activities; real estate activities"},{"$f":"VLOOKUP(H467,LanguageData,MATCH(LanguageChosen,Language[Language],0),FALSE) & \" - \" & B467","v":"Oil and Petroleum Products - KT"},2022]
["REN","TJ_NCV",null,"K_L",null,null,null,"Renewable Energies",{"$f":"VLOOKUP(D468, Param_Multilanguage!A:C, MATCH(LanguageChosen,Language[Language],0)+1, FALSE)","v":"Financial and insurance activities; real estate activities"},{"$f":"VLOOKUP(H468,LanguageData,MATCH(LanguageChosen,Language[Language],0),FALSE) & \" - \" & B468","v":"Renewable Energies - TJ_NCV"},2022]
["COAL","KT",null,"K_L",null,null,null,"Solid Fossil Fuels",{"$f":"VLOOKUP(D469, Param_Multilanguage!A:C, MATCH(LanguageChosen,Language[Language],0)+1, FALSE)","v":"Financial and insurance activities; real estate activities"},{"$f":"VLOOKUP(H469,LanguageData,MATCH(LanguageChosen,Language[Language],0),FALSE) & \" - \" & B469","v":"Solid Fossil Fuels - KT"},2022]
["NONREN","TJ_NCV",null,"K_L",null,null,null,"Non Renewable Waste",{"$f":"VLOOKUP(D470, Param_Multilanguage!A:C, MATCH(LanguageChosen,Language[Language],0)+1, FALSE)","v":"Financial and insurance activities; real estate activities"},{"$f":"VLOOKUP(H470,LanguageData,MATCH(LanguageChosen,Language[Language],0),FALSE) & \" - \" & B470","v":"Non Renewable Waste - TJ_NCV"},2022]
["HYDROGEN","TJ_NCV",null,"K_L",null,null,null,"Hydrogen",{"$f":"VLOOKUP(D471, Param_Multilanguage!A:C, MATCH(LanguageChosen,Language[Language],0)+1, FALSE)","v":"Financial and insurance activities; real estate activities"},{"$f":"VLOOKUP(H471,LanguageData,MATCH(LanguageChosen,Language[Language],0),FALSE) & \" - \" & B471","v":"Hydrogen - TJ_NCV"},2022]
["ELECTR","GWH",null,"M_S",null,null,null,"Electricity",{"$f":"VLOOKUP(D472, Param_Multilanguage!A:C, MATCH(LanguageChosen,Language[Language],0)+1, FALSE)","v":"Professional, scientific and technical activities; other services"},{"$f":"VLOOKUP(H472,LanguageData,MATCH(LanguageChosen,Language[Language],0),FALSE) & \" - \" & B472","v":"Electricity - GWH"},2022]
["NATGAS","TJ_GCV",null,"M_S",null,null,null,"Natural Gas",{"$f":"VLOOKUP(D473, Param_Multilanguage!A:C, MATCH(LanguageChosen,Language[Language],0)+1, FALSE)","v":"Professional, scientific and technical activities; other services"},{"$f":"VLOOKUP(H473,LanguageData,MATCH(LanguageChosen,Language[Language],0),FALSE) & \" - \" & B473","v":"Natural Gas - TJ_GCV"},2022]
["HEAT","TJ_NCV",null,"M_S",null,null,null,"Derived Heat",{"$f":"VLOOKUP(D474, Param_Multilanguage!A:C, MATCH(LanguageChosen,Language[Language],0)+1, FALSE)","v":"Professional, scientific and technical activities; other services"},{"$f":"VLOOKUP(H474,LanguageData,MATCH(LanguageChosen,Language[Language],0),FALSE) & \" - \" & B474","v":"Derived Heat - TJ_NCV"},2022]
["TOTALOIL","KT",null,"M_S",null,null,null,"Oil and Petroleum Products",{"$f":"VLOOKUP(D475, Param_Multilanguage!A:C, MATCH(LanguageChosen,Language[Language],0)+1, FALSE)","v":"Professional, scientific and technical activities; other services"},{"$f":"VLOOKUP(H475,LanguageData,MATCH(LanguageChosen,Language[Language],0),FALSE) & \" - \" & B475","v":"Oil and Petroleum Products - KT"},2022]
["REN","TJ_NCV",null,"M_S",null,null,null,"Renewable Energies",{"$f":"VLOOKUP(D476, Param_Multilanguage!A:C, MATCH(LanguageChosen,Language[Language],0)+1, FALSE)","v":"Professional, scientific and technical activities; other services"},{"$f":"VLOOKUP(H476,LanguageData,MATCH(LanguageChosen,Language[Language],0),FALSE) & \" - \" & B476","v":"Renewable Energies - TJ_NCV"},2022]
["COAL","KT",null,"M_S",null,null,null,"Solid Fossil Fuels",{"$f":"VLOOKUP(D477, Param_Multilanguage!A:C, MATCH(LanguageChosen,Language[Language],0)+1, FALSE)","v":"Professional, scientific and technical activities; other services"},{"$f":"VLOOKUP(H477,LanguageData,MATCH(LanguageChosen,Language[Language],0),FALSE) & \" - \" & B477","v":"Solid Fossil Fuels - KT"},2022]
["NONREN","TJ_NCV",null,"M_S",null,null,null,"Non Renewable Waste",{"$f":"VLOOKUP(D478, Param_Multilanguage!A:C, MATCH(LanguageChosen,Language[Language],0)+1, FALSE)","v":"Professional, scientific and technical activities; other services"},{"$f":"VLOOKUP(H478,LanguageData,MATCH(LanguageChosen,Language[Language],0),FALSE) & \" - \" & B478","v":"Non Renewable Waste - TJ_NCV"},2022]
["HYDROGEN","TJ_NCV",null,"M_S",null,null,null,"Hydrogen",{"$f":"VLOOKUP(D479, Param_Multilanguage!A:C, MATCH(LanguageChosen,Language[Language],0)+1, FALSE)","v":"Professional, scientific and technical activities; other services"},{"$f":"VLOOKUP(H479,LanguageData,MATCH(LanguageChosen,Language[Language],0),FALSE) & \" - \" & B479","v":"Hydrogen - TJ_NCV"},2022]
["ELECTR","GWH",null,"N",null,null,null,"Electricity",{"$f":"VLOOKUP(D480, Param_Multilanguage!A:C, MATCH(LanguageChosen,Language[Language],0)+1, FALSE)","v":"Administrative and support services activities"},{"$f":"VLOOKUP(H480,LanguageData,MATCH(LanguageChosen,Language[Language],0),FALSE) & \" - \" & B480","v":"Electricity - GWH"},2022]
["NATGAS","TJ_GCV",null,"N",null,null,null,"Natural Gas",{"$f":"VLOOKUP(D481, Param_Multilanguage!A:C, MATCH(LanguageChosen,Language[Language],0)+1, FALSE)","v":"Administrative and support services activities"},{"$f":"VLOOKUP(H481,LanguageData,MATCH(LanguageChosen,Language[Language],0),FALSE) & \" - \" & B481","v":"Natural Gas - TJ_GCV"},2022]
["HEAT","TJ_NCV",null,"N",null,null,null,"Derived Heat",{"$f":"VLOOKUP(D482, Param_Multilanguage!A:C, MATCH(LanguageChosen,Language[Language],0)+1, FALSE)","v":"Administrative and support services activities"},{"$f":"VLOOKUP(H482,LanguageData,MATCH(LanguageChosen,Language[Language],0),FALSE) & \" - \" & B482","v":"Derived Heat - TJ_NCV"},2022]
["TOTALOIL","KT",null,"N",null,null,null,"Oil and Petroleum Products",{"$f":"VLOOKUP(D483, Param_Multilanguage!A:C, MATCH(LanguageChosen,Language[Language],0)+1, FALSE)","v":"Administrative and support services activities"},{"$f":"VLOOKUP(H483,LanguageData,MATCH(LanguageChosen,Language[Language],0),FALSE) & \" - \" & B483","v":"Oil and Petroleum Products - KT"},2022]
["REN","TJ_NCV",null,"N",null,null,null,"Renewable Energies",{"$f":"VLOOKUP(D484, Param_Multilanguage!A:C, MATCH(LanguageChosen,Language[Language],0)+1, FALSE)","v":"Administrative and support services activities"},{"$f":"VLOOKUP(H484,LanguageData,MATCH(LanguageChosen,Language[Language],0),FALSE) & \" - \" & B484","v":"Renewable Energies - TJ_NCV"},2022]
["COAL","KT",null,"N",null,null,null,"Solid Fossil Fuels",{"$f":"VLOOKUP(D485, Param_Multilanguage!A:C, MATCH(LanguageChosen,Language[Language],0)+1, FALSE)","v":"Administrative and support services activities"},{"$f":"VLOOKUP(H485,LanguageData,MATCH(LanguageChosen,Language[Language],0),FALSE) & \" - \" & B485","v":"Solid Fossil Fuels - KT"},2022]
["NONREN","TJ_NCV",null,"N",null,null,null,"Non Renewable Waste",{"$f":"VLOOKUP(D486, Param_Multilanguage!A:C, MATCH(LanguageChosen,Language[Language],0)+1, FALSE)","v":"Administrative and support services activities"},{"$f":"VLOOKUP(H486,LanguageData,MATCH(LanguageChosen,Language[Language],0),FALSE) & \" - \" & B486","v":"Non Renewable Waste - TJ_NCV"},2022]
["HYDROGEN","TJ_NCV",null,"N",null,null,null,"Hydrogen",{"$f":"VLOOKUP(D487, Param_Multilanguage!A:C, MATCH(LanguageChosen,Language[Language],0)+1, FALSE)","v":"Administrative and support services activities"},{"$f":"VLOOKUP(H487,LanguageData,MATCH(LanguageChosen,Language[Language],0),FALSE) & \" - \" & B487","v":"Hydrogen - TJ_NCV"},2022]
["ELECTR","GWH",null,"O",null,null,null,"Electricity",{"$f":"VLOOKUP(D488, Param_Multilanguage!A:C, MATCH(LanguageChosen,Language[Language],0)+1, FALSE)","v":"Public administration and defence; compulsory social security"},{"$f":"VLOOKUP(H488,LanguageData,MATCH(LanguageChosen,Language[Language],0),FALSE) & \" - \" & B488","v":"Electricity - GWH"},2022]
["NATGAS","TJ_GCV",null,"O",null,null,null,"Natural Gas",{"$f":"VLOOKUP(D489, Param_Multilanguage!A:C, MATCH(LanguageChosen,Language[Language],0)+1, FALSE)","v":"Public administration and defence; compulsory social security"},{"$f":"VLOOKUP(H489,LanguageData,MATCH(LanguageChosen,Language[Language],0),FALSE) & \" - \" & B489","v":"Natural Gas - TJ_GCV"},2022]
["HEAT","TJ_NCV",null,"O",null,null,null,"Derived Heat",{"$f":"VLOOKUP(D490, Param_Multilanguage!A:C, MATCH(LanguageChosen,Language[Language],0)+1, FALSE)","v":"Public administration and defence; compulsory social security"},{"$f":"VLOOKUP(H490,LanguageData,MATCH(LanguageChosen,Language[Language],0),FALSE) & \" - \" & B490","v":"Derived Heat - TJ_NCV"},2022]
["TOTALOIL","KT",null,"O",null,null,null,"Oil and Petroleum Products",{"$f":"VLOOKUP(D491, Param_Multilanguage!A:C, MATCH(LanguageChosen,Language[Language],0)+1, FALSE)","v":"Public administration and defence; compulsory social security"},{"$f":"VLOOKUP(H491,LanguageData,MATCH(LanguageChosen,Language[Language],0),FALSE) & \" - \" & B491","v":"Oil and Petroleum Products - KT"},2022]
["REN","TJ_NCV",null,"O",null,null,null,"Renewable Energies",{"$f":"VLOOKUP(D492, Param_Multilanguage!A:C, MATCH(LanguageChosen,Language[Language],0)+1, FALSE)","v":"Public administration and defence; compulsory social security"},{"$f":"VLOOKUP(H492,LanguageData,MATCH(LanguageChosen,Language[Language],0),FALSE) & \" - \" & B492","v":"Renewable Energies - TJ_NCV"},2022]
["COAL","KT",null,"O",null,null,null,"Solid Fossil Fuels",{"$f":"VLOOKUP(D493, Param_Multilanguage!A:C, MATCH(LanguageChosen,Language[Language],0)+1, FALSE)","v":"Public administration and defence; compulsory social security"},{"$f":"VLOOKUP(H493,LanguageData,MATCH(LanguageChosen,Language[Language],0),FALSE) & \" - \" & B493","v":"Solid Fossil Fuels - KT"},2022]
["NONREN","TJ_NCV",null,"O",null,null,null,"Non Renewable Waste",{"$f":"VLOOKUP(D494, Param_Multilanguage!A:C, MATCH(LanguageChosen,Language[Language],0)+1, FALSE)","v":"Public administration and defence; compulsory social security"},{"$f":"VLOOKUP(H494,LanguageData,MATCH(LanguageChosen,Language[Language],0),FALSE) & \" - \" & B494","v":"Non Renewable Waste - TJ_NCV"},2022]
["HYDROGEN","TJ_NCV",null,"O",null,null,null,"Hydrogen",{"$f":"VLOOKUP(D495, Param_Multilanguage!A:C, MATCH(LanguageChosen,Language[Language],0)+1, FALSE)","v":"Public administration and defence; compulsory social security"},{"$f":"VLOOKUP(H495,LanguageData,MATCH(LanguageChosen,Language[Language],0),FALSE) & \" - \" & B495","v":"Hydrogen - TJ_NCV"},2022]
["ELECTR","GWH",null,"P",null,null,null,"Electricity",{"$f":"VLOOKUP(D496, Param_Multilanguage!A:C, MATCH(LanguageChosen,Language[Language],0)+1, FALSE)","v":"Education"},{"$f":"VLOOKUP(H496,LanguageData,MATCH(LanguageChosen,Language[Language],0),FALSE) & \" - \" & B496","v":"Electricity - GWH"},2022]
["NATGAS","TJ_GCV",null,"P",null,null,null,"Natural Gas",{"$f":"VLOOKUP(D497, Param_Multilanguage!A:C, MATCH(LanguageChosen,Language[Language],0)+1, FALSE)","v":"Education"},{"$f":"VLOOKUP(H497,LanguageData,MATCH(LanguageChosen,Language[Language],0),FALSE) & \" - \" & B497","v":"Natural Gas - TJ_GCV"},2022]
["HEAT","TJ_NCV",null,"P",null,null,null,"Derived Heat",{"$f":"VLOOKUP(D498, Param_Multilanguage!A:C, MATCH(LanguageChosen,Language[Language],0)+1, FALSE)","v":"Education"},{"$f":"VLOOKUP(H498,LanguageData,MATCH(LanguageChosen,Language[Language],0),FALSE) & \" - \" & B498","v":"Derived Heat - TJ_NCV"},2022]
["TOTALOIL","KT",null,"P",null,null,null,"Oil and Petroleum Products",{"$f":"VLOOKUP(D499, Param_Multilanguage!A:C, MATCH(LanguageChosen,Language[Language],0)+1, FALSE)","v":"Education"},{"$f":"VLOOKUP(H499,LanguageData,MATCH(LanguageChosen,Language[Language],0),FALSE) & \" - \" & B499","v":"Oil and Petroleum Products - KT"},2022]
["REN","TJ_NCV",null,"P",null,null,null,"Renewable Energies",{"$f":"VLOOKUP(D500, Param_Multilanguage!A:C, MATCH(LanguageChosen,Language[Language],0)+1, FALSE)","v":"Education"},{"$f":"VLOOKUP(H500,LanguageData,MATCH(LanguageChosen,Language[Language],0),FALSE) & \" - \" & B500","v":"Renewable Energies - TJ_NCV"},2022]
["COAL","KT",null,"P",null,null,null,"Solid Fossil Fuels",{"$f":"VLOOKUP(D501, Param_Multilanguage!A:C, MATCH(LanguageChosen,Language[Language],0)+1, FALSE)","v":"Education"},{"$f":"VLOOKUP(H501,LanguageData,MATCH(LanguageChosen,Language[Language],0),FALSE) & \" - \" & B501","v":"Solid Fossil Fuels - KT"},2022]
["NONREN","TJ_NCV",null,"P",null,null,null,"Non Renewable Waste",{"$f":"VLOOKUP(D502, Param_Multilanguage!A:C, MATCH(LanguageChosen,Language[Language],0)+1, FALSE)","v":"Education"},{"$f":"VLOOKUP(H502,LanguageData,MATCH(LanguageChosen,Language[Language],0),FALSE) & \" - \" & B502","v":"Non Renewable Waste - TJ_NCV"},2022]
["HYDROGEN","TJ_NCV",null,"P",null,null,null,"Hydrogen",{"$f":"VLOOKUP(D503, Param_Multilanguage!A:C, MATCH(LanguageChosen,Language[Language],0)+1, FALSE)","v":"Education"},{"$f":"VLOOKUP(H503,LanguageData,MATCH(LanguageChosen,Language[Language],0),FALSE) & \" - \" & B503","v":"Hydrogen - TJ_NCV"},2022]
["ELECTR","GWH",null,"Q",null,null,null,"Electricity",{"$f":"VLOOKUP(D504, Param_Multilanguage!A:C, MATCH(LanguageChosen,Language[Language],0)+1, FALSE)","v":"Human health and social work activities"},{"$f":"VLOOKUP(H504,LanguageData,MATCH(LanguageChosen,Language[Language],0),FALSE) & \" - \" & B504","v":"Electricity - GWH"},2022]
["NATGAS","TJ_GCV",null,"Q",null,null,null,"Natural Gas",{"$f":"VLOOKUP(D505, Param_Multilanguage!A:C, MATCH(LanguageChosen,Language[Language],0)+1, FALSE)","v":"Human health and social work activities"},{"$f":"VLOOKUP(H505,LanguageData,MATCH(LanguageChosen,Language[Language],0),FALSE) & \" - \" & B505","v":"Natural Gas - TJ_GCV"},2022]
["HEAT","TJ_NCV",null,"Q",null,null,null,"Derived Heat",{"$f":"VLOOKUP(D506, Param_Multilanguage!A:C, MATCH(LanguageChosen,Language[Language],0)+1, FALSE)","v":"Human health and social work activities"},{"$f":"VLOOKUP(H506,LanguageData,MATCH(LanguageChosen,Language[Language],0),FALSE) & \" - \" & B506","v":"Derived Heat - TJ_NCV"},2022]
["TOTALOIL","KT",null,"Q",null,null,null,"Oil and Petroleum Products",{"$f":"VLOOKUP(D507, Param_Multilanguage!A:C, MATCH(LanguageChosen,Language[Language],0)+1, FALSE)","v":"Human health and social work activities"},{"$f":"VLOOKUP(H507,LanguageData,MATCH(LanguageChosen,Language[Language],0),FALSE) & \" - \" & B507","v":"Oil and Petroleum Products - KT"},2022]
["REN","TJ_NCV",null,"Q",null,null,null,"Renewable Energies",{"$f":"VLOOKUP(D508, Param_Multilanguage!A:C, MATCH(LanguageChosen,Language[Language],0)+1, FALSE)","v":"Human health and social work activities"},{"$f":"VLOOKUP(H508,LanguageData,MATCH(LanguageChosen,Language[Language],0),FALSE) & \" - \" & B508","v":"Renewable Energies - TJ_NCV"},2022]
["COAL","KT",null,"Q",null,null,null,"Solid Fossil Fuels",{"$f":"VLOOKUP(D509, Param_Multilanguage!A:C, MATCH(LanguageChosen,Language[Language],0)+1, FALSE)","v":"Human health and social work activities"},{"$f":"VLOOKUP(H509,LanguageData,MATCH(LanguageChosen,Language[Language],0),FALSE) & \" - \" & B509","v":"Solid Fossil Fuels - KT"},2022]
["NONREN","TJ_NCV",null,"Q",null,null,null,"Non Renewable Waste",{"$f":"VLOOKUP(D510, Param_Multilanguage!A:C, MATCH(LanguageChosen,Language[Language],0)+1, FALSE)","v":"Human health and social work activities"},{"$f":"VLOOKUP(H510,LanguageData,MATCH(LanguageChosen,Language[Language],0),FALSE) & \" - \" & B510","v":"Non Renewable Waste - TJ_NCV"},2022]
["HYDROGEN","TJ_NCV",null,"Q",null,null,null,"Hydrogen",{"$f":"VLOOKUP(D511, Param_Multilanguage!A:C, MATCH(LanguageChosen,Language[Language],0)+1, FALSE)","v":"Human health and social work activities"},{"$f":"VLOOKUP(H511,LanguageData,MATCH(LanguageChosen,Language[Language],0),FALSE) & \" - \" & B511","v":"Hydrogen - TJ_NCV"},2022]
["ELECTR","GWH",null,"Q861",null,null,null,"Electricity",{"$f":"VLOOKUP(D512, Param_Multilanguage!A:C, MATCH(LanguageChosen,Language[Language],0)+1, FALSE)","v":"Of which: Hospital activities"},{"$f":"VLOOKUP(H512,LanguageData,MATCH(LanguageChosen,Language[Language],0),FALSE) & \" - \" & B512","v":"Electricity - GWH"},2022]
["NATGAS","TJ_GCV",null,"Q861",null,null,null,"Natural Gas",{"$f":"VLOOKUP(D513, Param_Multilanguage!A:C, MATCH(LanguageChosen,Language[Language],0)+1, FALSE)","v":"Of which: Hospital activities"},{"$f":"VLOOKUP(H513,LanguageData,MATCH(LanguageChosen,Language[Language],0),FALSE) & \" - \" & B513","v":"Natural Gas - TJ_GCV"},2022]
["HEAT","TJ_NCV",null,"Q861",null,null,null,"Derived Heat",{"$f":"VLOOKUP(D514, Param_Multilanguage!A:C, MATCH(LanguageChosen,Language[Language],0)+1, FALSE)","v":"Of which: Hospital activities"},{"$f":"VLOOKUP(H514,LanguageData,MATCH(LanguageChosen,Language[Language],0),FALSE) & \" - \" & B514","v":"Derived Heat - TJ_NCV"},2022]
["TOTALOIL","KT",null,"Q861",null,null,null,"Oil and Petroleum Products",{"$f":"VLOOKUP(D515, Param_Multilanguage!A:C, MATCH(LanguageChosen,Language[Language],0)+1, FALSE)","v":"Of which: Hospital activities"},{"$f":"VLOOKUP(H515,LanguageData,MATCH(LanguageChosen,Language[Language],0),FALSE) & \" - \" & B515","v":"Oil and Petroleum Products - KT"},2022]
["REN","TJ_NCV",null,"Q861",null,null,null,"Renewable Energies",{"$f":"VLOOKUP(D516, Param_Multilanguage!A:C, MATCH(LanguageChosen,Language[Language],0)+1, FALSE)","v":"Of which: Hospital activities"},{"$f":"VLOOKUP(H516,LanguageData,MATCH(LanguageChosen,Language[Language],0),FALSE) & \" - \" & B516","v":"Renewable Energies - TJ_NCV"},2022]
["COAL","KT",null,"Q861",null,null,null,"Solid Fossil Fuels",{"$f":"VLOOKUP(D517, Param_Multilanguage!A:C, MATCH(LanguageChosen,Language[Language],0)+1, FALSE)","v":"Of which: Hospital activities"},{"$f":"VLOOKUP(H517,LanguageData,MATCH(LanguageChosen,Language[Language],0),FALSE) & \" - \" & B517","v":"Solid Fossil Fuels - KT"},2022]
["NONREN","TJ_NCV",null,"Q861",null,null,null,"Non Renewable Waste",{"$f":"VLOOKUP(D518, Param_Multilanguage!A:C, MATCH(LanguageChosen,Language[Language],0)+1, FALSE)","v":"Of which: Hospital activities"},{"$f":"VLOOKUP(H518,LanguageData,MATCH(LanguageChosen,Language[Language],0),FALSE) & \" - \" & B518","v":"Non Renewable Waste - TJ_NCV"},2022]
["HYDROGEN","TJ_NCV",null,"Q861",null,null,null,"Hydrogen",{"$f":"VLOOKUP(D519, Param_Multilanguage!A:C, MATCH(LanguageChosen,Language[Language],0)+1, FALSE)","v":"Of which: Hospital activities"},{"$f":"VLOOKUP(H519,LanguageData,MATCH(LanguageChosen,Language[Language],0),FALSE) & \" - \" & B519","v":"Hydrogen - TJ_NCV"},2022]
["ELECTR","GWH",null,"R",null,null,null,"Electricity",{"$f":"VLOOKUP(D520, Param_Multilanguage!A:C, MATCH(LanguageChosen,Language[Language],0)+1, FALSE)","v":"Arts, entertainment and recreation"},{"$f":"VLOOKUP(H520,LanguageData,MATCH(LanguageChosen,Language[Language],0),FALSE) & \" - \" & B520","v":"Electricity - GWH"},2022]
["NATGAS","TJ_GCV",null,"R",null,null,null,"Natural Gas",{"$f":"VLOOKUP(D521, Param_Multilanguage!A:C, MATCH(LanguageChosen,Language[Language],0)+1, FALSE)","v":"Arts, entertainment and recreation"},{"$f":"VLOOKUP(H521,LanguageData,MATCH(LanguageChosen,Language[Language],0),FALSE) & \" - \" & B521","v":"Natural Gas - TJ_GCV"},2022]
["HEAT","TJ_NCV",null,"R",null,null,null,"Derived Heat",{"$f":"VLOOKUP(D522, Param_Multilanguage!A:C, MATCH(LanguageChosen,Language[Language],0)+1, FALSE)","v":"Arts, entertainment and recreation"},{"$f":"VLOOKUP(H522,LanguageData,MATCH(LanguageChosen,Language[Language],0),FALSE) & \" - \" & B522","v":"Derived Heat - TJ_NCV"},2022]
["TOTALOIL","KT",null,"R",null,null,null,"Oil and Petroleum Products",{"$f":"VLOOKUP(D523, Param_Multilanguage!A:C, MATCH(LanguageChosen,Language[Language],0)+1, FALSE)","v":"Arts, entertainment and recreation"},{"$f":"VLOOKUP(H523,LanguageData,MATCH(LanguageChosen,Language[Language],0),FALSE) & \" - \" & B523","v":"Oil and Petroleum Products - KT"},2022]
["REN","TJ_NCV",null,"R",null,null,null,"Renewable Energies",{"$f":"VLOOKUP(D524, Param_Multilanguage!A:C, MATCH(LanguageChosen,Language[Language],0)+1, FALSE)","v":"Arts, entertainment and recreation"},{"$f":"VLOOKUP(H524,LanguageData,MATCH(LanguageChosen,Language[Language],0),FALSE) & \" - \" & B524","v":"Renewable Energies - TJ_NCV"},2022]
["COAL","KT",null,"R",null,null,null,"Solid Fossil Fuels",{"$f":"VLOOKUP(D525, Param_Multilanguage!A:C, MATCH(LanguageChosen,Language[Language],0)+1, FALSE)","v":"Arts, entertainment and recreation"},{"$f":"VLOOKUP(H525,LanguageData,MATCH(LanguageChosen,Language[Language],0),FALSE) & \" - \" & B525","v":"Solid Fossil Fuels - KT"},2022]
["NONREN","TJ_NCV",null,"R",null,null,null,"Non Renewable Waste",{"$f":"VLOOKUP(D526, Param_Multilanguage!A:C, MATCH(LanguageChosen,Language[Language],0)+1, FALSE)","v":"Arts, entertainment and recreation"},{"$f":"VLOOKUP(H526,LanguageData,MATCH(LanguageChosen,Language[Language],0),FALSE) & \" - \" & B526","v":"Non Renewable Waste - TJ_NCV"},2022]
["HYDROGEN","TJ_NCV",null,"R",null,null,null,"Hydrogen",{"$f":"VLOOKUP(D527, Param_Multilanguage!A:C, MATCH(LanguageChosen,Language[Language],0)+1, FALSE)","v":"Arts, entertainment and recreation"},{"$f":"VLOOKUP(H527,LanguageData,MATCH(LanguageChosen,Language[Language],0),FALSE) & \" - \" & B527","v":"Hydrogen - TJ_NCV"},2022]
["ELECTR","GWH",null,"R93",null,null,null,"Electricity",{"$f":"VLOOKUP(D528, Param_Multilanguage!A:C, MATCH(LanguageChosen,Language[Language],0)+1, FALSE)","v":"Of which: Sports activities and amusement and recreation activities"},{"$f":"VLOOKUP(H528,LanguageData,MATCH(LanguageChosen,Language[Language],0),FALSE) & \" - \" & B528","v":"Electricity - GWH"},2022]
["NATGAS","TJ_GCV",null,"R93",null,null,null,"Natural Gas",{"$f":"VLOOKUP(D529, Param_Multilanguage!A:C, MATCH(LanguageChosen,Language[Language],0)+1, FALSE)","v":"Of which: Sports activities and amusement and recreation activities"},{"$f":"VLOOKUP(H529,LanguageData,MATCH(LanguageChosen,Language[Language],0),FALSE) & \" - \" & B529","v":"Natural Gas - TJ_GCV"},2022]
["HEAT","TJ_NCV",null,"R93",null,null,null,"Derived Heat",{"$f":"VLOOKUP(D530, Param_Multilanguage!A:C, MATCH(LanguageChosen,Language[Language],0)+1, FALSE)","v":"Of which: Sports activities and amusement and recreation activities"},{"$f":"VLOOKUP(H530,LanguageData,MATCH(LanguageChosen,Language[Language],0),FALSE) & \" - \" & B530","v":"Derived Heat - TJ_NCV"},2022]
["TOTALOIL","KT",null,"R93",null,null,null,"Oil and Petroleum Products",{"$f":"VLOOKUP(D531, Param_Multilanguage!A:C, MATCH(LanguageChosen,Language[Language],0)+1, FALSE)","v":"Of which: Sports activities and amusement and recreation activities"},{"$f":"VLOOKUP(H531,LanguageData,MATCH(LanguageChosen,Language[Language],0),FALSE) & \" - \" & B531","v":"Oil and Petroleum Products - KT"},2022]
["REN","TJ_NCV",null,"R93",null,null,null,"Renewable Energies",{"$f":"VLOOKUP(D532, Param_Multilanguage!A:C, MATCH(LanguageChosen,Language[Language],0)+1, FALSE)","v":"Of which: Sports activities and amusement and recreation activities"},{"$f":"VLOOKUP(H532,LanguageData,MATCH(LanguageChosen,Language[Language],0),FALSE) & \" - \" & B532","v":"Renewable Energies - TJ_NCV"},2022]
["COAL","KT",null,"R93",null,null,null,"Solid Fossil Fuels",{"$f":"VLOOKUP(D533, Param_Multilanguage!A:C, MATCH(LanguageChosen,Language[Language],0)+1, FALSE)","v":"Of which: Sports activities and amusement and recreation activities"},{"$f":"VLOOKUP(H533,LanguageData,MATCH(LanguageChosen,Language[Language],0),FALSE) & \" - \" & B533","v":"Solid Fossil Fuels - KT"},2022]
["NONREN","TJ_NCV",null,"R93",null,null,null,"Non Renewable Waste",{"$f":"VLOOKUP(D534, Param_Multilanguage!A:C, MATCH(LanguageChosen,Language[Language],0)+1, FALSE)","v":"Of which: Sports activities and amusement and recreation activities"},{"$f":"VLOOKUP(H534,LanguageData,MATCH(LanguageChosen,Language[Language],0),FALSE) & \" - \" & B534","v":"Non Renewable Waste - TJ_NCV"},2022]
["HYDROGEN","TJ_NCV",null,"R93",null,null,null,"Hydrogen",{"$f":"VLOOKUP(D535, Param_Multilanguage!A:C, MATCH(LanguageChosen,Language[Language],0)+1, FALSE)","v":"Of which: Sports activities and amusement and recreation activities"},{"$f":"VLOOKUP(H535,LanguageData,MATCH(LanguageChosen,Language[Language],0),FALSE) & \" - \" & B535","v":"Hydrogen - TJ_NCV"},2022]
["ELECTR","GWH",null,"U",null,null,null,"Electricity",{"$f":"VLOOKUP(D536, Param_Multilanguage!A:C, MATCH(LanguageChosen,Language[Language],0)+1, FALSE)","v":"Activities of extra-territorial organisations and bodies"},{"$f":"VLOOKUP(H536,LanguageData,MATCH(LanguageChosen,Language[Language],0),FALSE) & \" - \" & B536","v":"Electricity - GWH"},2022]
["NATGAS","TJ_GCV",null,"U",null,null,null,"Natural Gas",{"$f":"VLOOKUP(D537, Param_Multilanguage!A:C, MATCH(LanguageChosen,Language[Language],0)+1, FALSE)","v":"Activities of extra-territorial organisations and bodies"},{"$f":"VLOOKUP(H537,LanguageData,MATCH(LanguageChosen,Language[Language],0),FALSE) & \" - \" & B537","v":"Natural Gas - TJ_GCV"},2022]
["HEAT","TJ_NCV",null,"U",null,null,null,"Derived Heat",{"$f":"VLOOKUP(D538, Param_Multilanguage!A:C, MATCH(LanguageChosen,Language[Language],0)+1, FALSE)","v":"Activities of extra-territorial organisations and bodies"},{"$f":"VLOOKUP(H538,LanguageData,MATCH(LanguageChosen,Language[Language],0),FALSE) & \" - \" & B538","v":"Derived Heat - TJ_NCV"},2022]
["TOTALOIL","KT",null,"U",null,null,null,"Oil and Petroleum Products",{"$f":"VLOOKUP(D539, Param_Multilanguage!A:C, MATCH(LanguageChosen,Language[Language],0)+1, FALSE)","v":"Activities of extra-territorial organisations and bodies"},{"$f":"VLOOKUP(H539,LanguageData,MATCH(LanguageChosen,Language[Language],0),FALSE) & \" - \" & B539","v":"Oil and Petroleum Products - KT"},2022]
["REN","TJ_NCV",null,"U",null,null,null,"Renewable Energies",{"$f":"VLOOKUP(D540, Param_Multilanguage!A:C, MATCH(LanguageChosen,Language[Language],0)+1, FALSE)","v":"Activities of extra-territorial organisations and bodies"},{"$f":"VLOOKUP(H540,LanguageData,MATCH(LanguageChosen,Language[Language],0),FALSE) & \" - \" & B540","v":"Renewable Energies - TJ_NCV"},2022]
["COAL","KT",null,"U",null,null,null,"Solid Fossil Fuels",{"$f":"VLOOKUP(D541, Param_Multilanguage!A:C, MATCH(LanguageChosen,Language[Language],0)+1, FALSE)","v":"Activities of extra-territorial organisations and bodies"},{"$f":"VLOOKUP(H541,LanguageData,MATCH(LanguageChosen,Language[Language],0),FALSE) & \" - \" & B541","v":"Solid Fossil Fuels - KT"},2022]
["NONREN","TJ_NCV",null,"U",null,null,null,"Non Renewable Waste",{"$f":"VLOOKUP(D542, Param_Multilanguage!A:C, MATCH(LanguageChosen,Language[Language],0)+1, FALSE)","v":"Activities of extra-territorial organisations and bodies"},{"$f":"VLOOKUP(H542,LanguageData,MATCH(LanguageChosen,Language[Language],0),FALSE) & \" - \" & B542","v":"Non Renewable Waste - TJ_NCV"},2022]
["HYDROGEN","TJ_NCV",null,"U",null,null,null,"Hydrogen",{"$f":"VLOOKUP(D543, Param_Multilanguage!A:C, MATCH(LanguageChosen,Language[Language],0)+1, FALSE)","v":"Activities of extra-territorial organisations and bodies"},{"$f":"VLOOKUP(H543,LanguageData,MATCH(LanguageChosen,Language[Language],0),FALSE) & \" - \" & B543","v":"Hydrogen - TJ_NCV"},2022]
["ELECTR","GWH",null,"DATAC",null,null,null,"Electricity",{"$f":"VLOOKUP(D544, Param_Multilanguage!A:C, MATCH(LanguageChosen,Language[Language],0)+1, FALSE)","v":"Data centres"},{"$f":"VLOOKUP(H544,LanguageData,MATCH(LanguageChosen,Language[Language],0),FALSE) & \" - \" & B544","v":"Electricity - GWH"},2022]
["NATGAS","TJ_GCV",null,"DATAC",null,null,null,"Natural Gas",{"$f":"VLOOKUP(D545, Param_Multilanguage!A:C, MATCH(LanguageChosen,Language[Language],0)+1, FALSE)","v":"Data centres"},{"$f":"VLOOKUP(H545,LanguageData,MATCH(LanguageChosen,Language[Language],0),FALSE) & \" - \" & B545","v":"Natural Gas - TJ_GCV"},2022]
["HEAT","TJ_NCV",null,"DATAC",null,null,null,"Derived Heat",{"$f":"VLOOKUP(D546, Param_Multilanguage!A:C, MATCH(LanguageChosen,Language[Language],0)+1, FALSE)","v":"Data centres"},{"$f":"VLOOKUP(H546,LanguageData,MATCH(LanguageChosen,Language[Language],0),FALSE) & \" - \" & B546","v":"Derived Heat - TJ_NCV"},2022]
["TOTALOIL","KT",null,"DATAC",null,null,null,"Oil and Petroleum Products",{"$f":"VLOOKUP(D547, Param_Multilanguage!A:C, MATCH(LanguageChosen,Language[Language],0)+1, FALSE)","v":"Data centres"},{"$f":"VLOOKUP(H547,LanguageData,MATCH(LanguageChosen,Language[Language],0),FALSE) & \" - \" & B547","v":"Oil and Petroleum Products - KT"},2022]
["REN","TJ_NCV",null,"DATAC",null,null,null,"Renewable Energies",{"$f":"VLOOKUP(D548, Param_Multilanguage!A:C, MATCH(LanguageChosen,Language[Language],0)+1, FALSE)","v":"Data centres"},{"$f":"VLOOKUP(H548,LanguageData,MATCH(LanguageChosen,Language[Language],0),FALSE) & \" - \" & B548","v":"Renewable Energies - TJ_NCV"},2022]
["COAL","KT",null,"DATAC",null,null,null,"Solid Fossil Fuels",{"$f":"VLOOKUP(D549, Param_Multilanguage!A:C, MATCH(LanguageChosen,Language[Language],0)+1, FALSE)","v":"Data centres"},{"$f":"VLOOKUP(H549,LanguageData,MATCH(LanguageChosen,Language[Language],0),FALSE) & \" - \" & B549","v":"Solid Fossil Fuels - KT"},2022]
["NONREN","TJ_NCV",null,"DATAC",null,null,null,"Non Renewable Waste",{"$f":"VLOOKUP(D550, Param_Multilanguage!A:C, MATCH(LanguageChosen,Language[Language],0)+1, FALSE)","v":"Data centres"},{"$f":"VLOOKUP(H550,LanguageData,MATCH(LanguageChosen,Language[Language],0),FALSE) & \" - \" & B550","v":"Non Renewable Waste - TJ_NCV"},2022]
["HYDROGEN","TJ_NCV",null,"DATAC",null,null,null,"Hydrogen",{"$f":"VLOOKUP(D551, Param_Multilanguage!A:C, MATCH(LanguageChosen,Language[Language],0)+1, FALSE)","v":"Data centres"},{"$f":"VLOOKUP(H551,LanguageData,MATCH(LanguageChosen,Language[Language],0),FALSE) & \" - \" & B551","v":"Hydrogen - TJ_NCV"},2022]
["ELECTR","GWH",null,"TOTSER",null,null,null,"Electricity",{"$f":"VLOOKUP(D552, Param_Multilanguage!A:C, MATCH(LanguageChosen,Language[Language],0)+1, FALSE)","v":"Services total"},{"$f":"VLOOKUP(H552,LanguageData,MATCH(LanguageChosen,Language[Language],0),FALSE) & \" - \" & B552","v":"Electricity - GWH"},2022]
["NATGAS","TJ_GCV",null,"TOTSER",null,null,null,"Natural Gas",{"$f":"VLOOKUP(D553, Param_Multilanguage!A:C, MATCH(LanguageChosen,Language[Language],0)+1, FALSE)","v":"Services total"},{"$f":"VLOOKUP(H553,LanguageData,MATCH(LanguageChosen,Language[Language],0),FALSE) & \" - \" & B553","v":"Natural Gas - TJ_GCV"},2022]
["HEAT","TJ_NCV",null,"TOTSER",null,null,null,"Derived Heat",{"$f":"VLOOKUP(D554, Param_Multilanguage!A:C, MATCH(LanguageChosen,Language[Language],0)+1, FALSE)","v":"Services total"},{"$f":"VLOOKUP(H554,LanguageData,MATCH(LanguageChosen,Language[Language],0),FALSE) & \" - \" & B554","v":"Derived Heat - TJ_NCV"},2022]
["TOTALOIL","KT",null,"TOTSER",null,null,null,"Oil and Petroleum Products",{"$f":"VLOOKUP(D555, Param_Multilanguage!A:C, MATCH(LanguageChosen,Language[Language],0)+1, FALSE)","v":"Services total"},{"$f":"VLOOKUP(H555,LanguageData,MATCH(LanguageChosen,Language[Language],0),FALSE) & \" - \" & B555","v":"Oil and Petroleum Products - KT"},2022]
["REN","TJ_NCV",null,"TOTSER",null,null,null,"Renewable Energies",{"$f":"VLOOKUP(D556, Param_Multilanguage!A:C, MATCH(LanguageChosen,Language[Language],0)+1, FALSE)","v":"Services total"},{"$f":"VLOOKUP(H556,LanguageData,MATCH(LanguageChosen,Language[Language],0),FALSE) & \" - \" & B556","v":"Renewable Energies - TJ_NCV"},2022]
["COAL","KT",null,"TOTSER",null,null,null,"Solid Fossil Fuels",{"$f":"VLOOKUP(D557, Param_Multilanguage!A:C, MATCH(LanguageChosen,Language[Language],0)+1, FALSE)","v":"Services total"},{"$f":"VLOOKUP(H557,LanguageData,MATCH(LanguageChosen,Language[Language],0),FALSE) & \" - \" & B557","v":"Solid Fossil Fuels - KT"},2022]
["NONREN","TJ_NCV",null,"TOTSER",null,null,null,"Non Renewable Waste",{"$f":"VLOOKUP(D558, Param_Multilanguage!A:C, MATCH(LanguageChosen,Language[Language],0)+1, FALSE)","v":"Services total"},{"$f":"VLOOKUP(H558,LanguageData,MATCH(LanguageChosen,Language[Language],0),FALSE) & \" - \" & B558","v":"Non Renewable Waste - TJ_NCV"},2022]
["HYDROGEN","TJ_NCV",null,"TOTSER",null,null,null,"Hydrogen",{"$f":"VLOOKUP(D559, Param_Multilanguage!A:C, MATCH(LanguageChosen,Language[Language],0)+1, FALSE)","v":"Services total"},{"$f":"VLOOKUP(H559,LanguageData,MATCH(LanguageChosen,Language[Language],0),FALSE) & \" - \" & B559","v":"Hydrogen - TJ_NCV"},2022]
["ELECTR","GWH",null,"C33",null,null,null,"Electricity",{"$f":"VLOOKUP(D560, Param_Multilanguage!A:C, MATCH(LanguageChosen,Language[Language],0)+1, FALSE)","v":"Repair and installation of machinery and equipment"},{"$f":"VLOOKUP(H560,LanguageData,MATCH(LanguageChosen,Language[Language],0),FALSE) & \" - \" & B560","v":"Electricity - GWH"},2023]
["NATGAS","TJ_GCV",null,"C33",null,null,null,"Natural Gas",{"$f":"VLOOKUP(D561, Param_Multilanguage!A:C, MATCH(LanguageChosen,Language[Language],0)+1, FALSE)","v":"Repair and installation of machinery and equipment"},{"$f":"VLOOKUP(H561,LanguageData,MATCH(LanguageChosen,Language[Language],0),FALSE) & \" - \" & B561","v":"Natural Gas - TJ_GCV"},2023]
["HEAT","TJ_NCV",null,"C33",null,null,null,"Derived Heat",{"$f":"VLOOKUP(D562, Param_Multilanguage!A:C, MATCH(LanguageChosen,Language[Language],0)+1, FALSE)","v":"Repair and installation of machinery and equipment"},{"$f":"VLOOKUP(H562,LanguageData,MATCH(LanguageChosen,Language[Language],0),FALSE) & \" - \" & B562","v":"Derived Heat - TJ_NCV"},2023]
["TOTALOIL","KT",null,"C33",null,null,null,"Oil and Petroleum Products",{"$f":"VLOOKUP(D563, Param_Multilanguage!A:C, MATCH(LanguageChosen,Language[Language],0)+1, FALSE)","v":"Repair and installation of machinery and equipment"},{"$f":"VLOOKUP(H563,LanguageData,MATCH(LanguageChosen,Language[Language],0),FALSE) & \" - \" & B563","v":"Oil and Petroleum Products - KT"},2023]
["REN","TJ_NCV",null,"C33",null,null,null,"Renewable Energies",{"$f":"VLOOKUP(D564, Param_Multilanguage!A:C, MATCH(LanguageChosen,Language[Language],0)+1, FALSE)","v":"Repair and installation of machinery and equipment"},{"$f":"VLOOKUP(H564,LanguageData,MATCH(LanguageChosen,Language[Language],0),FALSE) & \" - \" & B564","v":"Renewable Energies - TJ_NCV"},2023]
["COAL","KT",null,"C33",null,null,null,"Solid Fossil Fuels",{"$f":"VLOOKUP(D565, Param_Multilanguage!A:C, MATCH(LanguageChosen,Language[Language],0)+1, FALSE)","v":"Repair and installation of machinery and equipment"},{"$f":"VLOOKUP(H565,LanguageData,MATCH(LanguageChosen,Language[Language],0),FALSE) & \" - \" & B565","v":"Solid Fossil Fuels - KT"},2023]
["NONREN","TJ_NCV",null,"C33",null,null,null,"Non Renewable Waste",{"$f":"VLOOKUP(D566, Param_Multilanguage!A:C, MATCH(LanguageChosen,Language[Language],0)+1, FALSE)","v":"Repair and installation of machinery and equipment"},{"$f":"VLOOKUP(H566,LanguageData,MATCH(LanguageChosen,Language[Language],0),FALSE) & \" - \" & B566","v":"Non Renewable Waste - TJ_NCV"},2023]
["HYDROGEN","TJ_NCV",null,"C33",null,null,null,"Hydrogen",{"$f":"VLOOKUP(D567, Param_Multilanguage!A:C, MATCH(LanguageChosen,Language[Language],0)+1, FALSE)","v":"Repair and installation of machinery and equipment"},{"$f":"VLOOKUP(H567,LanguageData,MATCH(LanguageChosen,Language[Language],0),FALSE) & \" - \" & B567","v":"Hydrogen - TJ_NCV"},2023]
["ELECTR","GWH",null,"E",null,null,null,"Electricity",{"$f":"VLOOKUP(D568, Param_Multilanguage!A:C, MATCH(LanguageChosen,Language[Language],0)+1, FALSE)","v":"Water supply; sewerage, waste management and remediation activities"},{"$f":"VLOOKUP(H568,LanguageData,MATCH(LanguageChosen,Language[Language],0),FALSE) & \" - \" & B568","v":"Electricity - GWH"},2023]
["NATGAS","TJ_GCV",null,"E",null,null,null,"Natural Gas",{"$f":"VLOOKUP(D569, Param_Multilanguage!A:C, MATCH(LanguageChosen,Language[Language],0)+1, FALSE)","v":"Water supply; sewerage, waste management and remediation activities"},{"$f":"VLOOKUP(H569,LanguageData,MATCH(LanguageChosen,Language[Language],0),FALSE) & \" - \" & B569","v":"Natural Gas - TJ_GCV"},2023]
["HEAT","TJ_NCV",null,"E",null,null,null,"Derived Heat",{"$f":"VLOOKUP(D570, Param_Multilanguage!A:C, MATCH(LanguageChosen,Language[Language],0)+1, FALSE)","v":"Water supply; sewerage, waste management and remediation activities"},{"$f":"VLOOKUP(H570,LanguageData,MATCH(LanguageChosen,Language[Language],0),FALSE) & \" - \" & B570","v":"Derived Heat - TJ_NCV"},2023]
["TOTALOIL","KT",null,"E",null,null,null,"Oil and Petroleum Products",{"$f":"VLOOKUP(D571, Param_Multilanguage!A:C, MATCH(LanguageChosen,Language[Language],0)+1, FALSE)","v":"Water supply; sewerage, waste management and remediation activities"},{"$f":"VLOOKUP(H571,LanguageData,MATCH(LanguageChosen,Language[Language],0),FALSE) & \" - \" & B571","v":"Oil and Petroleum Products - KT"},2023]
["REN","TJ_NCV",null,"E",null,null,null,"Renewable Energies",{"$f":"VLOOKUP(D572, Param_Multilanguage!A:C, MATCH(LanguageChosen,Language[Language],0)+1, FALSE)","v":"Water supply; sewerage, waste management and remediation activities"},{"$f":"VLOOKUP(H572,LanguageData,MATCH(LanguageChosen,Language[Language],0),FALSE) & \" - \" & B572","v":"Renewable Energies - TJ_NCV"},2023]
["COAL","KT",null,"E",null,null,null,"Solid Fossil Fuels",{"$f":"VLOOKUP(D573, Param_Multilanguage!A:C, MATCH(LanguageChosen,Language[Language],0)+1, FALSE)","v":"Water supply; sewerage, waste management and remediation activities"},{"$f":"VLOOKUP(H573,LanguageData,MATCH(LanguageChosen,Language[Language],0),FALSE) & \" - \" & B573","v":"Solid Fossil Fuels - KT"},2023]
["NONREN","TJ_NCV",null,"E",null,null,null,"Non Renewable Waste",{"$f":"VLOOKUP(D574, Param_Multilanguage!A:C, MATCH(LanguageChosen,Language[Language],0)+1, FALSE)","v":"Water supply; sewerage, waste management and remediation activities"},{"$f":"VLOOKUP(H574,LanguageData,MATCH(LanguageChosen,Language[Language],0),FALSE) & \" - \" & B574","v":"Non Renewable Waste - TJ_NCV"},2023]
["HYDROGEN","TJ_NCV",null,"E",null,null,null,"Hydrogen",{"$f":"VLOOKUP(D575, Param_Multilanguage!A:C, MATCH(LanguageChosen,Language[Language],0)+1, FALSE)","v":"Water supply; sewerage, waste management and remediation activities"},{"$f":"VLOOKUP(H575,LanguageData,MATCH(LanguageChosen,Language[Language],0),FALSE) & \" - \" & B575","v":"Hydrogen - TJ_NCV"},2023]
["ELECTR","GWH",null,"G",null,null,null,"Electricity",{"$f":"VLOOKUP(D576, Param_Multilanguage!A:C, MATCH(LanguageChosen,Language[Language],0)+1, FALSE)","v":"Wholesale and retail trade; repair of motor vehicles and motorcycles"},{"$f":"VLOOKUP(H576,LanguageData,MATCH(LanguageChosen,Language[Language],0),FALSE) & \" - \" & B576","v":"Electricity - GWH"},2023]
["NATGAS","TJ_GCV",null,"G",null,null,null,"Natural Gas",{"$f":"VLOOKUP(D577, Param_Multilanguage!A:C, MATCH(LanguageChosen,Language[Language],0)+1, FALSE)","v":"Wholesale and retail trade; repair of motor vehicles and motorcycles"},{"$f":"VLOOKUP(H577,LanguageData,MATCH(LanguageChosen,Language[Language],0),FALSE) & \" - \" & B577","v":"Natural Gas - TJ_GCV"},2023]
["HEAT","TJ_NCV",null,"G",null,null,null,"Derived Heat",{"$f":"VLOOKUP(D578, Param_Multilanguage!A:C, MATCH(LanguageChosen,Language[Language],0)+1, FALSE)","v":"Wholesale and retail trade; repair of motor vehicles and motorcycles"},{"$f":"VLOOKUP(H578,LanguageData,MATCH(LanguageChosen,Language[Language],0),FALSE) & \" - \" & B578","v":"Derived Heat - TJ_NCV"},2023]
["TOTALOIL","KT",null,"G",null,null,null,"Oil and Petroleum Products",{"$f":"VLOOKUP(D579, Param_Multilanguage!A:C, MATCH(LanguageChosen,Language[Language],0)+1, FALSE)","v":"Wholesale and retail trade; repair of motor vehicles and motorcycles"},{"$f":"VLOOKUP(H579,LanguageData,MATCH(LanguageChosen,Language[Language],0),FALSE) & \" - \" & B579","v":"Oil and Petroleum Products - KT"},2023]
["REN","TJ_NCV",null,"G",null,null,null,"Renewable Energies",{"$f":"VLOOKUP(D580, Param_Multilanguage!A:C, MATCH(LanguageChosen,Language[Language],0)+1, FALSE)","v":"Wholesale and retail trade; repair of motor vehicles and motorcycles"},{"$f":"VLOOKUP(H580,LanguageData,MATCH(LanguageChosen,Language[Language],0),FALSE) & \" - \" & B580","v":"Renewable Energies - TJ_NCV"},2023]
["COAL","KT",null,"G",null,null,null,"Solid Fossil Fuels",{"$f":"VLOOKUP(D581, Param_Multilanguage!A:C, MATCH(LanguageChosen,Language[Language],0)+1, FALSE)","v":"Wholesale and retail trade; repair of motor vehicles and motorcycles"},{"$f":"VLOOKUP(H581,LanguageData,MATCH(LanguageChosen,Language[Language],0),FALSE) & \" - \" & B581","v":"Solid Fossil Fuels - KT"},2023]
["NONREN","TJ_NCV",null,"G",null,null,null,"Non Renewable Waste",{"$f":"VLOOKUP(D582, Param_Multilanguage!A:C, MATCH(LanguageChosen,Language[Language],0)+1, FALSE)","v":"Wholesale and retail trade; repair of motor vehicles and motorcycles"},{"$f":"VLOOKUP(H582,LanguageData,MATCH(LanguageChosen,Language[Language],0),FALSE) & \" - \" & B582","v":"Non Renewable Waste - TJ_NCV"},2023]
["HYDROGEN","TJ_NCV",null,"G",null,null,null,"Hydrogen",{"$f":"VLOOKUP(D583, Param_Multilanguage!A:C, MATCH(LanguageChosen,Language[Language],0)+1, FALSE)","v":"Wholesale and retail trade; repair of motor vehicles and motorcycles"},{"$f":"VLOOKUP(H583,LanguageData,MATCH(LanguageChosen,Language[Language],0),FALSE) & \" - \" & B583","v":"Hydrogen - TJ_NCV"},2023]
["ELECTR","GWH",null,"G46",null,null,null,"Electricity",{"$f":"VLOOKUP(D584, Param_Multilanguage!A:C, MATCH(LanguageChosen,Language[Language],0)+1, FALSE)","v":"Wholesale trade, except of motor vehicles and motorcycles"},{"$f":"VLOOKUP(H584,LanguageData,MATCH(LanguageChosen,Language[Language],0),FALSE) & \" - \" & B584","v":"Electricity - GWH"},2023]
["NATGAS","TJ_GCV",null,"G46",null,null,null,"Natural Gas",{"$f":"VLOOKUP(D585, Param_Multilanguage!A:C, MATCH(LanguageChosen,Language[Language],0)+1, FALSE)","v":"Wholesale trade, except of motor vehicles and motorcycles"},{"$f":"VLOOKUP(H585,LanguageData,MATCH(LanguageChosen,Language[Language],0),FALSE) & \" - \" & B585","v":"Natural Gas - TJ_GCV"},2023]
["HEAT","TJ_NCV",null,"G46",null,null,null,"Derived Heat",{"$f":"VLOOKUP(D586, Param_Multilanguage!A:C, MATCH(LanguageChosen,Language[Language],0)+1, FALSE)","v":"Wholesale trade, except of motor vehicles and motorcycles"},{"$f":"VLOOKUP(H586,LanguageData,MATCH(LanguageChosen,Language[Language],0),FALSE) & \" - \" & B586","v":"Derived Heat - TJ_NCV"},2023]
["TOTALOIL","KT",null,"G46",null,null,null,"Oil and Petroleum Products",{"$f":"VLOOKUP(D587, Param_Multilanguage!A:C, MATCH(LanguageChosen,Language[Language],0)+1, FALSE)","v":"Wholesale trade, except of motor vehicles and motorcycles"},{"$f":"VLOOKUP(H587,LanguageData,MATCH(LanguageChosen,Language[Language],0),FALSE) & \" - \" & B587","v":"Oil and Petroleum Products - KT"},2023]
["REN","TJ_NCV",null,"G46",null,null,null,"Renewable Energies",{"$f":"VLOOKUP(D588, Param_Multilanguage!A:C, MATCH(LanguageChosen,Language[Language],0)+1, FALSE)","v":"Wholesale trade, except of motor vehicles and motorcycles"},{"$f":"VLOOKUP(H588,LanguageData,MATCH(LanguageChosen,Language[Language],0),FALSE) & \" - \" & B588","v":"Renewable Energies - TJ_NCV"},2023]
["COAL","KT",null,"G46",null,null,null,"Solid Fossil Fuels",{"$f":"VLOOKUP(D589, Param_Multilanguage!A:C, MATCH(LanguageChosen,Language[Language],0)+1, FALSE)","v":"Wholesale trade, except of motor vehicles and motorcycles"},{"$f":"VLOOKUP(H589,LanguageData,MATCH(LanguageChosen,Language[Language],0),FALSE) & \" - \" & B589","v":"Solid Fossil Fuels - KT"},2023]
["NONREN","TJ_NCV",null,"G46",null,null,null,"Non Renewable Waste",{"$f":"VLOOKUP(D590, Param_Multilanguage!A:C, MATCH(LanguageChosen,Language[Language],0)+1, FALSE)","v":"Wholesale trade, except of motor vehicles and motorcycles"},{"$f":"VLOOKUP(H590,LanguageData,MATCH(LanguageChosen,Language[Language],0),FALSE) & \" - \" & B590","v":"Non Renewable Waste - TJ_NCV"},2023]
["HYDROGEN","TJ_NCV",null,"G46",null,null,null,"Hydrogen",{"$f":"VLOOKUP(D591, Param_Multilanguage!A:C, MATCH(LanguageChosen,Language[Language],0)+1, FALSE)","v":"Wholesale trade, except of motor vehicles and motorcycles"},{"$f":"VLOOKUP(H591,LanguageData,MATCH(LanguageChosen,Language[Language],0),FALSE) & \" - \" & B591","v":"Hydrogen - TJ_NCV"},2023]
["ELECTR","GWH",null,"G47",null,null,null,"Electricity",{"$f":"VLOOKUP(D592, Param_Multilanguage!A:C, MATCH(LanguageChosen,Language[Language],0)+1, FALSE)","v":"Retail trade, except of motor vehicles and motorcycles"},{"$f":"VLOOKUP(H592,LanguageData,MATCH(LanguageChosen,Language[Language],0),FALSE) & \" - \" & B592","v":"Electricity - GWH"},2023]
["NATGAS","TJ_GCV",null,"G47",null,null,null,"Natural Gas",{"$f":"VLOOKUP(D593, Param_Multilanguage!A:C, MATCH(LanguageChosen,Language[Language],0)+1, FALSE)","v":"Retail trade, except of motor vehicles and motorcycles"},{"$f":"VLOOKUP(H593,LanguageData,MATCH(LanguageChosen,Language[Language],0),FALSE) & \" - \" & B593","v":"Natural Gas - TJ_GCV"},2023]
["HEAT","TJ_NCV",null,"G47",null,null,null,"Derived Heat",{"$f":"VLOOKUP(D594, Param_Multilanguage!A:C, MATCH(LanguageChosen,Language[Language],0)+1, FALSE)","v":"Retail trade, except of motor vehicles and motorcycles"},{"$f":"VLOOKUP(H594,LanguageData,MATCH(LanguageChosen,Language[Language],0),FALSE) & \" - \" & B594","v":"Derived Heat - TJ_NCV"},2023]
["TOTALOIL","KT",null,"G47",null,null,null,"Oil and Petroleum Products",{"$f":"VLOOKUP(D595, Param_Multilanguage!A:C, MATCH(LanguageChosen,Language[Language],0)+1, FALSE)","v":"Retail trade, except of motor vehicles and motorcycles"},{"$f":"VLOOKUP(H595,LanguageData,MATCH(LanguageChosen,Language[Language],0),FALSE) & \" - \" & B595","v":"Oil and Petroleum Products - KT"},2023]
["REN","TJ_NCV",null,"G47",null,null,null,"Renewable Energies",{"$f":"VLOOKUP(D596, Param_Multilanguage!A:C, MATCH(LanguageChosen,Language[Language],0)+1, FALSE)","v":"Retail trade, except of motor vehicles and motorcycles"},{"$f":"VLOOKUP(H596,LanguageData,MATCH(LanguageChosen,Language[Language],0),FALSE) & \" - \" & B596","v":"Renewable Energies - TJ_NCV"},2023]
["COAL","KT",null,"G47",null,null,null,"Solid Fossil Fuels",{"$f":"VLOOKUP(D597, Param_Multilanguage!A:C, MATCH(LanguageChosen,Language[Language],0)+1, FALSE)","v":"Retail trade, except of motor vehicles and motorcycles"},{"$f":"VLOOKUP(H597,LanguageData,MATCH(LanguageChosen,Language[Language],0),FALSE) & \" - \" & B597","v":"Solid Fossil Fuels - KT"},2023]
["NONREN","TJ_NCV",null,"G47",null,null,null,"Non Renewable Waste",{"$f":"VLOOKUP(D598, Param_Multilanguage!A:C, MATCH(LanguageChosen,Language[Language],0)+1, FALSE)","v":"Retail trade, except of motor vehicles and motorcycles"},{"$f":"VLOOKUP(H598,LanguageData,MATCH(LanguageChosen,Language[Language],0),FALSE) & \" - \" & B598","v":"Non Renewable Waste - TJ_NCV"},2023]
["HYDROGEN","TJ_NCV",null,"G47",null,null,null,"Hydrogen",{"$f":"VLOOKUP(D599, Param_Multilanguage!A:C, MATCH(LanguageChosen,Language[Language],0)+1, FALSE)","v":"Retail trade, except of motor vehicles and motorcycles"},{"$f":"VLOOKUP(H599,LanguageData,MATCH(LanguageChosen,Language[Language],0),FALSE) & \" - \" & B599","v":"Hydrogen - TJ_NCV"},2023]
["ELECTR","GWH",null,"H52",null,null,null,"Electricity",{"$f":"VLOOKUP(D600, Param_Multilanguage!A:C, MATCH(LanguageChosen,Language[Language],0)+1, FALSE)","v":"Warehousing and support activities for transportation"},{"$f":"VLOOKUP(H600,LanguageData,MATCH(LanguageChosen,Language[Language],0),FALSE) & \" - \" & B600","v":"Electricity - GWH"},2023]
["NATGAS","TJ_GCV",null,"H52",null,null,null,"Natural Gas",{"$f":"VLOOKUP(D601, Param_Multilanguage!A:C, MATCH(LanguageChosen,Language[Language],0)+1, FALSE)","v":"Warehousing and support activities for transportation"},{"$f":"VLOOKUP(H601,LanguageData,MATCH(LanguageChosen,Language[Language],0),FALSE) & \" - \" & B601","v":"Natural Gas - TJ_GCV"},2023]
["HEAT","TJ_NCV",null,"H52",null,null,null,"Derived Heat",{"$f":"VLOOKUP(D602, Param_Multilanguage!A:C, MATCH(LanguageChosen,Language[Language],0)+1, FALSE)","v":"Warehousing and support activities for transportation"},{"$f":"VLOOKUP(H602,LanguageData,MATCH(LanguageChosen,Language[Language],0),FALSE) & \" - \" & B602","v":"Derived Heat - TJ_NCV"},2023]
["TOTALOIL","KT",null,"H52",null,null,null,"Oil and Petroleum Products",{"$f":"VLOOKUP(D603, Param_Multilanguage!A:C, MATCH(LanguageChosen,Language[Language],0)+1, FALSE)","v":"Warehousing and support activities for transportation"},{"$f":"VLOOKUP(H603,LanguageData,MATCH(LanguageChosen,Language[Language],0),FALSE) & \" - \" & B603","v":"Oil and Petroleum Products - KT"},2023]
["REN","TJ_NCV",null,"H52",null,null,null,"Renewable Energies",{"$f":"VLOOKUP(D604, Param_Multilanguage!A:C, MATCH(LanguageChosen,Language[Language],0)+1, FALSE)","v":"Warehousing and support activities for transportation"},{"$f":"VLOOKUP(H604,LanguageData,MATCH(LanguageChosen,Language[Language],0),FALSE) & \" - \" & B604","v":"Renewable Energies - TJ_NCV"},2023]
["COAL","KT",null,"H52",null,null,null,"Solid Fossil Fuels",{"$f":"VLOOKUP(D605, Param_Multilanguage!A:C, MATCH(LanguageChosen,Language[Language],0)+1, FALSE)","v":"Warehousing and support activities for transportation"},{"$f":"VLOOKUP(H605,LanguageData,MATCH(LanguageChosen,Language[Language],0),FALSE) & \" - \" & B605","v":"Solid Fossil Fuels - KT"},2023]
["NONREN","TJ_NCV",null,"H52",null,null,null,"Non Renewable Waste",{"$f":"VLOOKUP(D606, Param_Multilanguage!A:C, MATCH(LanguageChosen,Language[Language],0)+1, FALSE)","v":"Warehousing and support activities for transportation"},{"$f":"VLOOKUP(H606,LanguageData,MATCH(LanguageChosen,Language[Language],0),FALSE) & \" - \" & B606","v":"Non Renewable Waste - TJ_NCV"},2023]
["HYDROGEN","TJ_NCV",null,"H52",null,null,null,"Hydrogen",{"$f":"VLOOKUP(D607, Param_Multilanguage!A:C, MATCH(LanguageChosen,Language[Language],0)+1, FALSE)","v":"Warehousing and support activities for transportation"},{"$f":"VLOOKUP(H607,LanguageData,MATCH(LanguageChosen,Language[Language],0),FALSE) & \" - \" & B607","v":"Hydrogen - TJ_NCV"},2023]
["ELECTR","GWH",null,"H53",null,null,null,"Electricity",{"$f":"VLOOKUP(D608, Param_Multilanguage!A:C, MATCH(LanguageChosen,Language[Language],0)+1, FALSE)","v":"Postal and courier activities"},{"$f":"VLOOKUP(H608,LanguageData,MATCH(LanguageChosen,Language[Language],0),FALSE) & \" - \" & B608","v":"Electricity - GWH"},2023]
["NATGAS","TJ_GCV",null,"H53",null,null,null,"Natural Gas",{"$f":"VLOOKUP(D609, Param_Multilanguage!A:C, MATCH(LanguageChosen,Language[Language],0)+1, FALSE)","v":"Postal and courier activities"},{"$f":"VLOOKUP(H609,LanguageData,MATCH(LanguageChosen,Language[Language],0),FALSE) & \" - \" & B609","v":"Natural Gas - TJ_GCV"},2023]
["HEAT","TJ_NCV",null,"H53",null,null,null,"Derived Heat",{"$f":"VLOOKUP(D610, Param_Multilanguage!A:C, MATCH(LanguageChosen,Language[Language],0)+1, FALSE)","v":"Postal and courier activities"},{"$f":"VLOOKUP(H610,LanguageData,MATCH(LanguageChosen,Language[Language],0),FALSE) & \" - \" & B610","v":"Derived Heat - TJ_NCV"},2023]
["TOTALOIL","KT",null,"H53",null,null,null,"Oil and Petroleum Products",{"$f":"VLOOKUP(D611, Param_Multilanguage!A:C, MATCH(LanguageChosen,Language[Language],0)+1, FALSE)","v":"Postal and courier activities"},{"$f":"VLOOKUP(H611,LanguageData,MATCH(LanguageChosen,Language[Language],0),FALSE) & \" - \" & B611","v":"Oil and Petroleum Products - KT"},2023]
["REN","TJ_NCV",null,"H53",null,null,null,"Renewable Energies",{"$f":"VLOOKUP(D612, Param_Multilanguage!A:C, MATCH(LanguageChosen,Language[Language],0)+1, FALSE)","v":"Postal and courier activities"},{"$f":"VLOOKUP(H612,LanguageData,MATCH(LanguageChosen,Language[Language],0),FALSE) & \" - \" & B612","v":"Renewable Energies - TJ_NCV"},2023]
["COAL","KT",null,"H53",null,null,null,"Solid Fossil Fuels",{"$f":"VLOOKUP(D613, Param_Multilanguage!A:C, MATCH(LanguageChosen,Language[Language],0)+1, FALSE)","v":"Postal and courier activities"},{"$f":"VLOOKUP(H613,LanguageData,MATCH(LanguageChosen,Language[Language],0),FALSE) & \" - \" & B613","v":"Solid Fossil Fuels - KT"},2023]
["NONREN","TJ_NCV",null,"H53",null,null,null,"Non Renewable Waste",{"$f":"VLOOKUP(D614, Param_Multilanguage!A:C, MATCH(LanguageChosen,Language[Language],0)+1, FALSE)","v":"Postal and courier activities"},{"$f":"VLOOKUP(H614,LanguageData,MATCH(LanguageChosen,Language[Language],0),FALSE) & \" - \" & B614","v":"Non Renewable Waste - TJ_NCV"},2023]
["HYDROGEN","TJ_NCV",null,"H53",null,null,null,"Hydrogen",{"$f":"VLOOKUP(D615, Param_Multilanguage!A:C, MATCH(LanguageChosen,Language[Language],0)+1, FALSE)","v":"Postal and courier activities"},{"$f":"VLOOKUP(H615,LanguageData,MATCH(LanguageChosen,Language[Language],0),FALSE) & \" - \" & B615","v":"Hydrogen - TJ_NCV"},2023]
["ELECTR","GWH",null,"I",null,null,null,"Electricity",{"$f":"VLOOKUP(D616, Param_Multilanguage!A:C, MATCH(LanguageChosen,Language[Language],0)+1, FALSE)","v":"Accommodation and food services activities"},{"$f":"VLOOKUP(H616,LanguageData,MATCH(LanguageChosen,Language[Language],0),FALSE) & \" - \" & B616","v":"Electricity - GWH"},2023]
["NATGAS","TJ_GCV",null,"I",null,null,null,"Natural Gas",{"$f":"VLOOKUP(D617, Param_Multilanguage!A:C, MATCH(LanguageChosen,Language[Language],0)+1, FALSE)","v":"Accommodation and food services activities"},{"$f":"VLOOKUP(H617,LanguageData,MATCH(LanguageChosen,Language[Language],0),FALSE) & \" - \" & B617","v":"Natural Gas - TJ_GCV"},2023]
["HEAT","TJ_NCV",null,"I",null,null,null,"Derived Heat",{"$f":"VLOOKUP(D618, Param_Multilanguage!A:C, MATCH(LanguageChosen,Language[Language],0)+1, FALSE)","v":"Accommodation and food services activities"},{"$f":"VLOOKUP(H618,LanguageData,MATCH(LanguageChosen,Language[Language],0),FALSE) & \" - \" & B618","v":"Derived Heat - TJ_NCV"},2023]
["TOTALOIL","KT",null,"I",null,null,null,"Oil and Petroleum Products",{"$f":"VLOOKUP(D619, Param_Multilanguage!A:C, MATCH(LanguageChosen,Language[Language],0)+1, FALSE)","v":"Accommodation and food services activities"},{"$f":"VLOOKUP(H619,LanguageData,MATCH(LanguageChosen,Language[Language],0),FALSE) & \" - \" & B619","v":"Oil and Petroleum Products - KT"},2023]
["REN","TJ_NCV",null,"I",null,null,null,"Renewable Energies",{"$f":"VLOOKUP(D620, Param_Multilanguage!A:C, MATCH(LanguageChosen,Language[Language],0)+1, FALSE)","v":"Accommodation and food services activities"},{"$f":"VLOOKUP(H620,LanguageData,MATCH(LanguageChosen,Language[Language],0),FALSE) & \" - \" & B620","v":"Renewable Energies - TJ_NCV"},2023]
["COAL","KT",null,"I",null,null,null,"Solid Fossil Fuels",{"$f":"VLOOKUP(D621, Param_Multilanguage!A:C, MATCH(LanguageChosen,Language[Language],0)+1, FALSE)","v":"Accommodation and food services activities"},{"$f":"VLOOKUP(H621,LanguageData,MATCH(LanguageChosen,Language[Language],0),FALSE) & \" - \" & B621","v":"Solid Fossil Fuels - KT"},2023]
["NONREN","TJ_NCV",null,"I",null,null,null,"Non Renewable Waste",{"$f":"VLOOKUP(D622, Param_Multilanguage!A:C, MATCH(LanguageChosen,Language[Language],0)+1, FALSE)","v":"Accommodation and food services activities"},{"$f":"VLOOKUP(H622,LanguageData,MATCH(LanguageChosen,Language[Language],0),FALSE) & \" - \" & B622","v":"Non Renewable Waste - TJ_NCV"},2023]
["HYDROGEN","TJ_NCV",null,"I",null,null,null,"Hydrogen",{"$f":"VLOOKUP(D623, Param_Multilanguage!A:C, MATCH(LanguageChosen,Language[Language],0)+1, FALSE)","v":"Accommodation and food services activities"},{"$f":"VLOOKUP(H623,LanguageData,MATCH(LanguageChosen,Language[Language],0),FALSE) & \" - \" & B623","v":"Hydrogen - TJ_NCV"},2023]
["ELECTR","GWH",null,"I55",null,null,null,"Electricity",{"$f":"VLOOKUP(D624, Param_Multilanguage!A:C, MATCH(LanguageChosen,Language[Language],0)+1, FALSE)","v":"Accommodation"},{"$f":"VLOOKUP(H624,LanguageData,MATCH(LanguageChosen,Language[Language],0),FALSE) & \" - \" & B624","v":"Electricity - GWH"},2023]
["NATGAS","TJ_GCV",null,"I55",null,null,null,"Natural Gas",{"$f":"VLOOKUP(D625, Param_Multilanguage!A:C, MATCH(LanguageChosen,Language[Language],0)+1, FALSE)","v":"Accommodation"},{"$f":"VLOOKUP(H625,LanguageData,MATCH(LanguageChosen,Language[Language],0),FALSE) & \" - \" & B625","v":"Natural Gas - TJ_GCV"},2023]
["HEAT","TJ_NCV",null,"I55",null,null,null,"Derived Heat",{"$f":"VLOOKUP(D626, Param_Multilanguage!A:C, MATCH(LanguageChosen,Language[Language],0)+1, FALSE)","v":"Accommodation"},{"$f":"VLOOKUP(H626,LanguageData,MATCH(LanguageChosen,Language[Language],0),FALSE) & \" - \" & B626","v":"Derived Heat - TJ_NCV"},2023]
["TOTALOIL","KT",null,"I55",null,null,null,"Oil and Petroleum Products",{"$f":"VLOOKUP(D627, Param_Multilanguage!A:C, MATCH(LanguageChosen,Language[Language],0)+1, FALSE)","v":"Accommodation"},{"$f":"VLOOKUP(H627,LanguageData,MATCH(LanguageChosen,Language[Language],0),FALSE) & \" - \" & B627","v":"Oil and Petroleum Products - KT"},2023]
["REN","TJ_NCV",null,"I55",null,null,null,"Renewable Energies",{"$f":"VLOOKUP(D628, Param_Multilanguage!A:C, MATCH(LanguageChosen,Language[Language],0)+1, FALSE)","v":"Accommodation"},{"$f":"VLOOKUP(H628,LanguageData,MATCH(LanguageChosen,Language[Language],0),FALSE) & \" - \" & B628","v":"Renewable Energies - TJ_NCV"},2023]
["COAL","KT",null,"I55",null,null,null,"Solid Fossil Fuels",{"$f":"VLOOKUP(D629, Param_Multilanguage!A:C, MATCH(LanguageChosen,Language[Language],0)+1, FALSE)","v":"Accommodation"},{"$f":"VLOOKUP(H629,LanguageData,MATCH(LanguageChosen,Language[Language],0),FALSE) & \" - \" & B629","v":"Solid Fossil Fuels - KT"},2023]
["NONREN","TJ_NCV",null,"I55",null,null,null,"Non Renewable Waste",{"$f":"VLOOKUP(D630, Param_Multilanguage!A:C, MATCH(LanguageChosen,Language[Language],0)+1, FALSE)","v":"Accommodation"},{"$f":"VLOOKUP(H630,LanguageData,MATCH(LanguageChosen,Language[Language],0),FALSE) & \" - \" & B630","v":"Non Renewable Waste - TJ_NCV"},2023]
["HYDROGEN","TJ_NCV",null,"I55",null,null,null,"Hydrogen",{"$f":"VLOOKUP(D631, Param_Multilanguage!A:C, MATCH(LanguageChosen,Language[Language],0)+1, FALSE)","v":"Accommodation"},{"$f":"VLOOKUP(H631,LanguageData,MATCH(LanguageChosen,Language[Language],0),FALSE) & \" - \" & B631","v":"Hydrogen - TJ_NCV"},2023]
["ELECTR","GWH",null,"I56",null,null,null,"Electricity",{"$f":"VLOOKUP(D632, Param_Multilanguage!A:C, MATCH(LanguageChosen,Language[Language],0)+1, FALSE)","v":"Food and beverage services activities"},{"$f":"VLOOKUP(H632,LanguageData,MATCH(LanguageChosen,Language[Language],0),FALSE) & \" - \" & B632","v":"Electricity - GWH"},2023]
["NATGAS","TJ_GCV",null,"I56",null,null,null,"Natural Gas",{"$f":"VLOOKUP(D633, Param_Multilanguage!A:C, MATCH(LanguageChosen,Language[Language],0)+1, FALSE)","v":"Food and beverage services activities"},{"$f":"VLOOKUP(H633,LanguageData,MATCH(LanguageChosen,Language[Language],0),FALSE) & \" - \" & B633","v":"Natural Gas - TJ_GCV"},2023]
["HEAT","TJ_NCV",null,"I56",null,null,null,"Derived Heat",{"$f":"VLOOKUP(D634, Param_Multilanguage!A:C, MATCH(LanguageChosen,Language[Language],0)+1, FALSE)","v":"Food and beverage services activities"},{"$f":"VLOOKUP(H634,LanguageData,MATCH(LanguageChosen,Language[Language],0),FALSE) & \" - \" & B634","v":"Derived Heat - TJ_NCV"},2023]
["TOTALOIL","KT",null,"I56",null,null,null,"Oil and Petroleum Products",{"$f":"VLOOKUP(D635, Param_Multilanguage!A:C, MATCH(LanguageChosen,Language[Language],0)+1, FALSE)","v":"Food and beverage services activities"},{"$f":"VLOOKUP(H635,LanguageData,MATCH(LanguageChosen,Language[Language],0),FALSE) & \" - \" & B635","v":"Oil and Petroleum Products - KT"},2023]
["REN","TJ_NCV",null,"I56",null,null,null,"Renewable Energies",{"$f":"VLOOKUP(D636, Param_Multilanguage!A:C, MATCH(LanguageChosen,Language[Language],0)+1, FALSE)","v":"Food and beverage services activities"},{"$f":"VLOOKUP(H636,LanguageData,MATCH(LanguageChosen,Language[Language],0),FALSE) & \" - \" & B636","v":"Renewable Energies - TJ_NCV"},2023]
["COAL","KT",null,"I56",null,null,null,"Solid Fossil Fuels",{"$f":"VLOOKUP(D637, Param_Multilanguage!A:C, MATCH(LanguageChosen,Language[Language],0)+1, FALSE)","v":"Food and beverage services activities"},{"$f":"VLOOKUP(H637,LanguageData,MATCH(LanguageChosen,Language[Language],0),FALSE) & \" - \" & B637","v":"Solid Fossil Fuels - KT"},2023]
["NONREN","TJ_NCV",null,"I56",null,null,null,"Non Renewable Waste",{"$f":"VLOOKUP(D638, Param_Multilanguage!A:C, MATCH(LanguageChosen,Language[Language],0)+1, FALSE)","v":"Food and beverage services activities"},{"$f":"VLOOKUP(H638,LanguageData,MATCH(LanguageChosen,Language[Language],0),FALSE) & \" - \" & B638","v":"Non Renewable Waste - TJ_NCV"},2023]
["HYDROGEN","TJ_NCV",null,"I56",null,null,null,"Hydrogen",{"$f":"VLOOKUP(D639, Param_Multilanguage!A:C, MATCH(LanguageChosen,Language[Language],0)+1, FALSE)","v":"Food and beverage services activities"},{"$f":"VLOOKUP(H639,LanguageData,MATCH(LanguageChosen,Language[Language],0),FALSE) & \" - \" & B639","v":"Hydrogen - TJ_NCV"},2023]
["ELECTR","GWH",null,"J",null,null,null,"Electricity",{"$f":"VLOOKUP(D640, Param_Multilanguage!A:C, MATCH(LanguageChosen,Language[Language],0)+1, FALSE)","v":"Information and communication"},{"$f":"VLOOKUP(H640,LanguageData,MATCH(LanguageChosen,Language[Language],0),FALSE) & \" - \" & B640","v":"Electricity - GWH"},2023]
["NATGAS","TJ_GCV",null,"J",null,null,null,"Natural Gas",{"$f":"VLOOKUP(D641, Param_Multilanguage!A:C, MATCH(LanguageChosen,Language[Language],0)+1, FALSE)","v":"Information and communication"},{"$f":"VLOOKUP(H641,LanguageData,MATCH(LanguageChosen,Language[Language],0),FALSE) & \" - \" & B641","v":"Natural Gas - TJ_GCV"},2023]
["HEAT","TJ_NCV",null,"J",null,null,null,"Derived Heat",{"$f":"VLOOKUP(D642, Param_Multilanguage!A:C, MATCH(LanguageChosen,Language[Language],0)+1, FALSE)","v":"Information and communication"},{"$f":"VLOOKUP(H642,LanguageData,MATCH(LanguageChosen,Language[Language],0),FALSE) & \" - \" & B642","v":"Derived Heat - TJ_NCV"},2023]
["TOTALOIL","KT",null,"J",null,null,null,"Oil and Petroleum Products",{"$f":"VLOOKUP(D643, Param_Multilanguage!A:C, MATCH(LanguageChosen,Language[Language],0)+1, FALSE)","v":"Information and communication"},{"$f":"VLOOKUP(H643,LanguageData,MATCH(LanguageChosen,Language[Language],0),FALSE) & \" - \" & B643","v":"Oil and Petroleum Products - KT"},2023]
["REN","TJ_NCV",null,"J",null,null,null,"Renewable Energies",{"$f":"VLOOKUP(D644, Param_Multilanguage!A:C, MATCH(LanguageChosen,Language[Language],0)+1, FALSE)","v":"Information and communication"},{"$f":"VLOOKUP(H644,LanguageData,MATCH(LanguageChosen,Language[Language],0),FALSE) & \" - \" & B644","v":"Renewable Energies - TJ_NCV"},2023]
["COAL","KT",null,"J",null,null,null,"Solid Fossil Fuels",{"$f":"VLOOKUP(D645, Param_Multilanguage!A:C, MATCH(LanguageChosen,Language[Language],0)+1, FALSE)","v":"Information and communication"},{"$f":"VLOOKUP(H645,LanguageData,MATCH(LanguageChosen,Language[Language],0),FALSE) & \" - \" & B645","v":"Solid Fossil Fuels - KT"},2023]
["NONREN","TJ_NCV",null,"J",null,null,null,"Non Renewable Waste",{"$f":"VLOOKUP(D646, Param_Multilanguage!A:C, MATCH(LanguageChosen,Language[Language],0)+1, FALSE)","v":"Information and communication"},{"$f":"VLOOKUP(H646,LanguageData,MATCH(LanguageChosen,Language[Language],0),FALSE) & \" - \" & B646","v":"Non Renewable Waste - TJ_NCV"},2023]
["HYDROGEN","TJ_NCV",null,"J",null,null,null,"Hydrogen",{"$f":"VLOOKUP(D647, Param_Multilanguage!A:C, MATCH(LanguageChosen,Language[Language],0)+1, FALSE)","v":"Information and communication"},{"$f":"VLOOKUP(H647,LanguageData,MATCH(LanguageChosen,Language[Language],0),FALSE) & \" - \" & B647","v":"Hydrogen - TJ_NCV"},2023]
["ELECTR","GWH",null,"K_L",null,null,null,"Electricity",{"$f":"VLOOKUP(D648, Param_Multilanguage!A:C, MATCH(LanguageChosen,Language[Language],0)+1, FALSE)","v":"Financial and insurance activities; real estate activities"},{"$f":"VLOOKUP(H648,LanguageData,MATCH(LanguageChosen,Language[Language],0),FALSE) & \" - \" & B648","v":"Electricity - GWH"},2023]
["NATGAS","TJ_GCV",null,"K_L",null,null,null,"Natural Gas",{"$f":"VLOOKUP(D649, Param_Multilanguage!A:C, MATCH(LanguageChosen,Language[Language],0)+1, FALSE)","v":"Financial and insurance activities; real estate activities"},{"$f":"VLOOKUP(H649,LanguageData,MATCH(LanguageChosen,Language[Language],0),FALSE) & \" - \" & B649","v":"Natural Gas - TJ_GCV"},2023]
["HEAT","TJ_NCV",null,"K_L",null,null,null,"Derived Heat",{"$f":"VLOOKUP(D650, Param_Multilanguage!A:C, MATCH(LanguageChosen,Language[Language],0)+1, FALSE)","v":"Financial and insurance activities; real estate activities"},{"$f":"VLOOKUP(H650,LanguageData,MATCH(LanguageChosen,Language[Language],0),FALSE) & \" - \" & B650","v":"Derived Heat - TJ_NCV"},2023]
["TOTALOIL","KT",null,"K_L",null,null,null,"Oil and Petroleum Products",{"$f":"VLOOKUP(D651, Param_Multilanguage!A:C, MATCH(LanguageChosen,Language[Language],0)+1, FALSE)","v":"Financial and insurance activities; real estate activities"},{"$f":"VLOOKUP(H651,LanguageData,MATCH(LanguageChosen,Language[Language],0),FALSE) & \" - \" & B651","v":"Oil and Petroleum Products - KT"},2023]
["REN","TJ_NCV",null,"K_L",null,null,null,"Renewable Energies",{"$f":"VLOOKUP(D652, Param_Multilanguage!A:C, MATCH(LanguageChosen,Language[Language],0)+1, FALSE)","v":"Financial and insurance activities; real estate activities"},{"$f":"VLOOKUP(H652,LanguageData,MATCH(LanguageChosen,Language[Language],0),FALSE) & \" - \" & B652","v":"Renewable Energies - TJ_NCV"},2023]
["COAL","KT",null,"K_L",null,null,null,"Solid Fossil Fuels",{"$f":"VLOOKUP(D653, Param_Multilanguage!A:C, MATCH(LanguageChosen,Language[Language],0)+1, FALSE)","v":"Financial and insurance activities; real estate activities"},{"$f":"VLOOKUP(H653,LanguageData,MATCH(LanguageChosen,Language[Language],0),FALSE) & \" - \" & B653","v":"Solid Fossil Fuels - KT"},2023]
["NONREN","TJ_NCV",null,"K_L",null,null,null,"Non Renewable Waste",{"$f":"VLOOKUP(D654, Param_Multilanguage!A:C, MATCH(LanguageChosen,Language[Language],0)+1, FALSE)","v":"Financial and insurance activities; real estate activities"},{"$f":"VLOOKUP(H654,LanguageData,MATCH(LanguageChosen,Language[Language],0),FALSE) & \" - \" & B654","v":"Non Renewable Waste - TJ_NCV"},2023]
["HYDROGEN","TJ_NCV",null,"K_L",null,null,null,"Hydrogen",{"$f":"VLOOKUP(D655, Param_Multilanguage!A:C, MATCH(LanguageChosen,Language[Language],0)+1, FALSE)","v":"Financial and insurance activities; real estate activities"},{"$f":"VLOOKUP(H655,LanguageData,MATCH(LanguageChosen,Language[Language],0),FALSE) & \" - \" & B655","v":"Hydrogen - TJ_NCV"},2023]
["ELECTR","GWH",null,"M_S",null,null,null,"Electricity",{"$f":"VLOOKUP(D656, Param_Multilanguage!A:C, MATCH(LanguageChosen,Language[Language],0)+1, FALSE)","v":"Professional, scientific and technical activities; other services"},{"$f":"VLOOKUP(H656,LanguageData,MATCH(LanguageChosen,Language[Language],0),FALSE) & \" - \" & B656","v":"Electricity - GWH"},2023]
["NATGAS","TJ_GCV",null,"M_S",null,null,null,"Natural Gas",{"$f":"VLOOKUP(D657, Param_Multilanguage!A:C, MATCH(LanguageChosen,Language[Language],0)+1, FALSE)","v":"Professional, scientific and technical activities; other services"},{"$f":"VLOOKUP(H657,LanguageData,MATCH(LanguageChosen,Language[Language],0),FALSE) & \" - \" & B657","v":"Natural Gas - TJ_GCV"},2023]
["HEAT","TJ_NCV",null,"M_S",null,null,null,"Derived Heat",{"$f":"VLOOKUP(D658, Param_Multilanguage!A:C, MATCH(LanguageChosen,Language[Language],0)+1, FALSE)","v":"Professional, scientific and technical activities; other services"},{"$f":"VLOOKUP(H658,LanguageData,MATCH(LanguageChosen,Language[Language],0),FALSE) & \" - \" & B658","v":"Derived Heat - TJ_NCV"},2023]
["TOTALOIL","KT",null,"M_S",null,null,null,"Oil and Petroleum Products",{"$f":"VLOOKUP(D659, Param_Multilanguage!A:C, MATCH(LanguageChosen,Language[Language],0)+1, FALSE)","v":"Professional, scientific and technical activities; other services"},{"$f":"VLOOKUP(H659,LanguageData,MATCH(LanguageChosen,Language[Language],0),FALSE) & \" - \" & B659","v":"Oil and Petroleum Products - KT"},2023]
["REN","TJ_NCV",null,"M_S",null,null,null,"Renewable Energies",{"$f":"VLOOKUP(D660, Param_Multilanguage!A:C, MATCH(LanguageChosen,Language[Language],0)+1, FALSE)","v":"Professional, scientific and technical activities; other services"},{"$f":"VLOOKUP(H660,LanguageData,MATCH(LanguageChosen,Language[Language],0),FALSE) & \" - \" & B660","v":"Renewable Energies - TJ_NCV"},2023]
["COAL","KT",null,"M_S",null,null,null,"Solid Fossil Fuels",{"$f":"VLOOKUP(D661, Param_Multilanguage!A:C, MATCH(LanguageChosen,Language[Language],0)+1, FALSE)","v":"Professional, scientific and technical activities; other services"},{"$f":"VLOOKUP(H661,LanguageData,MATCH(LanguageChosen,Language[Language],0),FALSE) & \" - \" & B661","v":"Solid Fossil Fuels - KT"},2023]
["NONREN","TJ_NCV",null,"M_S",null,null,null,"Non Renewable Waste",{"$f":"VLOOKUP(D662, Param_Multilanguage!A:C, MATCH(LanguageChosen,Language[Language],0)+1, FALSE)","v":"Professional, scientific and technical activities; other services"},{"$f":"VLOOKUP(H662,LanguageData,MATCH(LanguageChosen,Language[Language],0),FALSE) & \" - \" & B662","v":"Non Renewable Waste - TJ_NCV"},2023]
["HYDROGEN","TJ_NCV",null,"M_S",null,null,null,"Hydrogen",{"$f":"VLOOKUP(D663, Param_Multilanguage!A:C, MATCH(LanguageChosen,Language[Language],0)+1, FALSE)","v":"Professional, scientific and technical activities; other services"},{"$f":"VLOOKUP(H663,LanguageData,MATCH(LanguageChosen,Language[Language],0),FALSE) & \" - \" & B663","v":"Hydrogen - TJ_NCV"},2023]
["ELECTR","GWH",null,"N",null,null,null,"Electricity",{"$f":"VLOOKUP(D664, Param_Multilanguage!A:C, MATCH(LanguageChosen,Language[Language],0)+1, FALSE)","v":"Administrative and support services activities"},{"$f":"VLOOKUP(H664,LanguageData,MATCH(LanguageChosen,Language[Language],0),FALSE) & \" - \" & B664","v":"Electricity - GWH"},2023]
["NATGAS","TJ_GCV",null,"N",null,null,null,"Natural Gas",{"$f":"VLOOKUP(D665, Param_Multilanguage!A:C, MATCH(LanguageChosen,Language[Language],0)+1, FALSE)","v":"Administrative and support services activities"},{"$f":"VLOOKUP(H665,LanguageData,MATCH(LanguageChosen,Language[Language],0),FALSE) & \" - \" & B665","v":"Natural Gas - TJ_GCV"},2023]
["HEAT","TJ_NCV",null,"N",null,null,null,"Derived Heat",{"$f":"VLOOKUP(D666, Param_Multilanguage!A:C, MATCH(LanguageChosen,Language[Language],0)+1, FALSE)","v":"Administrative and support services activities"},{"$f":"VLOOKUP(H666,LanguageData,MATCH(LanguageChosen,Language[Language],0),FALSE) & \" - \" & B666","v":"Derived Heat - TJ_NCV"},2023]
["TOTALOIL","KT",null,"N",null,null,null,"Oil and Petroleum Products",{"$f":"VLOOKUP(D667, Param_Multilanguage!A:C, MATCH(LanguageChosen,Language[Language],0)+1, FALSE)","v":"Administrative and support services activities"},{"$f":"VLOOKUP(H667,LanguageData,MATCH(LanguageChosen,Language[Language],0),FALSE) & \" - \" & B667","v":"Oil and Petroleum Products - KT"},2023]
["REN","TJ_NCV",null,"N",null,null,null,"Renewable Energies",{"$f":"VLOOKUP(D668, Param_Multilanguage!A:C, MATCH(LanguageChosen,Language[Language],0)+1, FALSE)","v":"Administrative and support services activities"},{"$f":"VLOOKUP(H668,LanguageData,MATCH(LanguageChosen,Language[Language],0),FALSE) & \" - \" & B668","v":"Renewable Energies - TJ_NCV"},2023]
["COAL","KT",null,"N",null,null,null,"Solid Fossil Fuels",{"$f":"VLOOKUP(D669, Param_Multilanguage!A:C, MATCH(LanguageChosen,Language[Language],0)+1, FALSE)","v":"Administrative and support services activities"},{"$f":"VLOOKUP(H669,LanguageData,MATCH(LanguageChosen,Language[Language],0),FALSE) & \" - \" & B669","v":"Solid Fossil Fuels - KT"},2023]
["NONREN","TJ_NCV",null,"N",null,null,null,"Non Renewable Waste",{"$f":"VLOOKUP(D670, Param_Multilanguage!A:C, MATCH(LanguageChosen,Language[Language],0)+1, FALSE)","v":"Administrative and support services activities"},{"$f":"VLOOKUP(H670,LanguageData,MATCH(LanguageChosen,Language[Language],0),FALSE) & \" - \" & B670","v":"Non Renewable Waste - TJ_NCV"},2023]
["HYDROGEN","TJ_NCV",null,"N",null,null,null,"Hydrogen",{"$f":"VLOOKUP(D671, Param_Multilanguage!A:C, MATCH(LanguageChosen,Language[Language],0)+1, FALSE)","v":"Administrative and support services activities"},{"$f":"VLOOKUP(H671,LanguageData,MATCH(LanguageChosen,Language[Language],0),FALSE) & \" - \" & B671","v":"Hydrogen - TJ_NCV"},2023]
["ELECTR","GWH",null,"O",null,null,null,"Electricity",{"$f":"VLOOKUP(D672, Param_Multilanguage!A:C, MATCH(LanguageChosen,Language[Language],0)+1, FALSE)","v":"Public administration and defence; compulsory social security"},{"$f":"VLOOKUP(H672,LanguageData,MATCH(LanguageChosen,Language[Language],0),FALSE) & \" - \" & B672","v":"Electricity - GWH"},2023]
["NATGAS","TJ_GCV",null,"O",null,null,null,"Natural Gas",{"$f":"VLOOKUP(D673, Param_Multilanguage!A:C, MATCH(LanguageChosen,Language[Language],0)+1, FALSE)","v":"Public administration and defence; compulsory social security"},{"$f":"VLOOKUP(H673,LanguageData,MATCH(LanguageChosen,Language[Language],0),FALSE) & \" - \" & B673","v":"Natural Gas - TJ_GCV"},2023]
["HEAT","TJ_NCV",null,"O",null,null,null,"Derived Heat",{"$f":"VLOOKUP(D674, Param_Multilanguage!A:C, MATCH(LanguageChosen,Language[Language],0)+1, FALSE)","v":"Public administration and defence; compulsory social security"},{"$f":"VLOOKUP(H674,LanguageData,MATCH(LanguageChosen,Language[Language],0),FALSE) & \" - \" & B674","v":"Derived Heat - TJ_NCV"},2023]
["TOTALOIL","KT",null,"O",null,null,null,"Oil and Petroleum Products",{"$f":"VLOOKUP(D675, Param_Multilanguage!A:C, MATCH(LanguageChosen,Language[Language],0)+1, FALSE)","v":"Public administration and defence; compulsory social security"},{"$f":"VLOOKUP(H675,LanguageData,MATCH(LanguageChosen,Language[Language],0),FALSE) & \" - \" & B675","v":"Oil and Petroleum Products - KT"},2023]
["REN","TJ_NCV",null,"O",null,null,null,"Renewable Energies",{"$f":"VLOOKUP(D676, Param_Multilanguage!A:C, MATCH(LanguageChosen,Language[Language],0)+1, FALSE)","v":"Public administration and defence; compulsory social security"},{"$f":"VLOOKUP(H676,LanguageData,MATCH(LanguageChosen,Language[Language],0),FALSE) & \" - \" & B676","v":"Renewable Energies - TJ_NCV"},2023]
["COAL","KT",null,"O",null,null,null,"Solid Fossil Fuels",{"$f":"VLOOKUP(D677, Param_Multilanguage!A:C, MATCH(LanguageChosen,Language[Language],0)+1, FALSE)","v":"Public administration and defence; compulsory social security"},{"$f":"VLOOKUP(H677,LanguageData,MATCH(LanguageChosen,Language[Language],0),FALSE) & \" - \" & B677","v":"Solid Fossil Fuels - KT"},2023]
["NONREN","TJ_NCV",null,"O",null,null,null,"Non Renewable Waste",{"$f":"VLOOKUP(D678, Param_Multilanguage!A:C, MATCH(LanguageChosen,Language[Language],0)+1, FALSE)","v":"Public administration and defence; compulsory social security"},{"$f":"VLOOKUP(H678,LanguageData,MATCH(LanguageChosen,Language[Language],0),FALSE) & \" - \" & B678","v":"Non Renewable Waste - TJ_NCV"},2023]
["HYDROGEN","TJ_NCV",null,"O",null,null,null,"Hydrogen",{"$f":"VLOOKUP(D679, Param_Multilanguage!A:C, MATCH(LanguageChosen,Language[Language],0)+1, FALSE)","v":"Public administration and defence; compulsory social security"},{"$f":"VLOOKUP(H679,LanguageData,MATCH(LanguageChosen,Language[Language],0),FALSE) & \" - \" & B679","v":"Hydrogen - TJ_NCV"},2023]
["ELECTR","GWH",null,"P",null,null,null,"Electricity",{"$f":"VLOOKUP(D680, Param_Multilanguage!A:C, MATCH(LanguageChosen,Language[Language],0)+1, FALSE)","v":"Education"},{"$f":"VLOOKUP(H680,LanguageData,MATCH(LanguageChosen,Language[Language],0),FALSE) & \" - \" & B680","v":"Electricity - GWH"},2023]
["NATGAS","TJ_GCV",null,"P",null,null,null,"Natural Gas",{"$f":"VLOOKUP(D681, Param_Multilanguage!A:C, MATCH(LanguageChosen,Language[Language],0)+1, FALSE)","v":"Education"},{"$f":"VLOOKUP(H681,LanguageData,MATCH(LanguageChosen,Language[Language],0),FALSE) & \" - \" & B681","v":"Natural Gas - TJ_GCV"},2023]
["HEAT","TJ_NCV",null,"P",null,null,null,"Derived Heat",{"$f":"VLOOKUP(D682, Param_Multilanguage!A:C, MATCH(LanguageChosen,Language[Language],0)+1, FALSE)","v":"Education"},{"$f":"VLOOKUP(H682,LanguageData,MATCH(LanguageChosen,Language[Language],0),FALSE) & \" - \" & B682","v":"Derived Heat - TJ_NCV"},2023]
["TOTALOIL","KT",null,"P",null,null,null,"Oil and Petroleum Products",{"$f":"VLOOKUP(D683, Param_Multilanguage!A:C, MATCH(LanguageChosen,Language[Language],0)+1, FALSE)","v":"Education"},{"$f":"VLOOKUP(H683,LanguageData,MATCH(LanguageChosen,Language[Language],0),FALSE) & \" - \" & B683","v":"Oil and Petroleum Products - KT"},2023]
["REN","TJ_NCV",null,"P",null,null,null,"Renewable Energies",{"$f":"VLOOKUP(D684, Param_Multilanguage!A:C, MATCH(LanguageChosen,Language[Language],0)+1, FALSE)","v":"Education"},{"$f":"VLOOKUP(H684,LanguageData,MATCH(LanguageChosen,Language[Language],0),FALSE) & \" - \" & B684","v":"Renewable Energies - TJ_NCV"},2023]
["COAL","KT",null,"P",null,null,null,"Solid Fossil Fuels",{"$f":"VLOOKUP(D685, Param_Multilanguage!A:C, MATCH(LanguageChosen,Language[Language],0)+1, FALSE)","v":"Education"},{"$f":"VLOOKUP(H685,LanguageData,MATCH(LanguageChosen,Language[Language],0),FALSE) & \" - \" & B685","v":"Solid Fossil Fuels - KT"},2023]
["NONREN","TJ_NCV",null,"P",null,null,null,"Non Renewable Waste",{"$f":"VLOOKUP(D686, Param_Multilanguage!A:C, MATCH(LanguageChosen,Language[Language],0)+1, FALSE)","v":"Education"},{"$f":"VLOOKUP(H686,LanguageData,MATCH(LanguageChosen,Language[Language],0),FALSE) & \" - \" & B686","v":"Non Renewable Waste - TJ_NCV"},2023]
["HYDROGEN","TJ_NCV",null,"P",null,null,null,"Hydrogen",{"$f":"VLOOKUP(D687, Param_Multilanguage!A:C, MATCH(LanguageChosen,Language[Language],0)+1, FALSE)","v":"Education"},{"$f":"VLOOKUP(H687,LanguageData,MATCH(LanguageChosen,Language[Language],0),FALSE) & \" - \" & B687","v":"Hydrogen - TJ_NCV"},2023]
["ELECTR","GWH",null,"Q",null,null,null,"Electricity",{"$f":"VLOOKUP(D688, Param_Multilanguage!A:C, MATCH(LanguageChosen,Language[Language],0)+1, FALSE)","v":"Human health and social work activities"},{"$f":"VLOOKUP(H688,LanguageData,MATCH(LanguageChosen,Language[Language],0),FALSE) & \" - \" & B688","v":"Electricity - GWH"},2023]
["NATGAS","TJ_GCV",null,"Q",null,null,null,"Natural Gas",{"$f":"VLOOKUP(D689, Param_Multilanguage!A:C, MATCH(LanguageChosen,Language[Language],0)+1, FALSE)","v":"Human health and social work activities"},{"$f":"VLOOKUP(H689,LanguageData,MATCH(LanguageChosen,Language[Language],0),FALSE) & \" - \" & B689","v":"Natural Gas - TJ_GCV"},2023]
["HEAT","TJ_NCV",null,"Q",null,null,null,"Derived Heat",{"$f":"VLOOKUP(D690, Param_Multilanguage!A:C, MATCH(LanguageChosen,Language[Language],0)+1, FALSE)","v":"Human health and social work activities"},{"$f":"VLOOKUP(H690,LanguageData,MATCH(LanguageChosen,Language[Language],0),FALSE) & \" - \" & B690","v":"Derived Heat - TJ_NCV"},2023]
["TOTALOIL","KT",null,"Q",null,null,null,"Oil and Petroleum Products",{"$f":"VLOOKUP(D691, Param_Multilanguage!A:C, MATCH(LanguageChosen,Language[Language],0)+1, FALSE)","v":"Human health and social work activities"},{"$f":"VLOOKUP(H691,LanguageData,MATCH(LanguageChosen,Language[Language],0),FALSE) & \" - \" & B691","v":"Oil and Petroleum Products - KT"},2023]
["REN","TJ_NCV",null,"Q",null,null,null,"Renewable Energies",{"$f":"VLOOKUP(D692, Param_Multilanguage!A:C, MATCH(LanguageChosen,Language[Language],0)+1, FALSE)","v":"Human health and social work activities"},{"$f":"VLOOKUP(H692,LanguageData,MATCH(LanguageChosen,Language[Language],0),FALSE) & \" - \" & B692","v":"Renewable Energies - TJ_NCV"},2023]
["COAL","KT",null,"Q",null,null,null,"Solid Fossil Fuels",{"$f":"VLOOKUP(D693, Param_Multilanguage!A:C, MATCH(LanguageChosen,Language[Language],0)+1, FALSE)","v":"Human health and social work activities"},{"$f":"VLOOKUP(H693,LanguageData,MATCH(LanguageChosen,Language[Language],0),FALSE) & \" - \" & B693","v":"Solid Fossil Fuels - KT"},2023]
["NONREN","TJ_NCV",null,"Q",null,null,null,"Non Renewable Waste",{"$f":"VLOOKUP(D694, Param_Multilanguage!A:C, MATCH(LanguageChosen,Language[Language],0)+1, FALSE)","v":"Human health and social work activities"},{"$f":"VLOOKUP(H694,LanguageData,MATCH(LanguageChosen,Language[Language],0),FALSE) & \" - \" & B694","v":"Non Renewable Waste - TJ_NCV"},2023]
["HYDROGEN","TJ_NCV",null,"Q",null,null,null,"Hydrogen",{"$f":"VLOOKUP(D695, Param_Multilanguage!A:C, MATCH(LanguageChosen,Language[Language],0)+1, FALSE)","v":"Human health and social work activities"},{"$f":"VLOOKUP(H695,LanguageData,MATCH(LanguageChosen,Language[Language],0),FALSE) & \" - \" & B695","v":"Hydrogen - TJ_NCV"},2023]
["ELECTR","GWH",null,"Q861",null,null,null,"Electricity",{"$f":"VLOOKUP(D696, Param_Multilanguage!A:C, MATCH(LanguageChosen,Language[Language],0)+1, FALSE)","v":"Of which: Hospital activities"},{"$f":"VLOOKUP(H696,LanguageData,MATCH(LanguageChosen,Language[Language],0),FALSE) & \" - \" & B696","v":"Electricity - GWH"},2023]
["NATGAS","TJ_GCV",null,"Q861",null,null,null,"Natural Gas",{"$f":"VLOOKUP(D697, Param_Multilanguage!A:C, MATCH(LanguageChosen,Language[Language],0)+1, FALSE)","v":"Of which: Hospital activities"},{"$f":"VLOOKUP(H697,LanguageData,MATCH(LanguageChosen,Language[Language],0),FALSE) & \" - \" & B697","v":"Natural Gas - TJ_GCV"},2023]
["HEAT","TJ_NCV",null,"Q861",null,null,null,"Derived Heat",{"$f":"VLOOKUP(D698, Param_Multilanguage!A:C, MATCH(LanguageChosen,Language[Language],0)+1, FALSE)","v":"Of which: Hospital activities"},{"$f":"VLOOKUP(H698,LanguageData,MATCH(LanguageChosen,Language[Language],0),FALSE) & \" - \" & B698","v":"Derived Heat - TJ_NCV"},2023]
["TOTALOIL","KT",null,"Q861",null,null,null,"Oil and Petroleum Products",{"$f":"VLOOKUP(D699, Param_Multilanguage!A:C, MATCH(LanguageChosen,Language[Language],0)+1, FALSE)","v":"Of which: Hospital activities"},{"$f":"VLOOKUP(H699,LanguageData,MATCH(LanguageChosen,Language[Language],0),FALSE) & \" - \" & B699","v":"Oil and Petroleum Products - KT"},2023]
["REN","TJ_NCV",null,"Q861",null,null,null,"Renewable Energies",{"$f":"VLOOKUP(D700, Param_Multilanguage!A:C, MATCH(LanguageChosen,Language[Language],0)+1, FALSE)","v":"Of which: Hospital activities"},{"$f":"VLOOKUP(H700,LanguageData,MATCH(LanguageChosen,Language[Language],0),FALSE) & \" - \" & B700","v":"Renewable Energies - TJ_NCV"},2023]
["COAL","KT",null,"Q861",null,null,null,"Solid Fossil Fuels",{"$f":"VLOOKUP(D701, Param_Multilanguage!A:C, MATCH(LanguageChosen,Language[Language],0)+1, FALSE)","v":"Of which: Hospital activities"},{"$f":"VLOOKUP(H701,LanguageData,MATCH(LanguageChosen,Language[Language],0),FALSE) & \" - \" & B701","v":"Solid Fossil Fuels - KT"},2023]
["NONREN","TJ_NCV",null,"Q861",null,null,null,"Non Renewable Waste",{"$f":"VLOOKUP(D702, Param_Multilanguage!A:C, MATCH(LanguageChosen,Language[Language],0)+1, FALSE)","v":"Of which: Hospital activities"},{"$f":"VLOOKUP(H702,LanguageData,MATCH(LanguageChosen,Language[Language],0),FALSE) & \" - \" & B702","v":"Non Renewable Waste - TJ_NCV"},2023]
["HYDROGEN","TJ_NCV",null,"Q861",null,null,null,"Hydrogen",{"$f":"VLOOKUP(D703, Param_Multilanguage!A:C, MATCH(LanguageChosen,Language[Language],0)+1, FALSE)","v":"Of which: Hospital activities"},{"$f":"VLOOKUP(H703,LanguageData,MATCH(LanguageChosen,Language[Language],0),FALSE) & \" - \" & B703","v":"Hydrogen - TJ_NCV"},2023]
["ELECTR","GWH",null,"R",null,null,null,"Electricity",{"$f":"VLOOKUP(D704, Param_Multilanguage!A:C, MATCH(LanguageChosen,Language[Language],0)+1, FALSE)","v":"Arts, entertainment and recreation"},{"$f":"VLOOKUP(H704,LanguageData,MATCH(LanguageChosen,Language[Language],0),FALSE) & \" - \" & B704","v":"Electricity - GWH"},2023]
["NATGAS","TJ_GCV",null,"R",null,null,null,"Natural Gas",{"$f":"VLOOKUP(D705, Param_Multilanguage!A:C, MATCH(LanguageChosen,Language[Language],0)+1, FALSE)","v":"Arts, entertainment and recreation"},{"$f":"VLOOKUP(H705,LanguageData,MATCH(LanguageChosen,Language[Language],0),FALSE) & \" - \" & B705","v":"Natural Gas - TJ_GCV"},2023]
["HEAT","TJ_NCV",null,"R",null,null,null,"Derived Heat",{"$f":"VLOOKUP(D706, Param_Multilanguage!A:C, MATCH(LanguageChosen,Language[Language],0)+1, FALSE)","v":"Arts, entertainment and recreation"},{"$f":"VLOOKUP(H706,LanguageData,MATCH(LanguageChosen,Language[Language],0),FALSE) & \" - \" & B706","v":"Derived Heat - TJ_NCV"},2023]
["TOTALOIL","KT",null,"R",null,null,null,"Oil and Petroleum Products",{"$f":"VLOOKUP(D707, Param_Multilanguage!A:C, MATCH(LanguageChosen,Language[Language],0)+1, FALSE)","v":"Arts, entertainment and recreation"},{"$f":"VLOOKUP(H707,LanguageData,MATCH(LanguageChosen,Language[Language],0),FALSE) & \" - \" & B707","v":"Oil and Petroleum Products - KT"},2023]
["REN","TJ_NCV",null,"R",null,null,null,"Renewable Energies",{"$f":"VLOOKUP(D708, Param_Multilanguage!A:C, MATCH(LanguageChosen,Language[Language],0)+1, FALSE)","v":"Arts, entertainment and recreation"},{"$f":"VLOOKUP(H708,LanguageData,MATCH(LanguageChosen,Language[Language],0),FALSE) & \" - \" & B708","v":"Renewable Energies - TJ_NCV"},2023]
["COAL","KT",null,"R",null,null,null,"Solid Fossil Fuels",{"$f":"VLOOKUP(D709, Param_Multilanguage!A:C, MATCH(LanguageChosen,Language[Language],0)+1, FALSE)","v":"Arts, entertainment and recreation"},{"$f":"VLOOKUP(H709,LanguageData,MATCH(LanguageChosen,Language[Language],0),FALSE) & \" - \" & B709","v":"Solid Fossil Fuels - KT"},2023]
["NONREN","TJ_NCV",null,"R",null,null,null,"Non Renewable Waste",{"$f":"VLOOKUP(D710, Param_Multilanguage!A:C, MATCH(LanguageChosen,Language[Language],0)+1, FALSE)","v":"Arts, entertainment and recreation"},{"$f":"VLOOKUP(H710,LanguageData,MATCH(LanguageChosen,Language[Language],0),FALSE) & \" - \" & B710","v":"Non Renewable Waste - TJ_NCV"},2023]
["HYDROGEN","TJ_NCV",null,"R",null,null,null,"Hydrogen",{"$f":"VLOOKUP(D711, Param_Multilanguage!A:C, MATCH(LanguageChosen,Language[Language],0)+1, FALSE)","v":"Arts, entertainment and recreation"},{"$f":"VLOOKUP(H711,LanguageData,MATCH(LanguageChosen,Language[Language],0),FALSE) & \" - \" & B711","v":"Hydrogen - TJ_NCV"},2023]
["ELECTR","GWH",null,"R93",null,null,null,"Electricity",{"$f":"VLOOKUP(D712, Param_Multilanguage!A:C, MATCH(LanguageChosen,Language[Language],0)+1, FALSE)","v":"Of which: Sports activities and amusement and recreation activities"},{"$f":"VLOOKUP(H712,LanguageData,MATCH(LanguageChosen,Language[Language],0),FALSE) & \" - \" & B712","v":"Electricity - GWH"},2023]
["NATGAS","TJ_GCV",null,"R93",null,null,null,"Natural Gas",{"$f":"VLOOKUP(D713, Param_Multilanguage!A:C, MATCH(LanguageChosen,Language[Language],0)+1, FALSE)","v":"Of which: Sports activities and amusement and recreation activities"},{"$f":"VLOOKUP(H713,LanguageData,MATCH(LanguageChosen,Language[Language],0),FALSE) & \" - \" & B713","v":"Natural Gas - TJ_GCV"},2023]
["HEAT","TJ_NCV",null,"R93",null,null,null,"Derived Heat",{"$f":"VLOOKUP(D714, Param_Multilanguage!A:C, MATCH(LanguageChosen,Language[Language],0)+1, FALSE)","v":"Of which: Sports activities and amusement and recreation activities"},{"$f":"VLOOKUP(H714,LanguageData,MATCH(LanguageChosen,Language[Language],0),FALSE) & \" - \" & B714","v":"Derived Heat - TJ_NCV"},2023]
["TOTALOIL","KT",null,"R93",null,null,null,"Oil and Petroleum Products",{"$f":"VLOOKUP(D715, Param_Multilanguage!A:C, MATCH(LanguageChosen,Language[Language],0)+1, FALSE)","v":"Of which: Sports activities and amusement and recreation activities"},{"$f":"VLOOKUP(H715,LanguageData,MATCH(LanguageChosen,Language[Language],0),FALSE) & \" - \" & B715","v":"Oil and Petroleum Products - KT"},2023]
["REN","TJ_NCV",null,"R93",null,null,null,"Renewable Energies",{"$f":"VLOOKUP(D716, Param_Multilanguage!A:C, MATCH(LanguageChosen,Language[Language],0)+1, FALSE)","v":"Of which: Sports activities and amusement and recreation activities"},{"$f":"VLOOKUP(H716,LanguageData,MATCH(LanguageChosen,Language[Language],0),FALSE) & \" - \" & B716","v":"Renewable Energies - TJ_NCV"},2023]
["COAL","KT",null,"R93",null,null,null,"Solid Fossil Fuels",{"$f":"VLOOKUP(D717, Param_Multilanguage!A:C, MATCH(LanguageChosen,Language[Language],0)+1, FALSE)","v":"Of which: Sports activities and amusement and recreation activities"},{"$f":"VLOOKUP(H717,LanguageData,MATCH(LanguageChosen,Language[Language],0),FALSE) & \" - \" & B717","v":"Solid Fossil Fuels - KT"},2023]
["NONREN","TJ_NCV",null,"R93",null,null,null,"Non Renewable Waste",{"$f":"VLOOKUP(D718, Param_Multilanguage!A:C, MATCH(LanguageChosen,Language[Language],0)+1, FALSE)","v":"Of which: Sports activities and amusement and recreation activities"},{"$f":"VLOOKUP(H718,LanguageData,MATCH(LanguageChosen,Language[Language],0),FALSE) & \" - \" & B718","v":"Non Renewable Waste - TJ_NCV"},2023]
["HYDROGEN","TJ_NCV",null,"R93",null,null,null,"Hydrogen",{"$f":"VLOOKUP(D719, Param_Multilanguage!A:C, MATCH(LanguageChosen,Language[Language],0)+1, FALSE)","v":"Of which: Sports activities and amusement and recreation activities"},{"$f":"VLOOKUP(H719,LanguageData,MATCH(LanguageChosen,Language[Language],0),FALSE) & \" - \" & B719","v":"Hydrogen - TJ_NCV"},2023]
["ELECTR","GWH",null,"U",null,null,null,"Electricity",{"$f":"VLOOKUP(D720, Param_Multilanguage!A:C, MATCH(LanguageChosen,Language[Language],0)+1, FALSE)","v":"Activities of extra-territorial organisations and bodies"},{"$f":"VLOOKUP(H720,LanguageData,MATCH(LanguageChosen,Language[Language],0),FALSE) & \" - \" & B720","v":"Electricity - GWH"},2023]
["NATGAS","TJ_GCV",null,"U",null,null,null,"Natural Gas",{"$f":"VLOOKUP(D721, Param_Multilanguage!A:C, MATCH(LanguageChosen,Language[Language],0)+1, FALSE)","v":"Activities of extra-territorial organisations and bodies"},{"$f":"VLOOKUP(H721,LanguageData,MATCH(LanguageChosen,Language[Language],0),FALSE) & \" - \" & B721","v":"Natural Gas - TJ_GCV"},2023]
["HEAT","TJ_NCV",null,"U",null,null,null,"Derived Heat",{"$f":"VLOOKUP(D722, Param_Multilanguage!A:C, MATCH(LanguageChosen,Language[Language],0)+1, FALSE)","v":"Activities of extra-territorial organisations and bodies"},{"$f":"VLOOKUP(H722,LanguageData,MATCH(LanguageChosen,Language[Language],0),FALSE) & \" - \" & B722","v":"Derived Heat - TJ_NCV"},2023]
["TOTALOIL","KT",null,"U",null,null,null,"Oil and Petroleum Products",{"$f":"VLOOKUP(D723, Param_Multilanguage!A:C, MATCH(LanguageChosen,Language[Language],0)+1, FALSE)","v":"Activities of extra-territorial organisations and bodies"},{"$f":"VLOOKUP(H723,LanguageData,MATCH(LanguageChosen,Language[Language],0),FALSE) & \" - \" & B723","v":"Oil and Petroleum Products - KT"},2023]
["REN","TJ_NCV",null,"U",null,null,null,"Renewable Energies",{"$f":"VLOOKUP(D724, Param_Multilanguage!A:C, MATCH(LanguageChosen,Language[Language],0)+1, FALSE)","v":"Activities of extra-territorial organisations and bodies"},{"$f":"VLOOKUP(H724,LanguageData,MATCH(LanguageChosen,Language[Language],0),FALSE) & \" - \" & B724","v":"Renewable Energies - TJ_NCV"},2023]
["COAL","KT",null,"U",null,null,null,"Solid Fossil Fuels",{"$f":"VLOOKUP(D725, Param_Multilanguage!A:C, MATCH(LanguageChosen,Language[Language],0)+1, FALSE)","v":"Activities of extra-territorial organisations and bodies"},{"$f":"VLOOKUP(H725,LanguageData,MATCH(LanguageChosen,Language[Language],0),FALSE) & \" - \" & B725","v":"Solid Fossil Fuels - KT"},2023]
["NONREN","TJ_NCV",null,"U",null,null,null,"Non Renewable Waste",{"$f":"VLOOKUP(D726, Param_Multilanguage!A:C, MATCH(LanguageChosen,Language[Language],0)+1, FALSE)","v":"Activities of extra-territorial organisations and bodies"},{"$f":"VLOOKUP(H726,LanguageData,MATCH(LanguageChosen,Language[Language],0),FALSE) & \" - \" & B726","v":"Non Renewable Waste - TJ_NCV"},2023]
["HYDROGEN","TJ_NCV",null,"U",null,null,null,"Hydrogen",{"$f":"VLOOKUP(D727, Param_Multilanguage!A:C, MATCH(LanguageChosen,Language[Language],0)+1, FALSE)","v":"Activities of extra-territorial organisations and bodies"},{"$f":"VLOOKUP(H727,LanguageData,MATCH(LanguageChosen,Language[Language],0),FALSE) & \" - \" & B727","v":"Hydrogen - TJ_NCV"},2023]
["ELECTR","GWH",null,"DATAC",null,null,null,"Electricity",{"$f":"VLOOKUP(D728, Param_Multilanguage!A:C, MATCH(LanguageChosen,Language[Language],0)+1, FALSE)","v":"Data centres"},{"$f":"VLOOKUP(H728,LanguageData,MATCH(LanguageChosen,Language[Language],0),FALSE) & \" - \" & B728","v":"Electricity - GWH"},2023]
["NATGAS","TJ_GCV",null,"DATAC",null,null,null,"Natural Gas",{"$f":"VLOOKUP(D729, Param_Multilanguage!A:C, MATCH(LanguageChosen,Language[Language],0)+1, FALSE)","v":"Data centres"},{"$f":"VLOOKUP(H729,LanguageData,MATCH(LanguageChosen,Language[Language],0),FALSE) & \" - \" & B729","v":"Natural Gas - TJ_GCV"},2023]
["HEAT","TJ_NCV",null,"DATAC",null,null,null,"Derived Heat",{"$f":"VLOOKUP(D730, Param_Multilanguage!A:C, MATCH(LanguageChosen,Language[Language],0)+1, FALSE)","v":"Data centres"},{"$f":"VLOOKUP(H730,LanguageData,MATCH(LanguageChosen,Language[Language],0),FALSE) & \" - \" & B730","v":"Derived Heat - TJ_NCV"},2023]
["TOTALOIL","KT",null,"DATAC",null,null,null,"Oil and Petroleum Products",{"$f":"VLOOKUP(D731, Param_Multilanguage!A:C, MATCH(LanguageChosen,Language[Language],0)+1, FALSE)","v":"Data centres"},{"$f":"VLOOKUP(H731,LanguageData,MATCH(LanguageChosen,Language[Language],0),FALSE) & \" - \" & B731","v":"Oil and Petroleum Products - KT"},2023]
["REN","TJ_NCV",null,"DATAC",null,null,null,"Renewable Energies",{"$f":"VLOOKUP(D732, Param_Multilanguage!A:C, MATCH(LanguageChosen,Language[Language],0)+1, FALSE)","v":"Data centres"},{"$f":"VLOOKUP(H732,LanguageData,MATCH(LanguageChosen,Language[Language],0),FALSE) & \" - \" & B732","v":"Renewable Energies - TJ_NCV"},2023]
["COAL","KT",null,"DATAC",null,null,null,"Solid Fossil Fuels",{"$f":"VLOOKUP(D733, Param_Multilanguage!A:C, MATCH(LanguageChosen,Language[Language],0)+1, FALSE)","v":"Data centres"},{"$f":"VLOOKUP(H733,LanguageData,MATCH(LanguageChosen,Language[Language],0),FALSE) & \" - \" & B733","v":"Solid Fossil Fuels - KT"},2023]
["NONREN","TJ_NCV",null,"DATAC",null,null,null,"Non Renewable Waste",{"$f":"VLOOKUP(D734, Param_Multilanguage!A:C, MATCH(LanguageChosen,Language[Language],0)+1, FALSE)","v":"Data centres"},{"$f":"VLOOKUP(H734,LanguageData,MATCH(LanguageChosen,Language[Language],0),FALSE) & \" - \" & B734","v":"Non Renewable Waste - TJ_NCV"},2023]
["HYDROGEN","TJ_NCV",null,"DATAC",null,null,null,"Hydrogen",{"$f":"VLOOKUP(D735, Param_Multilanguage!A:C, MATCH(LanguageChosen,Language[Language],0)+1, FALSE)","v":"Data centres"},{"$f":"VLOOKUP(H735,LanguageData,MATCH(LanguageChosen,Language[Language],0),FALSE) & \" - \" & B735","v":"Hydrogen - TJ_NCV"},2023]
["ELECTR","GWH",null,"TOTSER",null,null,null,"Electricity",{"$f":"VLOOKUP(D736, Param_Multilanguage!A:C, MATCH(LanguageChosen,Language[Language],0)+1, FALSE)","v":"Services total"},{"$f":"VLOOKUP(H736,LanguageData,MATCH(LanguageChosen,Language[Language],0),FALSE) & \" - \" & B736","v":"Electricity - GWH"},2023]
["NATGAS","TJ_GCV",null,"TOTSER",null,null,null,"Natural Gas",{"$f":"VLOOKUP(D737, Param_Multilanguage!A:C, MATCH(LanguageChosen,Language[Language],0)+1, FALSE)","v":"Services total"},{"$f":"VLOOKUP(H737,LanguageData,MATCH(LanguageChosen,Language[Language],0),FALSE) & \" - \" & B737","v":"Natural Gas - TJ_GCV"},2023]
["HEAT","TJ_NCV",null,"TOTSER",null,null,null,"Derived Heat",{"$f":"VLOOKUP(D738, Param_Multilanguage!A:C, MATCH(LanguageChosen,Language[Language],0)+1, FALSE)","v":"Services total"},{"$f":"VLOOKUP(H738,LanguageData,MATCH(LanguageChosen,Language[Language],0),FALSE) & \" - \" & B738","v":"Derived Heat - TJ_NCV"},2023]
["TOTALOIL","KT",null,"TOTSER",null,null,null,"Oil and Petroleum Products",{"$f":"VLOOKUP(D739, Param_Multilanguage!A:C, MATCH(LanguageChosen,Language[Language],0)+1, FALSE)","v":"Services total"},{"$f":"VLOOKUP(H739,LanguageData,MATCH(LanguageChosen,Language[Language],0),FALSE) & \" - \" & B739","v":"Oil and Petroleum Products - KT"},2023]
["REN","TJ_NCV",null,"TOTSER",null,null,null,"Renewable Energies",{"$f":"VLOOKUP(D740, Param_Multilanguage!A:C, MATCH(LanguageChosen,Language[Language],0)+1, FALSE)","v":"Services total"},{"$f":"VLOOKUP(H740,LanguageData,MATCH(LanguageChosen,Language[Language],0),FALSE) & \" - \" & B740","v":"Renewable Energies - TJ_NCV"},2023]
["COAL","KT",null,"TOTSER",null,null,null,"Solid Fossil Fuels",{"$f":"VLOOKUP(D741, Param_Multilanguage!A:C, MATCH(LanguageChosen,Language[Language],0)+1, FALSE)","v":"Services total"},{"$f":"VLOOKUP(H741,LanguageData,MATCH(LanguageChosen,Language[Language],0),FALSE) & \" - \" & B741","v":"Solid Fossil Fuels - KT"},2023]
["NONREN","TJ_NCV",null,"TOTSER",null,null,null,"Non Renewable Waste",{"$f":"VLOOKUP(D742, Param_Multilanguage!A:C, MATCH(LanguageChosen,Language[Language],0)+1, FALSE)","v":"Services total"},{"$f":"VLOOKUP(H742,LanguageData,MATCH(LanguageChosen,Language[Language],0),FALSE) & \" - \" & B742","v":"Non Renewable Waste - TJ_NCV"},2023]
["HYDROGEN","TJ_NCV",null,"TOTSER",null,null,null,"Hydrogen",{"$f":"VLOOKUP(D743, Param_Multilanguage!A:C, MATCH(LanguageChosen,Language[Language],0)+1, FALSE)","v":"Services total"},{"$f":"VLOOKUP(H743,LanguageData,MATCH(LanguageChosen,Language[Language],0),FALSE) & \" - \" & B743","v":"Hydrogen - TJ_NCV"},2023]
["ELECTR","GWH",null,"C33",null,null,null,"Electricity",{"$f":"VLOOKUP(D744, Param_Multilanguage!A:C, MATCH(LanguageChosen,Language[Language],0)+1, FALSE)","v":"Repair and installation of machinery and equipment"},{"$f":"VLOOKUP(H744,LanguageData,MATCH(LanguageChosen,Language[Language],0),FALSE) & \" - \" & B744","v":"Electricity - GWH"},2024]
["NATGAS","TJ_GCV",null,"C33",null,null,null,"Natural Gas",{"$f":"VLOOKUP(D745, Param_Multilanguage!A:C, MATCH(LanguageChosen,Language[Language],0)+1, FALSE)","v":"Repair and installation of machinery and equipment"},{"$f":"VLOOKUP(H745,LanguageData,MATCH(LanguageChosen,Language[Language],0),FALSE) & \" - \" & B745","v":"Natural Gas - TJ_GCV"},2024]
["HEAT","TJ_NCV",null,"C33",null,null,null,"Derived Heat",{"$f":"VLOOKUP(D746, Param_Multilanguage!A:C, MATCH(LanguageChosen,Language[Language],0)+1, FALSE)","v":"Repair and installation of machinery and equipment"},{"$f":"VLOOKUP(H746,LanguageData,MATCH(LanguageChosen,Language[Language],0),FALSE) & \" - \" & B746","v":"Derived Heat - TJ_NCV"},2024]
["TOTALOIL","KT",null,"C33",null,null,null,"Oil and Petroleum Products",{"$f":"VLOOKUP(D747, Param_Multilanguage!A:C, MATCH(LanguageChosen,Language[Language],0)+1, FALSE)","v":"Repair and installation of machinery and equipment"},{"$f":"VLOOKUP(H747,LanguageData,MATCH(LanguageChosen,Language[Language],0),FALSE) & \" - \" & B747","v":"Oil and Petroleum Products - KT"},2024]
["REN","TJ_NCV",null,"C33",null,null,null,"Renewable Energies",{"$f":"VLOOKUP(D748, Param_Multilanguage!A:C, MATCH(LanguageChosen,Language[Language],0)+1, FALSE)","v":"Repair and installation of machinery and equipment"},{"$f":"VLOOKUP(H748,LanguageData,MATCH(LanguageChosen,Language[Language],0),FALSE) & \" - \" & B748","v":"Renewable Energies - TJ_NCV"},2024]
["COAL","KT",null,"C33",null,null,null,"Solid Fossil Fuels",{"$f":"VLOOKUP(D749, Param_Multilanguage!A:C, MATCH(LanguageChosen,Language[Language],0)+1, FALSE)","v":"Repair and installation of machinery and equipment"},{"$f":"VLOOKUP(H749,LanguageData,MATCH(LanguageChosen,Language[Language],0),FALSE) & \" - \" & B749","v":"Solid Fossil Fuels - KT"},2024]
["NONREN","TJ_NCV",null,"C33",null,null,null,"Non Renewable Waste",{"$f":"VLOOKUP(D750, Param_Multilanguage!A:C, MATCH(LanguageChosen,Language[Language],0)+1, FALSE)","v":"Repair and installation of machinery and equipment"},{"$f":"VLOOKUP(H750,LanguageData,MATCH(LanguageChosen,Language[Language],0),FALSE) & \" - \" & B750","v":"Non Renewable Waste - TJ_NCV"},2024]
["HYDROGEN","TJ_NCV",null,"C33",null,null,null,"Hydrogen",{"$f":"VLOOKUP(D751, Param_Multilanguage!A:C, MATCH(LanguageChosen,Language[Language],0)+1, FALSE)","v":"Repair and installation of machinery and equipment"},{"$f":"VLOOKUP(H751,LanguageData,MATCH(LanguageChosen,Language[Language],0),FALSE) & \" - \" & B751","v":"Hydrogen - TJ_NCV"},2024]
["ELECTR","GWH",null,"E",null,null,null,"Electricity",{"$f":"VLOOKUP(D752, Param_Multilanguage!A:C, MATCH(LanguageChosen,Language[Language],0)+1, FALSE)","v":"Water supply; sewerage, waste management and remediation activities"},{"$f":"VLOOKUP(H752,LanguageData,MATCH(LanguageChosen,Language[Language],0),FALSE) & \" - \" & B752","v":"Electricity - GWH"},2024]
["NATGAS","TJ_GCV",null,"E",null,null,null,"Natural Gas",{"$f":"VLOOKUP(D753, Param_Multilanguage!A:C, MATCH(LanguageChosen,Language[Language],0)+1, FALSE)","v":"Water supply; sewerage, waste management and remediation activities"},{"$f":"VLOOKUP(H753,LanguageData,MATCH(LanguageChosen,Language[Language],0),FALSE) & \" - \" & B753","v":"Natural Gas - TJ_GCV"},2024]
["HEAT","TJ_NCV",null,"E",null,null,null,"Derived Heat",{"$f":"VLOOKUP(D754, Param_Multilanguage!A:C, MATCH(LanguageChosen,Language[Language],0)+1, FALSE)","v":"Water supply; sewerage, waste management and remediation activities"},{"$f":"VLOOKUP(H754,LanguageData,MATCH(LanguageChosen,Language[Language],0),FALSE) & \" - \" & B754","v":"Derived Heat - TJ_NCV"},2024]
["TOTALOIL","KT",null,"E",null,null,null,"Oil and Petroleum Products",{"$f":"VLOOKUP(D755, Param_Multilanguage!A:C, MATCH(LanguageChosen,Language[Language],0)+1, FALSE)","v":"Water supply; sewerage, waste management and remediation activities"},{"$f":"VLOOKUP(H755,LanguageData,MATCH(LanguageChosen,Language[Language],0),FALSE) & \" - \" & B755","v":"Oil and Petroleum Products - KT"},2024]
["REN","TJ_NCV",null,"E",null,null,null,"Renewable Energies",{"$f":"VLOOKUP(D756, Param_Multilanguage!A:C, MATCH(LanguageChosen,Language[Language],0)+1, FALSE)","v":"Water supply; sewerage, waste management and remediation activities"},{"$f":"VLOOKUP(H756,LanguageData,MATCH(LanguageChosen,Language[Language],0),FALSE) & \" - \" & B756","v":"Renewable Energies - TJ_NCV"},2024]
["COAL","KT",null,"E",null,null,null,"Solid Fossil Fuels",{"$f":"VLOOKUP(D757, Param_Multilanguage!A:C, MATCH(LanguageChosen,Language[Language],0)+1, FALSE)","v":"Water supply; sewerage, waste management and remediation activities"},{"$f":"VLOOKUP(H757,LanguageData,MATCH(LanguageChosen,Language[Language],0),FALSE) & \" - \" & B757","v":"Solid Fossil Fuels - KT"},2024]
["NONREN","TJ_NCV",null,"E",null,null,null,"Non Renewable Waste",{"$f":"VLOOKUP(D758, Param_Multilanguage!A:C, MATCH(LanguageChosen,Language[Language],0)+1, FALSE)","v":"Water supply; sewerage, waste management and remediation activities"},{"$f":"VLOOKUP(H758,LanguageData,MATCH(LanguageChosen,Language[Language],0),FALSE) & \" - \" & B758","v":"Non Renewable Waste - TJ_NCV"},2024]
["HYDROGEN","TJ_NCV",null,"E",null,null,null,"Hydrogen",{"$f":"VLOOKUP(D759, Param_Multilanguage!A:C, MATCH(LanguageChosen,Language[Language],0)+1, FALSE)","v":"Water supply; sewerage, waste management and remediation activities"},{"$f":"VLOOKUP(H759,LanguageData,MATCH(LanguageChosen,Language[Language],0),FALSE) & \" - \" & B759","v":"Hydrogen - TJ_NCV"},2024]
["ELECTR","GWH",null,"G",null,null,null,"Electricity",{"$f":"VLOOKUP(D760, Param_Multilanguage!A:C, MATCH(LanguageChosen,Language[Language],0)+1, FALSE)","v":"Wholesale and retail trade; repair of motor vehicles and motorcycles"},{"$f":"VLOOKUP(H760,LanguageData,MATCH(LanguageChosen,Language[Language],0),FALSE) & \" - \" & B760","v":"Electricity - GWH"},2024]
["NATGAS","TJ_GCV",null,"G",null,null,null,"Natural Gas",{"$f":"VLOOKUP(D761, Param_Multilanguage!A:C, MATCH(LanguageChosen,Language[Language],0)+1, FALSE)","v":"Wholesale and retail trade; repair of motor vehicles and motorcycles"},{"$f":"VLOOKUP(H761,LanguageData,MATCH(LanguageChosen,Language[Language],0),FALSE) & \" - \" & B761","v":"Natural Gas - TJ_GCV"},2024]
["HEAT","TJ_NCV",null,"G",null,null,null,"Derived Heat",{"$f":"VLOOKUP(D762, Param_Multilanguage!A:C, MATCH(LanguageChosen,Language[Language],0)+1, FALSE)","v":"Wholesale and retail trade; repair of motor vehicles and motorcycles"},{"$f":"VLOOKUP(H762,LanguageData,MATCH(LanguageChosen,Language[Language],0),FALSE) & \" - \" & B762","v":"Derived Heat - TJ_NCV"},2024]
["TOTALOIL","KT",null,"G",null,null,null,"Oil and Petroleum Products",{"$f":"VLOOKUP(D763, Param_Multilanguage!A:C, MATCH(LanguageChosen,Language[Language],0)+1, FALSE)","v":"Wholesale and retail trade; repair of motor vehicles and motorcycles"},{"$f":"VLOOKUP(H763,LanguageData,MATCH(LanguageChosen,Language[Language],0),FALSE) & \" - \" & B763","v":"Oil and Petroleum Products - KT"},2024]
["REN","TJ_NCV",null,"G",null,null,null,"Renewable Energies",{"$f":"VLOOKUP(D764, Param_Multilanguage!A:C, MATCH(LanguageChosen,Language[Language],0)+1, FALSE)","v":"Wholesale and retail trade; repair of motor vehicles and motorcycles"},{"$f":"VLOOKUP(H764,LanguageData,MATCH(LanguageChosen,Language[Language],0),FALSE) & \" - \" & B764","v":"Renewable Energies - TJ_NCV"},2024]
["COAL","KT",null,"G",null,null,null,"Solid Fossil Fuels",{"$f":"VLOOKUP(D765, Param_Multilanguage!A:C, MATCH(LanguageChosen,Language[Language],0)+1, FALSE)","v":"Wholesale and retail trade; repair of motor vehicles and motorcycles"},{"$f":"VLOOKUP(H765,LanguageData,MATCH(LanguageChosen,Language[Language],0),FALSE) & \" - \" & B765","v":"Solid Fossil Fuels - KT"},2024]
["NONREN","TJ_NCV",null,"G",null,null,null,"Non Renewable Waste",{"$f":"VLOOKUP(D766, Param_Multilanguage!A:C, MATCH(LanguageChosen,Language[Language],0)+1, FALSE)","v":"Wholesale and retail trade; repair of motor vehicles and motorcycles"},{"$f":"VLOOKUP(H766,LanguageData,MATCH(LanguageChosen,Language[Language],0),FALSE) & \" - \" & B766","v":"Non Renewable Waste - TJ_NCV"},2024]
["HYDROGEN","TJ_NCV",null,"G",null,null,null,"Hydrogen",{"$f":"VLOOKUP(D767, Param_Multilanguage!A:C, MATCH(LanguageChosen,Language[Language],0)+1, FALSE)","v":"Wholesale and retail trade; repair of motor vehicles and motorcycles"},{"$f":"VLOOKUP(H767,LanguageData,MATCH(LanguageChosen,Language[Language],0),FALSE) & \" - \" & B767","v":"Hydrogen - TJ_NCV"},2024]
["ELECTR","GWH",null,"G46",null,null,null,"Electricity",{"$f":"VLOOKUP(D768, Param_Multilanguage!A:C, MATCH(LanguageChosen,Language[Language],0)+1, FALSE)","v":"Wholesale trade, except of motor vehicles and motorcycles"},{"$f":"VLOOKUP(H768,LanguageData,MATCH(LanguageChosen,Language[Language],0),FALSE) & \" - \" & B768","v":"Electricity - GWH"},2024]
["NATGAS","TJ_GCV",null,"G46",null,null,null,"Natural Gas",{"$f":"VLOOKUP(D769, Param_Multilanguage!A:C, MATCH(LanguageChosen,Language[Language],0)+1, FALSE)","v":"Wholesale trade, except of motor vehicles and motorcycles"},{"$f":"VLOOKUP(H769,LanguageData,MATCH(LanguageChosen,Language[Language],0),FALSE) & \" - \" & B769","v":"Natural Gas - TJ_GCV"},2024]
["HEAT","TJ_NCV",null,"G46",null,null,null,"Derived Heat",{"$f":"VLOOKUP(D770, Param_Multilanguage!A:C, MATCH(LanguageChosen,Language[Language],0)+1, FALSE)","v":"Wholesale trade, except of motor vehicles and motorcycles"},{"$f":"VLOOKUP(H770,LanguageData,MATCH(LanguageChosen,Language[Language],0),FALSE) & \" - \" & B770","v":"Derived Heat - TJ_NCV"},2024]
["TOTALOIL","KT",null,"G46",null,null,null,"Oil and Petroleum Products",{"$f":"VLOOKUP(D771, Param_Multilanguage!A:C, MATCH(LanguageChosen,Language[Language],0)+1, FALSE)","v":"Wholesale trade, except of motor vehicles and motorcycles"},{"$f":"VLOOKUP(H771,LanguageData,MATCH(LanguageChosen,Language[Language],0),FALSE) & \" - \" & B771","v":"Oil and Petroleum Products - KT"},2024]
["REN","TJ_NCV",null,"G46",null,null,null,"Renewable Energies",{"$f":"VLOOKUP(D772, Param_Multilanguage!A:C, MATCH(LanguageChosen,Language[Language],0)+1, FALSE)","v":"Wholesale trade, except of motor vehicles and motorcycles"},{"$f":"VLOOKUP(H772,LanguageData,MATCH(LanguageChosen,Language[Language],0),FALSE) & \" - \" & B772","v":"Renewable Energies - TJ_NCV"},2024]
["COAL","KT",null,"G46",null,null,null,"Solid Fossil Fuels",{"$f":"VLOOKUP(D773, Param_Multilanguage!A:C, MATCH(LanguageChosen,Language[Language],0)+1, FALSE)","v":"Wholesale trade, except of motor vehicles and motorcycles"},{"$f":"VLOOKUP(H773,LanguageData,MATCH(LanguageChosen,Language[Language],0),FALSE) & \" - \" & B773","v":"Solid Fossil Fuels - KT"},2024]
["NONREN","TJ_NCV",null,"G46",null,null,null,"Non Renewable Waste",{"$f":"VLOOKUP(D774, Param_Multilanguage!A:C, MATCH(LanguageChosen,Language[Language],0)+1, FALSE)","v":"Wholesale trade, except of motor vehicles and motorcycles"},{"$f":"VLOOKUP(H774,LanguageData,MATCH(LanguageChosen,Language[Language],0),FALSE) & \" - \" & B774","v":"Non Renewable Waste - TJ_NCV"},2024]
["HYDROGEN","TJ_NCV",null,"G46",null,null,null,"Hydrogen",{"$f":"VLOOKUP(D775, Param_Multilanguage!A:C, MATCH(LanguageChosen,Language[Language],0)+1, FALSE)","v":"Wholesale trade, except of motor vehicles and motorcycles"},{"$f":"VLOOKUP(H775,LanguageData,MATCH(LanguageChosen,Language[Language],0),FALSE) & \" - \" & B775","v":"Hydrogen - TJ_NCV"},2024]
["ELECTR","GWH",null,"G47",null,null,null,"Electricity",{"$f":"VLOOKUP(D776, Param_Multilanguage!A:C, MATCH(LanguageChosen,Language[Language],0)+1, FALSE)","v":"Retail trade, except of motor vehicles and motorcycles"},{"$f":"VLOOKUP(H776,LanguageData,MATCH(LanguageChosen,Language[Language],0),FALSE) & \" - \" & B776","v":"Electricity - GWH"},2024]
["NATGAS","TJ_GCV",null,"G47",null,null,null,"Natural Gas",{"$f":"VLOOKUP(D777, Param_Multilanguage!A:C, MATCH(LanguageChosen,Language[Language],0)+1, FALSE)","v":"Retail trade, except of motor vehicles and motorcycles"},{"$f":"VLOOKUP(H777,LanguageData,MATCH(LanguageChosen,Language[Language],0),FALSE) & \" - \" & B777","v":"Natural Gas - TJ_GCV"},2024]
["HEAT","TJ_NCV",null,"G47",null,null,null,"Derived Heat",{"$f":"VLOOKUP(D778, Param_Multilanguage!A:C, MATCH(LanguageChosen,Language[Language],0)+1, FALSE)","v":"Retail trade, except of motor vehicles and motorcycles"},{"$f":"VLOOKUP(H778,LanguageData,MATCH(LanguageChosen,Language[Language],0),FALSE) & \" - \" & B778","v":"Derived Heat - TJ_NCV"},2024]
["TOTALOIL","KT",null,"G47",null,null,null,"Oil and Petroleum Products",{"$f":"VLOOKUP(D779, Param_Multilanguage!A:C, MATCH(LanguageChosen,Language[Language],0)+1, FALSE)","v":"Retail trade, except of motor vehicles and motorcycles"},{"$f":"VLOOKUP(H779,LanguageData,MATCH(LanguageChosen,Language[Language],0),FALSE) & \" - \" & B779","v":"Oil and Petroleum Products - KT"},2024]
["REN","TJ_NCV",null,"G47",null,null,null,"Renewable Energies",{"$f":"VLOOKUP(D780, Param_Multilanguage!A:C, MATCH(LanguageChosen,Language[Language],0)+1, FALSE)","v":"Retail trade, except of motor vehicles and motorcycles"},{"$f":"VLOOKUP(H780,LanguageData,MATCH(LanguageChosen,Language[Language],0),FALSE) & \" - \" & B780","v":"Renewable Energies - TJ_NCV"},2024]
["COAL","KT",null,"G47",null,null,null,"Solid Fossil Fuels",{"$f":"VLOOKUP(D781, Param_Multilanguage!A:C, MATCH(LanguageChosen,Language[Language],0)+1, FALSE)","v":"Retail trade, except of motor vehicles and motorcycles"},{"$f":"VLOOKUP(H781,LanguageData,MATCH(LanguageChosen,Language[Language],0),FALSE) & \" - \" & B781","v":"Solid Fossil Fuels - KT"},2024]
["NONREN","TJ_NCV",null,"G47",null,null,null,"Non Renewable Waste",{"$f":"VLOOKUP(D782, Param_Multilanguage!A:C, MATCH(LanguageChosen,Language[Language],0)+1, FALSE)","v":"Retail trade, except of motor vehicles and motorcycles"},{"$f":"VLOOKUP(H782,LanguageData,MATCH(LanguageChosen,Language[Language],0),FALSE) & \" - \" & B782","v":"Non Renewable Waste - TJ_NCV"},2024]
["HYDROGEN","TJ_NCV",null,"G47",null,null,null,"Hydrogen",{"$f":"VLOOKUP(D783, Param_Multilanguage!A:C, MATCH(LanguageChosen,Language[Language],0)+1, FALSE)","v":"Retail trade, except of motor vehicles and motorcycles"},{"$f":"VLOOKUP(H783,LanguageData,MATCH(LanguageChosen,Language[Language],0),FALSE) & \" - \" & B783","v":"Hydrogen - TJ_NCV"},2024]
["ELECTR","GWH",null,"H52",null,null,null,"Electricity",{"$f":"VLOOKUP(D784, Param_Multilanguage!A:C, MATCH(LanguageChosen,Language[Language],0)+1, FALSE)","v":"Warehousing and support activities for transportation"},{"$f":"VLOOKUP(H784,LanguageData,MATCH(LanguageChosen,Language[Language],0),FALSE) & \" - \" & B784","v":"Electricity - GWH"},2024]
["NATGAS","TJ_GCV",null,"H52",null,null,null,"Natural Gas",{"$f":"VLOOKUP(D785, Param_Multilanguage!A:C, MATCH(LanguageChosen,Language[Language],0)+1, FALSE)","v":"Warehousing and support activities for transportation"},{"$f":"VLOOKUP(H785,LanguageData,MATCH(LanguageChosen,Language[Language],0),FALSE) & \" - \" & B785","v":"Natural Gas - TJ_GCV"},2024]
["HEAT","TJ_NCV",null,"H52",null,null,null,"Derived Heat",{"$f":"VLOOKUP(D786, Param_Multilanguage!A:C, MATCH(LanguageChosen,Language[Language],0)+1, FALSE)","v":"Warehousing and support activities for transportation"},{"$f":"VLOOKUP(H786,LanguageData,MATCH(LanguageChosen,Language[Language],0),FALSE) & \" - \" & B786","v":"Derived Heat - TJ_NCV"},2024]
["TOTALOIL","KT",null,"H52",null,null,null,"Oil and Petroleum Products",{"$f":"VLOOKUP(D787, Param_Multilanguage!A:C, MATCH(LanguageChosen,Language[Language],0)+1, FALSE)","v":"Warehousing and support activities for transportation"},{"$f":"VLOOKUP(H787,LanguageData,MATCH(LanguageChosen,Language[Language],0),FALSE) & \" - \" & B787","v":"Oil and Petroleum Products - KT"},2024]
["REN","TJ_NCV",null,"H52",null,null,null,"Renewable Energies",{"$f":"VLOOKUP(D788, Param_Multilanguage!A:C, MATCH(LanguageChosen,Language[Language],0)+1, FALSE)","v":"Warehousing and support activities for transportation"},{"$f":"VLOOKUP(H788,LanguageData,MATCH(LanguageChosen,Language[Language],0),FALSE) & \" - \" & B788","v":"Renewable Energies - TJ_NCV"},2024]
["COAL","KT",null,"H52",null,null,null,"Solid Fossil Fuels",{"$f":"VLOOKUP(D789, Param_Multilanguage!A:C, MATCH(LanguageChosen,Language[Language],0)+1, FALSE)","v":"Warehousing and support activities for transportation"},{"$f":"VLOOKUP(H789,LanguageData,MATCH(LanguageChosen,Language[Language],0),FALSE) & \" - \" & B789","v":"Solid Fossil Fuels - KT"},2024]
["NONREN","TJ_NCV",null,"H52",null,null,null,"Non Renewable Waste",{"$f":"VLOOKUP(D790, Param_Multilanguage!A:C, MATCH(LanguageChosen,Language[Language],0)+1, FALSE)","v":"Warehousing and support activities for transportation"},{"$f":"VLOOKUP(H790,LanguageData,MATCH(LanguageChosen,Language[Language],0),FALSE) & \" - \" & B790","v":"Non Renewable Waste - TJ_NCV"},2024]
["HYDROGEN","TJ_NCV",null,"H52",null,null,null,"Hydrogen",{"$f":"VLOOKUP(D791, Param_Multilanguage!A:C, MATCH(LanguageChosen,Language[Language],0)+1, FALSE)","v":"Warehousing and support activities for transportation"},{"$f":"VLOOKUP(H791,LanguageData,MATCH(LanguageChosen,Language[Language],0),FALSE) & \" - \" & B791","v":"Hydrogen - TJ_NCV"},2024]
["ELECTR","GWH",null,"H53",null,null,null,"Electricity",{"$f":"VLOOKUP(D792, Param_Multilanguage!A:C, MATCH(LanguageChosen,Language[Language],0)+1, FALSE)","v":"Postal and courier activities"},{"$f":"VLOOKUP(H792,LanguageData,MATCH(LanguageChosen,Language[Language],0),FALSE) & \" - \" & B792","v":"Electricity - GWH"},2024]
["NATGAS","TJ_GCV",null,"H53",null,null,null,"Natural Gas",{"$f":"VLOOKUP(D793, Param_Multilanguage!A:C, MATCH(LanguageChosen,Language[Language],0)+1, FALSE)","v":"Postal and courier activities"},{"$f":"VLOOKUP(H793,LanguageData,MATCH(LanguageChosen,Language[Language],0),FALSE) & \" - \" & B793","v":"Natural Gas - TJ_GCV"},2024]
["HEAT","TJ_NCV",null,"H53",null,null,null,"Derived Heat",{"$f":"VLOOKUP(D794, Param_Multilanguage!A:C, MATCH(LanguageChosen,Language[Language],0)+1, FALSE)","v":"Postal and courier activities"},{"$f":"VLOOKUP(H794,LanguageData,MATCH(LanguageChosen,Language[Language],0),FALSE) & \" - \" & B794","v":"Derived Heat - TJ_NCV"},2024]
["TOTALOIL","KT",null,"H53",null,null,null,"Oil and Petroleum Products",{"$f":"VLOOKUP(D795, Param_Multilanguage!A:C, MATCH(LanguageChosen,Language[Language],0)+1, FALSE)","v":"Postal and courier activities"},{"$f":"VLOOKUP(H795,LanguageData,MATCH(LanguageChosen,Language[Language],0),FALSE) & \" - \" & B795","v":"Oil and Petroleum Products - KT"},2024]
["REN","TJ_NCV",null,"H53",null,null,null,"Renewable Energies",{"$f":"VLOOKUP(D796, Param_Multilanguage!A:C, MATCH(LanguageChosen,Language[Language],0)+1, FALSE)","v":"Postal and courier activities"},{"$f":"VLOOKUP(H796,LanguageData,MATCH(LanguageChosen,Language[Language],0),FALSE) & \" - \" & B796","v":"Renewable Energies - TJ_NCV"},2024]
["COAL","KT",null,"H53",null,null,null,"Solid Fossil Fuels",{"$f":"VLOOKUP(D797, Param_Multilanguage!A:C, MATCH(LanguageChosen,Language[Language],0)+1, FALSE)","v":"Postal and courier activities"},{"$f":"VLOOKUP(H797,LanguageData,MATCH(LanguageChosen,Language[Language],0),FALSE) & \" - \" & B797","v":"Solid Fossil Fuels - KT"},2024]
["NONREN","TJ_NCV",null,"H53",null,null,null,"Non Renewable Waste",{"$f":"VLOOKUP(D798, Param_Multilanguage!A:C, MATCH(LanguageChosen,Language[Language],0)+1, FALSE)","v":"Postal and courier activities"},{"$f":"VLOOKUP(H798,LanguageData,MATCH(LanguageChosen,Language[Language],0),FALSE) & \" - \" & B798","v":"Non Renewable Waste - TJ_NCV"},2024]
["HYDROGEN","TJ_NCV",null,"H53",null,null,null,"Hydrogen",{"$f":"VLOOKUP(D799, Param_Multilanguage!A:C, MATCH(LanguageChosen,Language[Language],0)+1, FALSE)","v":"Postal and courier activities"},{"$f":"VLOOKUP(H799,LanguageData,MATCH(LanguageChosen,Language[Language],0),FALSE) & \" - \" & B799","v":"Hydrogen - TJ_NCV"},2024]
["ELECTR","GWH",null,"I",null,null,null,"Electricity",{"$f":"VLOOKUP(D800, Param_Multilanguage!A:C, MATCH(LanguageChosen,Language[Language],0)+1, FALSE)","v":"Accommodation and food services activities"},{"$f":"VLOOKUP(H800,LanguageData,MATCH(LanguageChosen,Language[Language],0),FALSE) & \" - \" & B800","v":"Electricity - GWH"},2024]
["NATGAS","TJ_GCV",null,"I",null,null,null,"Natural Gas",{"$f":"VLOOKUP(D801, Param_Multilanguage!A:C, MATCH(LanguageChosen,Language[Language],0)+1, FALSE)","v":"Accommodation and food services activities"},{"$f":"VLOOKUP(H801,LanguageData,MATCH(LanguageChosen,Language[Language],0),FALSE) & \" - \" & B801","v":"Natural Gas - TJ_GCV"},2024]
["HEAT","TJ_NCV",null,"I",null,null,null,"Derived Heat",{"$f":"VLOOKUP(D802, Param_Multilanguage!A:C, MATCH(LanguageChosen,Language[Language],0)+1, FALSE)","v":"Accommodation and food services activities"},{"$f":"VLOOKUP(H802,LanguageData,MATCH(LanguageChosen,Language[Language],0),FALSE) & \" - \" & B802","v":"Derived Heat - TJ_NCV"},2024]
["TOTALOIL","KT",null,"I",null,null,null,"Oil and Petroleum Products",{"$f":"VLOOKUP(D803, Param_Multilanguage!A:C, MATCH(LanguageChosen,Language[Language],0)+1, FALSE)","v":"Accommodation and food services activities"},{"$f":"VLOOKUP(H803,LanguageData,MATCH(LanguageChosen,Language[Language],0),FALSE) & \" - \" & B803","v":"Oil and Petroleum Products - KT"},2024]
["REN","TJ_NCV",null,"I",null,null,null,"Renewable Energies",{"$f":"VLOOKUP(D804, Param_Multilanguage!A:C, MATCH(LanguageChosen,Language[Language],0)+1, FALSE)","v":"Accommodation and food services activities"},{"$f":"VLOOKUP(H804,LanguageData,MATCH(LanguageChosen,Language[Language],0),FALSE) & \" - \" & B804","v":"Renewable Energies - TJ_NCV"},2024]
["COAL","KT",null,"I",null,null,null,"Solid Fossil Fuels",{"$f":"VLOOKUP(D805, Param_Multilanguage!A:C, MATCH(LanguageChosen,Language[Language],0)+1, FALSE)","v":"Accommodation and food services activities"},{"$f":"VLOOKUP(H805,LanguageData,MATCH(LanguageChosen,Language[Language],0),FALSE) & \" - \" & B805","v":"Solid Fossil Fuels - KT"},2024]
["NONREN","TJ_NCV",null,"I",null,null,null,"Non Renewable Waste",{"$f":"VLOOKUP(D806, Param_Multilanguage!A:C, MATCH(LanguageChosen,Language[Language],0)+1, FALSE)","v":"Accommodation and food services activities"},{"$f":"VLOOKUP(H806,LanguageData,MATCH(LanguageChosen,Language[Language],0),FALSE) & \" - \" & B806","v":"Non Renewable Waste - TJ_NCV"},2024]
["HYDROGEN","TJ_NCV",null,"I",null,null,null,"Hydrogen",{"$f":"VLOOKUP(D807, Param_Multilanguage!A:C, MATCH(LanguageChosen,Language[Language],0)+1, FALSE)","v":"Accommodation and food services activities"},{"$f":"VLOOKUP(H807,LanguageData,MATCH(LanguageChosen,Language[Language],0),FALSE) & \" - \" & B807","v":"Hydrogen - TJ_NCV"},2024]
["ELECTR","GWH",null,"I55",null,null,null,"Electricity",{"$f":"VLOOKUP(D808, Param_Multilanguage!A:C, MATCH(LanguageChosen,Language[Language],0)+1, FALSE)","v":"Accommodation"},{"$f":"VLOOKUP(H808,LanguageData,MATCH(LanguageChosen,Language[Language],0),FALSE) & \" - \" & B808","v":"Electricity - GWH"},2024]
["NATGAS","TJ_GCV",null,"I55",null,null,null,"Natural Gas",{"$f":"VLOOKUP(D809, Param_Multilanguage!A:C, MATCH(LanguageChosen,Language[Language],0)+1, FALSE)","v":"Accommodation"},{"$f":"VLOOKUP(H809,LanguageData,MATCH(LanguageChosen,Language[Language],0),FALSE) & \" - \" & B809","v":"Natural Gas - TJ_GCV"},2024]
["HEAT","TJ_NCV",null,"I55",null,null,null,"Derived Heat",{"$f":"VLOOKUP(D810, Param_Multilanguage!A:C, MATCH(LanguageChosen,Language[Language],0)+1, FALSE)","v":"Accommodation"},{"$f":"VLOOKUP(H810,LanguageData,MATCH(LanguageChosen,Language[Language],0),FALSE) & \" - \" & B810","v":"Derived Heat - TJ_NCV"},2024]
["TOTALOIL","KT",null,"I55",null,null,null,"Oil and Petroleum Products",{"$f":"VLOOKUP(D811, Param_Multilanguage!A:C, MATCH(LanguageChosen,Language[Language],0)+1, FALSE)","v":"Accommodation"},{"$f":"VLOOKUP(H811,LanguageData,MATCH(LanguageChosen,Language[Language],0),FALSE) & \" - \" & B811","v":"Oil and Petroleum Products - KT"},2024]
["REN","TJ_NCV",null,"I55",null,null,null,"Renewable Energies",{"$f":"VLOOKUP(D812, Param_Multilanguage!A:C, MATCH(LanguageChosen,Language[Language],0)+1, FALSE)","v":"Accommodation"},{"$f":"VLOOKUP(H812,LanguageData,MATCH(LanguageChosen,Language[Language],0),FALSE) & \" - \" & B812","v":"Renewable Energies - TJ_NCV"},2024]
["COAL","KT",null,"I55",null,null,null,"Solid Fossil Fuels",{"$f":"VLOOKUP(D813, Param_Multilanguage!A:C, MATCH(LanguageChosen,Language[Language],0)+1, FALSE)","v":"Accommodation"},{"$f":"VLOOKUP(H813,LanguageData,MATCH(LanguageChosen,Language[Language],0),FALSE) & \" - \" & B813","v":"Solid Fossil Fuels - KT"},2024]
["NONREN","TJ_NCV",null,"I55",null,null,null,"Non Renewable Waste",{"$f":"VLOOKUP(D814, Param_Multilanguage!A:C, MATCH(LanguageChosen,Language[Language],0)+1, FALSE)","v":"Accommodation"},{"$f":"VLOOKUP(H814,LanguageData,MATCH(LanguageChosen,Language[Language],0),FALSE) & \" - \" & B814","v":"Non Renewable Waste - TJ_NCV"},2024]
["HYDROGEN","TJ_NCV",null,"I55",null,null,null,"Hydrogen",{"$f":"VLOOKUP(D815, Param_Multilanguage!A:C, MATCH(LanguageChosen,Language[Language],0)+1, FALSE)","v":"Accommodation"},{"$f":"VLOOKUP(H815,LanguageData,MATCH(LanguageChosen,Language[Language],0),FALSE) & \" - \" & B815","v":"Hydrogen - TJ_NCV"},2024]
["ELECTR","GWH",null,"I56",null,null,null,"Electricity",{"$f":"VLOOKUP(D816, Param_Multilanguage!A:C, MATCH(LanguageChosen,Language[Language],0)+1, FALSE)","v":"Food and beverage services activities"},{"$f":"VLOOKUP(H816,LanguageData,MATCH(LanguageChosen,Language[Language],0),FALSE) & \" - \" & B816","v":"Electricity - GWH"},2024]
["NATGAS","TJ_GCV",null,"I56",null,null,null,"Natural Gas",{"$f":"VLOOKUP(D817, Param_Multilanguage!A:C, MATCH(LanguageChosen,Language[Language],0)+1, FALSE)","v":"Food and beverage services activities"},{"$f":"VLOOKUP(H817,LanguageData,MATCH(LanguageChosen,Language[Language],0),FALSE) & \" - \" & B817","v":"Natural Gas - TJ_GCV"},2024]
["HEAT","TJ_NCV",null,"I56",null,null,null,"Derived Heat",{"$f":"VLOOKUP(D818, Param_Multilanguage!A:C, MATCH(LanguageChosen,Language[Language],0)+1, FALSE)","v":"Food and beverage services activities"},{"$f":"VLOOKUP(H818,LanguageData,MATCH(LanguageChosen,Language[Language],0),FALSE) & \" - \" & B818","v":"Derived Heat - TJ_NCV"},2024]
["TOTALOIL","KT",null,"I56",null,null,null,"Oil and Petroleum Products",{"$f":"VLOOKUP(D819, Param_Multilanguage!A:C, MATCH(LanguageChosen,Language[Language],0)+1, FALSE)","v":"Food and beverage services activities"},{"$f":"VLOOKUP(H819,LanguageData,MATCH(LanguageChosen,Language[Language],0),FALSE) & \" - \" & B819","v":"Oil and Petroleum Products - KT"},2024]
["REN","TJ_NCV",null,"I56",null,null,null,"Renewable Energies",{"$f":"VLOOKUP(D820, Param_Multilanguage!A:C, MATCH(LanguageChosen,Language[Language],0)+1, FALSE)","v":"Food and beverage services activities"},{"$f":"VLOOKUP(H820,LanguageData,MATCH(LanguageChosen,Language[Language],0),FALSE) & \" - \" & B820","v":"Renewable Energies - TJ_NCV"},2024]
["COAL","KT",null,"I56",null,null,null,"Solid Fossil Fuels",{"$f":"VLOOKUP(D821, Param_Multilanguage!A:C, MATCH(LanguageChosen,Language[Language],0)+1, FALSE)","v":"Food and beverage services activities"},{"$f":"VLOOKUP(H821,LanguageData,MATCH(LanguageChosen,Language[Language],0),FALSE) & \" - \" & B821","v":"Solid Fossil Fuels - KT"},2024]
["NONREN","TJ_NCV",null,"I56",null,null,null,"Non Renewable Waste",{"$f":"VLOOKUP(D822, Param_Multilanguage!A:C, MATCH(LanguageChosen,Language[Language],0)+1, FALSE)","v":"Food and beverage services activities"},{"$f":"VLOOKUP(H822,LanguageData,MATCH(LanguageChosen,Language[Language],0),FALSE) & \" - \" & B822","v":"Non Renewable Waste - TJ_NCV"},2024]
["HYDROGEN","TJ_NCV",null,"I56",null,null,null,"Hydrogen",{"$f":"VLOOKUP(D823, Param_Multilanguage!A:C, MATCH(LanguageChosen,Language[Language],0)+1, FALSE)","v":"Food and beverage services activities"},{"$f":"VLOOKUP(H823,LanguageData,MATCH(LanguageChosen,Language[Language],0),FALSE) & \" - \" & B823","v":"Hydrogen - TJ_NCV"},2024]
["ELECTR","GWH",null,"J",null,null,null,"Electricity",{"$f":"VLOOKUP(D824, Param_Multilanguage!A:C, MATCH(LanguageChosen,Language[Language],0)+1, FALSE)","v":"Information and communication"},{"$f":"VLOOKUP(H824,LanguageData,MATCH(LanguageChosen,Language[Language],0),FALSE) & \" - \" & B824","v":"Electricity - GWH"},2024]
["NATGAS","TJ_GCV",null,"J",null,null,null,"Natural Gas",{"$f":"VLOOKUP(D825, Param_Multilanguage!A:C, MATCH(LanguageChosen,Language[Language],0)+1, FALSE)","v":"Information and communication"},{"$f":"VLOOKUP(H825,LanguageData,MATCH(LanguageChosen,Language[Language],0),FALSE) & \" - \" & B825","v":"Natural Gas - TJ_GCV"},2024]
["HEAT","TJ_NCV",null,"J",null,null,null,"Derived Heat",{"$f":"VLOOKUP(D826, Param_Multilanguage!A:C, MATCH(LanguageChosen,Language[Language],0)+1, FALSE)","v":"Information and communication"},{"$f":"VLOOKUP(H826,LanguageData,MATCH(LanguageChosen,Language[Language],0),FALSE) & \" - \" & B826","v":"Derived Heat - TJ_NCV"},2024]
["TOTALOIL","KT",null,"J",null,null,null,"Oil and Petroleum Products",{"$f":"VLOOKUP(D827, Param_Multilanguage!A:C, MATCH(LanguageChosen,Language[Language],0)+1, FALSE)","v":"Information and communication"},{"$f":"VLOOKUP(H827,LanguageData,MATCH(LanguageChosen,Language[Language],0),FALSE) & \" - \" & B827","v":"Oil and Petroleum Products - KT"},2024]
["REN","TJ_NCV",null,"J",null,null,null,"Renewable Energies",{"$f":"VLOOKUP(D828, Param_Multilanguage!A:C, MATCH(LanguageChosen,Language[Language],0)+1, FALSE)","v":"Information and communication"},{"$f":"VLOOKUP(H828,LanguageData,MATCH(LanguageChosen,Language[Language],0),FALSE) & \" - \" & B828","v":"Renewable Energies - TJ_NCV"},2024]
["COAL","KT",null,"J",null,null,null,"Solid Fossil Fuels",{"$f":"VLOOKUP(D829, Param_Multilanguage!A:C, MATCH(LanguageChosen,Language[Language],0)+1, FALSE)","v":"Information and communication"},{"$f":"VLOOKUP(H829,LanguageData,MATCH(LanguageChosen,Language[Language],0),FALSE) & \" - \" & B829","v":"Solid Fossil Fuels - KT"},2024]
["NONREN","TJ_NCV",null,"J",null,null,null,"Non Renewable Waste",{"$f":"VLOOKUP(D830, Param_Multilanguage!A:C, MATCH(LanguageChosen,Language[Language],0)+1, FALSE)","v":"Information and communication"},{"$f":"VLOOKUP(H830,LanguageData,MATCH(LanguageChosen,Language[Language],0),FALSE) & \" - \" & B830","v":"Non Renewable Waste - TJ_NCV"},2024]
["HYDROGEN","TJ_NCV",null,"J",null,null,null,"Hydrogen",{"$f":"VLOOKUP(D831, Param_Multilanguage!A:C, MATCH(LanguageChosen,Language[Language],0)+1, FALSE)","v":"Information and communication"},{"$f":"VLOOKUP(H831,LanguageData,MATCH(LanguageChosen,Language[Language],0),FALSE) & \" - \" & B831","v":"Hydrogen - TJ_NCV"},2024]
["ELECTR","GWH",null,"K_L",null,null,null,"Electricity",{"$f":"VLOOKUP(D832, Param_Multilanguage!A:C, MATCH(LanguageChosen,Language[Language],0)+1, FALSE)","v":"Financial and insurance activities; real estate activities"},{"$f":"VLOOKUP(H832,LanguageData,MATCH(LanguageChosen,Language[Language],0),FALSE) & \" - \" & B832","v":"Electricity - GWH"},2024]
["NATGAS","TJ_GCV",null,"K_L",null,null,null,"Natural Gas",{"$f":"VLOOKUP(D833, Param_Multilanguage!A:C, MATCH(LanguageChosen,Language[Language],0)+1, FALSE)","v":"Financial and insurance activities; real estate activities"},{"$f":"VLOOKUP(H833,LanguageData,MATCH(LanguageChosen,Language[Language],0),FALSE) & \" - \" & B833","v":"Natural Gas - TJ_GCV"},2024]
["HEAT","TJ_NCV",null,"K_L",null,null,null,"Derived Heat",{"$f":"VLOOKUP(D834, Param_Multilanguage!A:C, MATCH(LanguageChosen,Language[Language],0)+1, FALSE)","v":"Financial and insurance activities; real estate activities"},{"$f":"VLOOKUP(H834,LanguageData,MATCH(LanguageChosen,Language[Language],0),FALSE) & \" - \" & B834","v":"Derived Heat - TJ_NCV"},2024]
["TOTALOIL","KT",null,"K_L",null,null,null,"Oil and Petroleum Products",{"$f":"VLOOKUP(D835, Param_Multilanguage!A:C, MATCH(LanguageChosen,Language[Language],0)+1, FALSE)","v":"Financial and insurance activities; real estate activities"},{"$f":"VLOOKUP(H835,LanguageData,MATCH(LanguageChosen,Language[Language],0),FALSE) & \" - \" & B835","v":"Oil and Petroleum Products - KT"},2024]
["REN","TJ_NCV",null,"K_L",null,null,null,"Renewable Energies",{"$f":"VLOOKUP(D836, Param_Multilanguage!A:C, MATCH(LanguageChosen,Language[Language],0)+1, FALSE)","v":"Financial and insurance activities; real estate activities"},{"$f":"VLOOKUP(H836,LanguageData,MATCH(LanguageChosen,Language[Language],0),FALSE) & \" - \" & B836","v":"Renewable Energies - TJ_NCV"},2024]
["COAL","KT",null,"K_L",null,null,null,"Solid Fossil Fuels",{"$f":"VLOOKUP(D837, Param_Multilanguage!A:C, MATCH(LanguageChosen,Language[Language],0)+1, FALSE)","v":"Financial and insurance activities; real estate activities"},{"$f":"VLOOKUP(H837,LanguageData,MATCH(LanguageChosen,Language[Language],0),FALSE) & \" - \" & B837","v":"Solid Fossil Fuels - KT"},2024]
["NONREN","TJ_NCV",null,"K_L",null,null,null,"Non Renewable Waste",{"$f":"VLOOKUP(D838, Param_Multilanguage!A:C, MATCH(LanguageChosen,Language[Language],0)+1, FALSE)","v":"Financial and insurance activities; real estate activities"},{"$f":"VLOOKUP(H838,LanguageData,MATCH(LanguageChosen,Language[Language],0),FALSE) & \" - \" & B838","v":"Non Renewable Waste - TJ_NCV"},2024]
["HYDROGEN","TJ_NCV",null,"K_L",null,null,null,"Hydrogen",{"$f":"VLOOKUP(D839, Param_Multilanguage!A:C, MATCH(LanguageChosen,Language[Language],0)+1, FALSE)","v":"Financial and insurance activities; real estate activities"},{"$f":"VLOOKUP(H839,LanguageData,MATCH(LanguageChosen,Language[Language],0),FALSE) & \" - \" & B839","v":"Hydrogen - TJ_NCV"},2024]
["ELECTR","GWH",null,"M_S",null,null,null,"Electricity",{"$f":"VLOOKUP(D840, Param_Multilanguage!A:C, MATCH(LanguageChosen,Language[Language],0)+1, FALSE)","v":"Professional, scientific and technical activities; other services"},{"$f":"VLOOKUP(H840,LanguageData,MATCH(LanguageChosen,Language[Language],0),FALSE) & \" - \" & B840","v":"Electricity - GWH"},2024]
["NATGAS","TJ_GCV",null,"M_S",null,null,null,"Natural Gas",{"$f":"VLOOKUP(D841, Param_Multilanguage!A:C, MATCH(LanguageChosen,Language[Language],0)+1, FALSE)","v":"Professional, scientific and technical activities; other services"},{"$f":"VLOOKUP(H841,LanguageData,MATCH(LanguageChosen,Language[Language],0),FALSE) & \" - \" & B841","v":"Natural Gas - TJ_GCV"},2024]
["HEAT","TJ_NCV",null,"M_S",null,null,null,"Derived Heat",{"$f":"VLOOKUP(D842, Param_Multilanguage!A:C, MATCH(LanguageChosen,Language[Language],0)+1, FALSE)","v":"Professional, scientific and technical activities; other services"},{"$f":"VLOOKUP(H842,LanguageData,MATCH(LanguageChosen,Language[Language],0),FALSE) & \" - \" & B842","v":"Derived Heat - TJ_NCV"},2024]
["TOTALOIL","KT",null,"M_S",null,null,null,"Oil and Petroleum Products",{"$f":"VLOOKUP(D843, Param_Multilanguage!A:C, MATCH(LanguageChosen,Language[Language],0)+1, FALSE)","v":"Professional, scientific and technical activities; other services"},{"$f":"VLOOKUP(H843,LanguageData,MATCH(LanguageChosen,Language[Language],0),FALSE) & \" - \" & B843","v":"Oil and Petroleum Products - KT"},2024]
["REN","TJ_NCV",null,"M_S",null,null,null,"Renewable Energies",{"$f":"VLOOKUP(D844, Param_Multilanguage!A:C, MATCH(LanguageChosen,Language[Language],0)+1, FALSE)","v":"Professional, scientific and technical activities; other services"},{"$f":"VLOOKUP(H844,LanguageData,MATCH(LanguageChosen,Language[Language],0),FALSE) & \" - \" & B844","v":"Renewable Energies - TJ_NCV"},2024]
["COAL","KT",null,"M_S",null,null,null,"Solid Fossil Fuels",{"$f":"VLOOKUP(D845, Param_Multilanguage!A:C, MATCH(LanguageChosen,Language[Language],0)+1, FALSE)","v":"Professional, scientific and technical activities; other services"},{"$f":"VLOOKUP(H845,LanguageData,MATCH(LanguageChosen,Language[Language],0),FALSE) & \" - \" & B845","v":"Solid Fossil Fuels - KT"},2024]
["NONREN","TJ_NCV",null,"M_S",null,null,null,"Non Renewable Waste",{"$f":"VLOOKUP(D846, Param_Multilanguage!A:C, MATCH(LanguageChosen,Language[Language],0)+1, FALSE)","v":"Professional, scientific and technical activities; other services"},{"$f":"VLOOKUP(H846,LanguageData,MATCH(LanguageChosen,Language[Language],0),FALSE) & \" - \" & B846","v":"Non Renewable Waste - TJ_NCV"},2024]
["HYDROGEN","TJ_NCV",null,"M_S",null,null,null,"Hydrogen",{"$f":"VLOOKUP(D847, Param_Multilanguage!A:C, MATCH(LanguageChosen,Language[Language],0)+1, FALSE)","v":"Professional, scientific and technical activities; other services"},{"$f":"VLOOKUP(H847,LanguageData,MATCH(LanguageChosen,Language[Language],0),FALSE) & \" - \" & B847","v":"Hydrogen - TJ_NCV"},2024]
["ELECTR","GWH",null,"N",null,null,null,"Electricity",{"$f":"VLOOKUP(D848, Param_Multilanguage!A:C, MATCH(LanguageChosen,Language[Language],0)+1, FALSE)","v":"Administrative and support services activities"},{"$f":"VLOOKUP(H848,LanguageData,MATCH(LanguageChosen,Language[Language],0),FALSE) & \" - \" & B848","v":"Electricity - GWH"},2024]
["NATGAS","TJ_GCV",null,"N",null,null,null,"Natural Gas",{"$f":"VLOOKUP(D849, Param_Multilanguage!A:C, MATCH(LanguageChosen,Language[Language],0)+1, FALSE)","v":"Administrative and support services activities"},{"$f":"VLOOKUP(H849,LanguageData,MATCH(LanguageChosen,Language[Language],0),FALSE) & \" - \" & B849","v":"Natural Gas - TJ_GCV"},2024]
["HEAT","TJ_NCV",null,"N",null,null,null,"Derived Heat",{"$f":"VLOOKUP(D850, Param_Multilanguage!A:C, MATCH(LanguageChosen,Language[Language],0)+1, FALSE)","v":"Administrative and support services activities"},{"$f":"VLOOKUP(H850,LanguageData,MATCH(LanguageChosen,Language[Language],0),FALSE) & \" - \" & B850","v":"Derived Heat - TJ_NCV"},2024]
["TOTALOIL","KT",null,"N",null,null,null,"Oil and Petroleum Products",{"$f":"VLOOKUP(D851, Param_Multilanguage!A:C, MATCH(LanguageChosen,Language[Language],0)+1, FALSE)","v":"Administrative and support services activities"},{"$f":"VLOOKUP(H851,LanguageData,MATCH(LanguageChosen,Language[Language],0),FALSE) & \" - \" & B851","v":"Oil and Petroleum Products - KT"},2024]
["REN","TJ_NCV",null,"N",null,null,null,"Renewable Energies",{"$f":"VLOOKUP(D852, Param_Multilanguage!A:C, MATCH(LanguageChosen,Language[Language],0)+1, FALSE)","v":"Administrative and support services activities"},{"$f":"VLOOKUP(H852,LanguageData,MATCH(LanguageChosen,Language[Language],0),FALSE) & \" - \" & B852","v":"Renewable Energies - TJ_NCV"},2024]
["COAL","KT",null,"N",null,null,null,"Solid Fossil Fuels",{"$f":"VLOOKUP(D853, Param_Multilanguage!A:C, MATCH(LanguageChosen,Language[Language],0)+1, FALSE)","v":"Administrative and support services activities"},{"$f":"VLOOKUP(H853,LanguageData,MATCH(LanguageChosen,Language[Language],0),FALSE) & \" - \" & B853","v":"Solid Fossil Fuels - KT"},2024]
["NONREN","TJ_NCV",null,"N",null,null,null,"Non Renewable Waste",{"$f":"VLOOKUP(D854, Param_Multilanguage!A:C, MATCH(LanguageChosen,Language[Language],0)+1, FALSE)","v":"Administrative and support services activities"},{"$f":"VLOOKUP(H854,LanguageData,MATCH(LanguageChosen,Language[Language],0),FALSE) & \" - \" & B854","v":"Non Renewable Waste - TJ_NCV"},2024]
["HYDROGEN","TJ_NCV",null,"N",null,null,null,"Hydrogen",{"$f":"VLOOKUP(D855, Param_Multilanguage!A:C, MATCH(LanguageChosen,Language[Language],0)+1, FALSE)","v":"Administrative and support services activities"},{"$f":"VLOOKUP(H855,LanguageData,MATCH(LanguageChosen,Language[Language],0),FALSE) & \" - \" & B855","v":"Hydrogen - TJ_NCV"},2024]
["ELECTR","GWH",null,"O",null,null,null,"Electricity",{"$f":"VLOOKUP(D856, Param_Multilanguage!A:C, MATCH(LanguageChosen,Language[Language],0)+1, FALSE)","v":"Public administration and defence; compulsory social security"},{"$f":"VLOOKUP(H856,LanguageData,MATCH(LanguageChosen,Language[Language],0),FALSE) & \" - \" & B856","v":"Electricity - GWH"},2024]
["NATGAS","TJ_GCV",null,"O",null,null,null,"Natural Gas",{"$f":"VLOOKUP(D857, Param_Multilanguage!A:C, MATCH(LanguageChosen,Language[Language],0)+1, FALSE)","v":"Public administration and defence; compulsory social security"},{"$f":"VLOOKUP(H857,LanguageData,MATCH(LanguageChosen,Language[Language],0),FALSE) & \" - \" & B857","v":"Natural Gas - TJ_GCV"},2024]
["HEAT","TJ_NCV",null,"O",null,null,null,"Derived Heat",{"$f":"VLOOKUP(D858, Param_Multilanguage!A:C, MATCH(LanguageChosen,Language[Language],0)+1, FALSE)","v":"Public administration and defence; compulsory social security"},{"$f":"VLOOKUP(H858,LanguageData,MATCH(LanguageChosen,Language[Language],0),FALSE) & \" - \" & B858","v":"Derived Heat - TJ_NCV"},2024]
["TOTALOIL","KT",null,"O",null,null,null,"Oil and Petroleum Products",{"$f":"VLOOKUP(D859, Param_Multilanguage!A:C, MATCH(LanguageChosen,Language[Language],0)+1, FALSE)","v":"Public administration and defence; compulsory social security"},{"$f":"VLOOKUP(H859,LanguageData,MATCH(LanguageChosen,Language[Language],0),FALSE) & \" - \" & B859","v":"Oil and Petroleum Products - KT"},2024]
["REN","TJ_NCV",null,"O",null,null,null,"Renewable Energies",{"$f":"VLOOKUP(D860, Param_Multilanguage!A:C, MATCH(LanguageChosen,Language[Language],0)+1, FALSE)","v":"Public administration and defence; compulsory social security"},{"$f":"VLOOKUP(H860,LanguageData,MATCH(LanguageChosen,Language[Language],0),FALSE) & \" - \" & B860","v":"Renewable Energies - TJ_NCV"},2024]
["COAL","KT",null,"O",null,null,null,"Solid Fossil Fuels",{"$f":"VLOOKUP(D861, Param_Multilanguage!A:C, MATCH(LanguageChosen,Language[Language],0)+1, FALSE)","v":"Public administration and defence; compulsory social security"},{"$f":"VLOOKUP(H861,LanguageData,MATCH(LanguageChosen,Language[Language],0),FALSE) & \" - \" & B861","v":"Solid Fossil Fuels - KT"},2024]
["NONREN","TJ_NCV",null,"O",null,null,null,"Non Renewable Waste",{"$f":"VLOOKUP(D862, Param_Multilanguage!A:C, MATCH(LanguageChosen,Language[Language],0)+1, FALSE)","v":"Public administration and defence; compulsory social security"},{"$f":"VLOOKUP(H862,LanguageData,MATCH(LanguageChosen,Language[Language],0),FALSE) & \" - \" & B862","v":"Non Renewable Waste - TJ_NCV"},2024]
["HYDROGEN","TJ_NCV",null,"O",null,null,null,"Hydrogen",{"$f":"VLOOKUP(D863, Param_Multilanguage!A:C, MATCH(LanguageChosen,Language[Language],0)+1, FALSE)","v":"Public administration and defence; compulsory social security"},{"$f":"VLOOKUP(H863,LanguageData,MATCH(LanguageChosen,Language[Language],0),FALSE) & \" - \" & B863","v":"Hydrogen - TJ_NCV"},2024]
["ELECTR","GWH",null,"P",null,null,null,"Electricity",{"$f":"VLOOKUP(D864, Param_Multilanguage!A:C, MATCH(LanguageChosen,Language[Language],0)+1, FALSE)","v":"Education"},{"$f":"VLOOKUP(H864,LanguageData,MATCH(LanguageChosen,Language[Language],0),FALSE) & \" - \" & B864","v":"Electricity - GWH"},2024]
["NATGAS","TJ_GCV",null,"P",null,null,null,"Natural Gas",{"$f":"VLOOKUP(D865, Param_Multilanguage!A:C, MATCH(LanguageChosen,Language[Language],0)+1, FALSE)","v":"Education"},{"$f":"VLOOKUP(H865,LanguageData,MATCH(LanguageChosen,Language[Language],0),FALSE) & \" - \" & B865","v":"Natural Gas - TJ_GCV"},2024]
["HEAT","TJ_NCV",null,"P",null,null,null,"Derived Heat",{"$f":"VLOOKUP(D866, Param_Multilanguage!A:C, MATCH(LanguageChosen,Language[Language],0)+1, FALSE)","v":"Education"},{"$f":"VLOOKUP(H866,LanguageData,MATCH(LanguageChosen,Language[Language],0),FALSE) & \" - \" & B866","v":"Derived Heat - TJ_NCV"},2024]
["TOTALOIL","KT",null,"P",null,null,null,"Oil and Petroleum Products",{"$f":"VLOOKUP(D867, Param_Multilanguage!A:C, MATCH(LanguageChosen,Language[Language],0)+1, FALSE)","v":"Education"},{"$f":"VLOOKUP(H867,LanguageData,MATCH(LanguageChosen,Language[Language],0),FALSE) & \" - \" & B867","v":"Oil and Petroleum Products - KT"},2024]
["REN","TJ_NCV",null,"P",null,null,null,"Renewable Energies",{"$f":"VLOOKUP(D868, Param_Multilanguage!A:C, MATCH(LanguageChosen,Language[Language],0)+1, FALSE)","v":"Education"},{"$f":"VLOOKUP(H868,LanguageData,MATCH(LanguageChosen,Language[Language],0),FALSE) & \" - \" & B868","v":"Renewable Energies - TJ_NCV"},2024]
["COAL","KT",null,"P",null,null,null,"Solid Fossil Fuels",{"$f":"VLOOKUP(D869, Param_Multilanguage!A:C, MATCH(LanguageChosen,Language[Language],0)+1, FALSE)","v":"Education"},{"$f":"VLOOKUP(H869,LanguageData,MATCH(LanguageChosen,Language[Language],0),FALSE) & \" - \" & B869","v":"Solid Fossil Fuels - KT"},2024]
["NONREN","TJ_NCV",null,"P",null,null,null,"Non Renewable Waste",{"$f":"VLOOKUP(D870, Param_Multilanguage!A:C, MATCH(LanguageChosen,Language[Language],0)+1, FALSE)","v":"Education"},{"$f":"VLOOKUP(H870,LanguageData,MATCH(LanguageChosen,Language[Language],0),FALSE) & \" - \" & B870","v":"Non Renewable Waste - TJ_NCV"},2024]
["HYDROGEN","TJ_NCV",null,"P",null,null,null,"Hydrogen",{"$f":"VLOOKUP(D871, Param_Multilanguage!A:C, MATCH(LanguageChosen,Language[Language],0)+1, FALSE)","v":"Education"},{"$f":"VLOOKUP(H871,LanguageData,MATCH(LanguageChosen,Language[Language],0),FALSE) & \" - \" & B871","v":"Hydrogen - TJ_NCV"},2024]
["ELECTR","GWH",null,"Q",null,null,null,"Electricity",{"$f":"VLOOKUP(D872, Param_Multilanguage!A:C, MATCH(LanguageChosen,Language[Language],0)+1, FALSE)","v":"Human health and social work activities"},{"$f":"VLOOKUP(H872,LanguageData,MATCH(LanguageChosen,Language[Language],0),FALSE) & \" - \" & B872","v":"Electricity - GWH"},2024]
["NATGAS","TJ_GCV",null,"Q",null,null,null,"Natural Gas",{"$f":"VLOOKUP(D873, Param_Multilanguage!A:C, MATCH(LanguageChosen,Language[Language],0)+1, FALSE)","v":"Human health and social work activities"},{"$f":"VLOOKUP(H873,LanguageData,MATCH(LanguageChosen,Language[Language],0),FALSE) & \" - \" & B873","v":"Natural Gas - TJ_GCV"},2024]
["HEAT","TJ_NCV",null,"Q",null,null,null,"Derived Heat",{"$f":"VLOOKUP(D874, Param_Multilanguage!A:C, MATCH(LanguageChosen,Language[Language],0)+1, FALSE)","v":"Human health and social work activities"},{"$f":"VLOOKUP(H874,LanguageData,MATCH(LanguageChosen,Language[Language],0),FALSE) & \" - \" & B874","v":"Derived Heat - TJ_NCV"},2024]
["TOTALOIL","KT",null,"Q",null,null,null,"Oil and Petroleum Products",{"$f":"VLOOKUP(D875, Param_Multilanguage!A:C, MATCH(LanguageChosen,Language[Language],0)+1, FALSE)","v":"Human health and social work activities"},{"$f":"VLOOKUP(H875,LanguageData,MATCH(LanguageChosen,Language[Language],0),FALSE) & \" - \" & B875","v":"Oil and Petroleum Products - KT"},2024]
["REN","TJ_NCV",null,"Q",null,null,null,"Renewable Energies",{"$f":"VLOOKUP(D876, Param_Multilanguage!A:C, MATCH(LanguageChosen,Language[Language],0)+1, FALSE)","v":"Human health and social work activities"},{"$f":"VLOOKUP(H876,LanguageData,MATCH(LanguageChosen,Language[Language],0),FALSE) & \" - \" & B876","v":"Renewable Energies - TJ_NCV"},2024]
["COAL","KT",null,"Q",null,null,null,"Solid Fossil Fuels",{"$f":"VLOOKUP(D877, Param_Multilanguage!A:C, MATCH(LanguageChosen,Language[Language],0)+1, FALSE)","v":"Human health and social work activities"},{"$f":"VLOOKUP(H877,LanguageData,MATCH(LanguageChosen,Language[Language],0),FALSE) & \" - \" & B877","v":"Solid Fossil Fuels - KT"},2024]
["NONREN","TJ_NCV",null,"Q",null,null,null,"Non Renewable Waste",{"$f":"VLOOKUP(D878, Param_Multilanguage!A:C, MATCH(LanguageChosen,Language[Language],0)+1, FALSE)","v":"Human health and social work activities"},{"$f":"VLOOKUP(H878,LanguageData,MATCH(LanguageChosen,Language[Language],0),FALSE) & \" - \" & B878","v":"Non Renewable Waste - TJ_NCV"},2024]
["HYDROGEN","TJ_NCV",null,"Q",null,null,null,"Hydrogen",{"$f":"VLOOKUP(D879, Param_Multilanguage!A:C, MATCH(LanguageChosen,Language[Language],0)+1, FALSE)","v":"Human health and social work activities"},{"$f":"VLOOKUP(H879,LanguageData,MATCH(LanguageChosen,Language[Language],0),FALSE) & \" - \" & B879","v":"Hydrogen - TJ_NCV"},2024]
["ELECTR","GWH",null,"Q861",null,null,null,"Electricity",{"$f":"VLOOKUP(D880, Param_Multilanguage!A:C, MATCH(LanguageChosen,Language[Language],0)+1, FALSE)","v":"Of which: Hospital activities"},{"$f":"VLOOKUP(H880,LanguageData,MATCH(LanguageChosen,Language[Language],0),FALSE) & \" - \" & B880","v":"Electricity - GWH"},2024]
["NATGAS","TJ_GCV",null,"Q861",null,null,null,"Natural Gas",{"$f":"VLOOKUP(D881, Param_Multilanguage!A:C, MATCH(LanguageChosen,Language[Language],0)+1, FALSE)","v":"Of which: Hospital activities"},{"$f":"VLOOKUP(H881,LanguageData,MATCH(LanguageChosen,Language[Language],0),FALSE) & \" - \" & B881","v":"Natural Gas - TJ_GCV"},2024]
["HEAT","TJ_NCV",null,"Q861",null,null,null,"Derived Heat",{"$f":"VLOOKUP(D882, Param_Multilanguage!A:C, MATCH(LanguageChosen,Language[Language],0)+1, FALSE)","v":"Of which: Hospital activities"},{"$f":"VLOOKUP(H882,LanguageData,MATCH(LanguageChosen,Language[Language],0),FALSE) & \" - \" & B882","v":"Derived Heat - TJ_NCV"},2024]
["TOTALOIL","KT",null,"Q861",null,null,null,"Oil and Petroleum Products",{"$f":"VLOOKUP(D883, Param_Multilanguage!A:C, MATCH(LanguageChosen,Language[Language],0)+1, FALSE)","v":"Of which: Hospital activities"},{"$f":"VLOOKUP(H883,LanguageData,MATCH(LanguageChosen,Language[Language],0),FALSE) & \" - \" & B883","v":"Oil and Petroleum Products - KT"},2024]
["REN","TJ_NCV",null,"Q861",null,null,null,"Renewable Energies",{"$f":"VLOOKUP(D884, Param_Multilanguage!A:C, MATCH(LanguageChosen,Language[Language],0)+1, FALSE)","v":"Of which: Hospital activities"},{"$f":"VLOOKUP(H884,LanguageData,MATCH(LanguageChosen,Language[Language],0),FALSE) & \" - \" & B884","v":"Renewable Energies - TJ_NCV"},2024]
["COAL","KT",null,"Q861",null,null,null,"Solid Fossil Fuels",{"$f":"VLOOKUP(D885, Param_Multilanguage!A:C, MATCH(LanguageChosen,Language[Language],0)+1, FALSE)","v":"Of which: Hospital activities"},{"$f":"VLOOKUP(H885,LanguageData,MATCH(LanguageChosen,Language[Language],0),FALSE) & \" - \" & B885","v":"Solid Fossil Fuels - KT"},2024]
["NONREN","TJ_NCV",null,"Q861",null,null,null,"Non Renewable Waste",{"$f":"VLOOKUP(D886, Param_Multilanguage!A:C, MATCH(LanguageChosen,Language[Language],0)+1, FALSE)","v":"Of which: Hospital activities"},{"$f":"VLOOKUP(H886,LanguageData,MATCH(LanguageChosen,Language[Language],0),FALSE) & \" - \" & B886","v":"Non Renewable Waste - TJ_NCV"},2024]
["HYDROGEN","TJ_NCV",null,"Q861",null,null,null,"Hydrogen",{"$f":"VLOOKUP(D887, Param_Multilanguage!A:C, MATCH(LanguageChosen,Language[Language],0)+1, FALSE)","v":"Of which: Hospital activities"},{"$f":"VLOOKUP(H887,LanguageData,MATCH(LanguageChosen,Language[Language],0),FALSE) & \" - \" & B887","v":"Hydrogen - TJ_NCV"},2024]
["ELECTR","GWH",null,"R",null,null,null,"Electricity",{"$f":"VLOOKUP(D888, Param_Multilanguage!A:C, MATCH(LanguageChosen,Language[Language],0)+1, FALSE)","v":"Arts, entertainment and recreation"},{"$f":"VLOOKUP(H888,LanguageData,MATCH(LanguageChosen,Language[Language],0),FALSE) & \" - \" & B888","v":"Electricity - GWH"},2024]
["NATGAS","TJ_GCV",null,"R",null,null,null,"Natural Gas",{"$f":"VLOOKUP(D889, Param_Multilanguage!A:C, MATCH(LanguageChosen,Language[Language],0)+1, FALSE)","v":"Arts, entertainment and recreation"},{"$f":"VLOOKUP(H889,LanguageData,MATCH(LanguageChosen,Language[Language],0),FALSE) & \" - \" & B889","v":"Natural Gas - TJ_GCV"},2024]
["HEAT","TJ_NCV",null,"R",null,null,null,"Derived Heat",{"$f":"VLOOKUP(D890, Param_Multilanguage!A:C, MATCH(LanguageChosen,Language[Language],0)+1, FALSE)","v":"Arts, entertainment and recreation"},{"$f":"VLOOKUP(H890,LanguageData,MATCH(LanguageChosen,Language[Language],0),FALSE) & \" - \" & B890","v":"Derived Heat - TJ_NCV"},2024]
["TOTALOIL","KT",null,"R",null,null,null,"Oil and Petroleum Products",{"$f":"VLOOKUP(D891, Param_Multilanguage!A:C, MATCH(LanguageChosen,Language[Language],0)+1, FALSE)","v":"Arts, entertainment and recreation"},{"$f":"VLOOKUP(H891,LanguageData,MATCH(LanguageChosen,Language[Language],0),FALSE) & \" - \" & B891","v":"Oil and Petroleum Products - KT"},2024]
["REN","TJ_NCV",null,"R",null,null,null,"Renewable Energies",{"$f":"VLOOKUP(D892, Param_Multilanguage!A:C, MATCH(LanguageChosen,Language[Language],0)+1, FALSE)","v":"Arts, entertainment and recreation"},{"$f":"VLOOKUP(H892,LanguageData,MATCH(LanguageChosen,Language[Language],0),FALSE) & \" - \" & B892","v":"Renewable Energies - TJ_NCV"},2024]
["COAL","KT",null,"R",null,null,null,"Solid Fossil Fuels",{"$f":"VLOOKUP(D893, Param_Multilanguage!A:C, MATCH(LanguageChosen,Language[Language],0)+1, FALSE)","v":"Arts, entertainment and recreation"},{"$f":"VLOOKUP(H893,LanguageData,MATCH(LanguageChosen,Language[Language],0),FALSE) & \" - \" & B893","v":"Solid Fossil Fuels - KT"},2024]
["NONREN","TJ_NCV",null,"R",null,null,null,"Non Renewable Waste",{"$f":"VLOOKUP(D894, Param_Multilanguage!A:C, MATCH(LanguageChosen,Language[Language],0)+1, FALSE)","v":"Arts, entertainment and recreation"},{"$f":"VLOOKUP(H894,LanguageData,MATCH(LanguageChosen,Language[Language],0),FALSE) & \" - \" & B894","v":"Non Renewable Waste - TJ_NCV"},2024]
["HYDROGEN","TJ_NCV",null,"R",null,null,null,"Hydrogen",{"$f":"VLOOKUP(D895, Param_Multilanguage!A:C, MATCH(LanguageChosen,Language[Language],0)+1, FALSE)","v":"Arts, entertainment and recreation"},{"$f":"VLOOKUP(H895,LanguageData,MATCH(LanguageChosen,Language[Language],0),FALSE) & \" - \" & B895","v":"Hydrogen - TJ_NCV"},2024]
["ELECTR","GWH",null,"R93",null,null,null,"Electricity",{"$f":"VLOOKUP(D896, Param_Multilanguage!A:C, MATCH(LanguageChosen,Language[Language],0)+1, FALSE)","v":"Of which: Sports activities and amusement and recreation activities"},{"$f":"VLOOKUP(H896,LanguageData,MATCH(LanguageChosen,Language[Language],0),FALSE) & \" - \" & B896","v":"Electricity - GWH"},2024]
["NATGAS","TJ_GCV",null,"R93",null,null,null,"Natural Gas",{"$f":"VLOOKUP(D897, Param_Multilanguage!A:C, MATCH(LanguageChosen,Language[Language],0)+1, FALSE)","v":"Of which: Sports activities and amusement and recreation activities"},{"$f":"VLOOKUP(H897,LanguageData,MATCH(LanguageChosen,Language[Language],0),FALSE) & \" - \" & B897","v":"Natural Gas - TJ_GCV"},2024]
["HEAT","TJ_NCV",null,"R93",null,null,null,"Derived Heat",{"$f":"VLOOKUP(D898, Param_Multilanguage!A:C, MATCH(LanguageChosen,Language[Language],0)+1, FALSE)","v":"Of which: Sports activities and amusement and recreation activities"},{"$f":"VLOOKUP(H898,LanguageData,MATCH(LanguageChosen,Language[Language],0),FALSE) & \" - \" & B898","v":"Derived Heat - TJ_NCV"},2024]
["TOTALOIL","KT",null,"R93",null,null,null,"Oil and Petroleum Products",{"$f":"VLOOKUP(D899, Param_Multilanguage!A:C, MATCH(LanguageChosen,Language[Language],0)+1, FALSE)","v":"Of which: Sports activities and amusement and recreation activities"},{"$f":"VLOOKUP(H899,LanguageData,MATCH(LanguageChosen,Language[Language],0),FALSE) & \" - \" & B899","v":"Oil and Petroleum Products - KT"},2024]
["REN","TJ_NCV",null,"R93",null,null,null,"Renewable Energies",{"$f":"VLOOKUP(D900, Param_Multilanguage!A:C, MATCH(LanguageChosen,Language[Language],0)+1, FALSE)","v":"Of which: Sports activities and amusement and recreation activities"},{"$f":"VLOOKUP(H900,LanguageData,MATCH(LanguageChosen,Language[Language],0),FALSE) & \" - \" & B900","v":"Renewable Energies - TJ_NCV"},2024]
["COAL","KT",null,"R93",null,null,null,"Solid Fossil Fuels",{"$f":"VLOOKUP(D901, Param_Multilanguage!A:C, MATCH(LanguageChosen,Language[Language],0)+1, FALSE)","v":"Of which: Sports activities and amusement and recreation activities"},{"$f":"VLOOKUP(H901,LanguageData,MATCH(LanguageChosen,Language[Language],0),FALSE) & \" - \" & B901","v":"Solid Fossil Fuels - KT"},2024]
["NONREN","TJ_NCV",null,"R93",null,null,null,"Non Renewable Waste",{"$f":"VLOOKUP(D902, Param_Multilanguage!A:C, MATCH(LanguageChosen,Language[Language],0)+1, FALSE)","v":"Of which: Sports activities and amusement and recreation activities"},{"$f":"VLOOKUP(H902,LanguageData,MATCH(LanguageChosen,Language[Language],0),FALSE) & \" - \" & B902","v":"Non Renewable Waste - TJ_NCV"},2024]
["HYDROGEN","TJ_NCV",null,"R93",null,null,null,"Hydrogen",{"$f":"VLOOKUP(D903, Param_Multilanguage!A:C, MATCH(LanguageChosen,Language[Language],0)+1, FALSE)","v":"Of which: Sports activities and amusement and recreation activities"},{"$f":"VLOOKUP(H903,LanguageData,MATCH(LanguageChosen,Language[Language],0),FALSE) & \" - \" & B903","v":"Hydrogen - TJ_NCV"},2024]
["ELECTR","GWH",null,"U",null,null,null,"Electricity",{"$f":"VLOOKUP(D904, Param_Multilanguage!A:C, MATCH(LanguageChosen,Language[Language],0)+1, FALSE)","v":"Activities of extra-territorial organisations and bodies"},{"$f":"VLOOKUP(H904,LanguageData,MATCH(LanguageChosen,Language[Language],0),FALSE) & \" - \" & B904","v":"Electricity - GWH"},2024]
["NATGAS","TJ_GCV",null,"U",null,null,null,"Natural Gas",{"$f":"VLOOKUP(D905, Param_Multilanguage!A:C, MATCH(LanguageChosen,Language[Language],0)+1, FALSE)","v":"Activities of extra-territorial organisations and bodies"},{"$f":"VLOOKUP(H905,LanguageData,MATCH(LanguageChosen,Language[Language],0),FALSE) & \" - \" & B905","v":"Natural Gas - TJ_GCV"},2024]
["HEAT","TJ_NCV",null,"U",null,null,null,"Derived Heat",{"$f":"VLOOKUP(D906, Param_Multilanguage!A:C, MATCH(LanguageChosen,Language[Language],0)+1, FALSE)","v":"Activities of extra-territorial organisations and bodies"},{"$f":"VLOOKUP(H906,LanguageData,MATCH(LanguageChosen,Language[Language],0),FALSE) & \" - \" & B906","v":"Derived Heat - TJ_NCV"},2024]
["TOTALOIL","KT",null,"U",null,null,null,"Oil and Petroleum Products",{"$f":"VLOOKUP(D907, Param_Multilanguage!A:C, MATCH(LanguageChosen,Language[Language],0)+1, FALSE)","v":"Activities of extra-territorial organisations and bodies"},{"$f":"VLOOKUP(H907,LanguageData,MATCH(LanguageChosen,Language[Language],0),FALSE) & \" - \" & B907","v":"Oil and Petroleum Products - KT"},2024]
["REN","TJ_NCV",null,"U",null,null,null,"Renewable Energies",{"$f":"VLOOKUP(D908, Param_Multilanguage!A:C, MATCH(LanguageChosen,Language[Language],0)+1, FALSE)","v":"Activities of extra-territorial organisations and bodies"},{"$f":"VLOOKUP(H908,LanguageData,MATCH(LanguageChosen,Language[Language],0),FALSE) & \" - \" & B908","v":"Renewable Energies - TJ_NCV"},2024]
["COAL","KT",null,"U",null,null,null,"Solid Fossil Fuels",{"$f":"VLOOKUP(D909, Param_Multilanguage!A:C, MATCH(LanguageChosen,Language[Language],0)+1, FALSE)","v":"Activities of extra-territorial organisations and bodies"},{"$f":"VLOOKUP(H909,LanguageData,MATCH(LanguageChosen,Language[Language],0),FALSE) & \" - \" & B909","v":"Solid Fossil Fuels - KT"},2024]
["NONREN","TJ_NCV",null,"U",null,null,null,"Non Renewable Waste",{"$f":"VLOOKUP(D910, Param_Multilanguage!A:C, MATCH(LanguageChosen,Language[Language],0)+1, FALSE)","v":"Activities of extra-territorial organisations and bodies"},{"$f":"VLOOKUP(H910,LanguageData,MATCH(LanguageChosen,Language[Language],0),FALSE) & \" - \" & B910","v":"Non Renewable Waste - TJ_NCV"},2024]
["HYDROGEN","TJ_NCV",null,"U",null,null,null,"Hydrogen",{"$f":"VLOOKUP(D911, Param_Multilanguage!A:C, MATCH(LanguageChosen,Language[Language],0)+1, FALSE)","v":"Activities of extra-territorial organisations and bodies"},{"$f":"VLOOKUP(H911,LanguageData,MATCH(LanguageChosen,Language[Language],0),FALSE) & \" - \" & B911","v":"Hydrogen - TJ_NCV"},2024]
["ELECTR","GWH",null,"DATAC",null,null,null,"Electricity",{"$f":"VLOOKUP(D912, Param_Multilanguage!A:C, MATCH(LanguageChosen,Language[Language],0)+1, FALSE)","v":"Data centres"},{"$f":"VLOOKUP(H912,LanguageData,MATCH(LanguageChosen,Language[Language],0),FALSE) & \" - \" & B912","v":"Electricity - GWH"},2024]
["NATGAS","TJ_GCV",null,"DATAC",null,null,null,"Natural Gas",{"$f":"VLOOKUP(D913, Param_Multilanguage!A:C, MATCH(LanguageChosen,Language[Language],0)+1, FALSE)","v":"Data centres"},{"$f":"VLOOKUP(H913,LanguageData,MATCH(LanguageChosen,Language[Language],0),FALSE) & \" - \" & B913","v":"Natural Gas - TJ_GCV"},2024]
["HEAT","TJ_NCV",null,"DATAC",null,null,null,"Derived Heat",{"$f":"VLOOKUP(D914, Param_Multilanguage!A:C, MATCH(LanguageChosen,Language[Language],0)+1, FALSE)","v":"Data centres"},{"$f":"VLOOKUP(H914,LanguageData,MATCH(LanguageChosen,Language[Language],0),FALSE) & \" - \" & B914","v":"Derived Heat - TJ_NCV"},2024]
["TOTALOIL","KT",null,"DATAC",null,null,null,"Oil and Petroleum Products",{"$f":"VLOOKUP(D915, Param_Multilanguage!A:C, MATCH(LanguageChosen,Language[Language],0)+1, FALSE)","v":"Data centres"},{"$f":"VLOOKUP(H915,LanguageData,MATCH(LanguageChosen,Language[Language],0),FALSE) & \" - \" & B915","v":"Oil and Petroleum Products - KT"},2024]
["REN","TJ_NCV",null,"DATAC",null,null,null,"Renewable Energies",{"$f":"VLOOKUP(D916, Param_Multilanguage!A:C, MATCH(LanguageChosen,Language[Language],0)+1, FALSE)","v":"Data centres"},{"$f":"VLOOKUP(H916,LanguageData,MATCH(LanguageChosen,Language[Language],0),FALSE) & \" - \" & B916","v":"Renewable Energies - TJ_NCV"},2024]
["COAL","KT",null,"DATAC",null,null,null,"Solid Fossil Fuels",{"$f":"VLOOKUP(D917, Param_Multilanguage!A:C, MATCH(LanguageChosen,Language[Language],0)+1, FALSE)","v":"Data centres"},{"$f":"VLOOKUP(H917,LanguageData,MATCH(LanguageChosen,Language[Language],0),FALSE) & \" - \" & B917","v":"Solid Fossil Fuels - KT"},2024]
["NONREN","TJ_NCV",null,"DATAC",null,null,null,"Non Renewable Waste",{"$f":"VLOOKUP(D918, Param_Multilanguage!A:C, MATCH(LanguageChosen,Language[Language],0)+1, FALSE)","v":"Data centres"},{"$f":"VLOOKUP(H918,LanguageData,MATCH(LanguageChosen,Language[Language],0),FALSE) & \" - \" & B918","v":"Non Renewable Waste - TJ_NCV"},2024]
["HYDROGEN","TJ_NCV",null,"DATAC",null,null,null,"Hydrogen",{"$f":"VLOOKUP(D919, Param_Multilanguage!A:C, MATCH(LanguageChosen,Language[Language],0)+1, FALSE)","v":"Data centres"},{"$f":"VLOOKUP(H919,LanguageData,MATCH(LanguageChosen,Language[Language],0),FALSE) & \" - \" & B919","v":"Hydrogen - TJ_NCV"},2024]
["ELECTR","GWH",null,"TOTSER",null,null,null,"Electricity",{"$f":"VLOOKUP(D920, Param_Multilanguage!A:C, MATCH(LanguageChosen,Language[Language],0)+1, FALSE)","v":"Services total"},{"$f":"VLOOKUP(H920,LanguageData,MATCH(LanguageChosen,Language[Language],0),FALSE) & \" - \" & B920","v":"Electricity - GWH"},2024]
["NATGAS","TJ_GCV",null,"TOTSER",null,null,null,"Natural Gas",{"$f":"VLOOKUP(D921, Param_Multilanguage!A:C, MATCH(LanguageChosen,Language[Language],0)+1, FALSE)","v":"Services total"},{"$f":"VLOOKUP(H921,LanguageData,MATCH(LanguageChosen,Language[Language],0),FALSE) & \" - \" & B921","v":"Natural Gas - TJ_GCV"},2024]
["HEAT","TJ_NCV",null,"TOTSER",null,null,null,"Derived Heat",{"$f":"VLOOKUP(D922, Param_Multilanguage!A:C, MATCH(LanguageChosen,Language[Language],0)+1, FALSE)","v":"Services total"},{"$f":"VLOOKUP(H922,LanguageData,MATCH(LanguageChosen,Language[Language],0),FALSE) & \" - \" & B922","v":"Derived Heat - TJ_NCV"},2024]
["TOTALOIL","KT",null,"TOTSER",null,null,null,"Oil and Petroleum Products",{"$f":"VLOOKUP(D923, Param_Multilanguage!A:C, MATCH(LanguageChosen,Language[Language],0)+1, FALSE)","v":"Services total"},{"$f":"VLOOKUP(H923,LanguageData,MATCH(LanguageChosen,Language[Language],0),FALSE) & \" - \" & B923","v":"Oil and Petroleum Products - KT"},2024]
["REN","TJ_NCV",null,"TOTSER",null,null,null,"Renewable Energies",{"$f":"VLOOKUP(D924, Param_Multilanguage!A:C, MATCH(LanguageChosen,Language[Language],0)+1, FALSE)","v":"Services total"},{"$f":"VLOOKUP(H924,LanguageData,MATCH(LanguageChosen,Language[Language],0),FALSE) & \" - \" & B924","v":"Renewable Energies - TJ_NCV"},2024]
["COAL","KT",null,"TOTSER",null,null,null,"Solid Fossil Fuels",{"$f":"VLOOKUP(D925, Param_Multilanguage!A:C, MATCH(LanguageChosen,Language[Language],0)+1, FALSE)","v":"Services total"},{"$f":"VLOOKUP(H925,LanguageData,MATCH(LanguageChosen,Language[Language],0),FALSE) & \" - \" & B925","v":"Solid Fossil Fuels - KT"},2024]
["NONREN","TJ_NCV",null,"TOTSER",null,null,null,"Non Renewable Waste",{"$f":"VLOOKUP(D926, Param_Multilanguage!A:C, MATCH(LanguageChosen,Language[Language],0)+1, FALSE)","v":"Services total"},{"$f":"VLOOKUP(H926,LanguageData,MATCH(LanguageChosen,Language[Language],0),FALSE) & \" - \" & B926","v":"Non Renewable Waste - TJ_NCV"},2024]
["HYDROGEN","TJ_NCV",null,"TOTSER",null,null,null,"Hydrogen",{"$f":"VLOOKUP(D927, Param_Multilanguage!A:C, MATCH(LanguageChosen,Language[Language],0)+1, FALSE)","v":"Services total"},{"$f":"VLOOKUP(H927,LanguageData,MATCH(LanguageChosen,Language[Language],0),FALSE) & \" - \" & B927","v":"Hydrogen - TJ_NCV"},2024]

{"sheet":"Param_Sheets","index":30,"n_rows":22,"n_cols":14,"rows_kept":22,"cut":false,"hidden":true,"merged":[]}
["Name","Template_Sheet","Version","Datatype","Product","Item1","Item2","Time","Protect",null,null,null,"Refresh Formula","Name"]
["Table1","TemplateTable1",null,"FINCONS","Template","Template","Template",{"$f":"PeriodSelected","v":2022},1,null,null,null,null,"Table1"]
["Calorific_values","TemplateCalorific_values",null,"FINCONS","Template","CALOR","KT","Template",1]
["Time_series_TOT","Template_TS","TOT","FINCONS","Template","Template","TJ","Template",1]
["Time_series_ELECTR","Template_TS","ELECTR","FINCONS","Template","Template","GWH","Template",1]
["Time_series_NATGAS","Template_TS","NATGAS","FINCONS","Template","Template","TJ_GCV","Template",1]
["Time_series_HEAT","Template_TS","HEAT","FINCONS","Template","Template","TJ_NCV","Template",1]
["Time_series_TOTALOIL","Template_TS","TOTALOIL","FINCONS","Template","Template","KT","Template",1]
["Time_series_LPG","Template_TS","LPG","FINCONS","Template","Template","KT","Template",1]
["Time_series_GASDIES","Template_TS","GASDIES","FINCONS","Template","Template","KT","Template",1]
["Time_series_REN","Template_TS","REN","FINCONS","Template","Template","TJ_NCV","Template",1]
["Time_series_SOLARTH","Template_TS","SOLARTH","FINCONS","Template","Template","TJ_NCV","Template",1]
["Time_series_PRIMSBIO","Template_TS","PRIMSBIO","FINCONS","Template","Template","TJ_NCV","Template",1]
["Time_series_BIOGASES","Template_TS","BIOGASES","FINCONS","Template","Template","TJ_NCV","Template",1]
["Time_series_GEOTHERM","Template_TS","GEOTHERM","FINCONS","Template","Template","TJ_NCV","Template",1]
["Time_series_HEATPUMP","Template_TS","HEATPUMP","FINCONS","Template","Template","TJ_NCV","Template",1]
["Time_series_COAL","Template_TS","COAL","FINCONS","Template","Template","KT","Template",1]
["Time_series_NONREN","Template_TS","NONREN","FINCONS","Template","Template","TJ_NCV","Template",1]
["Time_series_HYDROGEN","Template_TS","HYDROGEN","FINCONS","Template","Template","TJ_NCV","Template",1]
["REMARKS","TemplateRemarks",null,"REMARKS",null,"Template",null,{"$f":"PeriodSelected","v":2022},2]
["REMARKSTS","TemplateRemarksTS",null,"REMARKS",null,"Template",null,"Template",2]
["GRAPH","TemplateGraph",null,"FINCONS","Template","Template","Template","Template",3]

{"sheet":"Param_Sheets_Templates","index":31,"n_rows":6,"n_cols":7,"rows_kept":6,"cut":false,"hidden":true,"merged":[]}
["Name","TemplateTable1","Template_TS","TemplateCalorific_values","TemplateRemarks","TemplateRemarksTS","TemplateGraph"]
["Format","OneYear","TimeSeries","TimeSeries","OneYear","TimeSeries","TimeSeries"]
["VersionRow",null,4]
["VersionCol",null,2]
["HideCol","A:L","A:K","A:J","A:C","A:C","A:L"]
["HideRow","2:10","2:9","2:7","4:7","4:5","100:1000"]

{"sheet":"Param_Tables","index":32,"n_rows":22,"n_cols":9,"rows_kept":22,"cut":false,"hidden":true,"merged":[]}
["Name","SheetName","Template","Version","Datatype","Product","Item1","Item2","Time"]
["Calorific_values","Calorific_values","TemplateCalorific_values",null,"FINCONS","Template","CALOR","KT","Template"]
["Table1","Table1","TemplateTable1",null,"FINCONS","Template","Template","Template",{"$f":"PeriodSelected","v":2022}]
["Time_series_TOT","Time_series_TOT","Template_TS","TOT","FINCONS","Template","Template","TJ","Template"]
["Time_series_ELECTR","Time_series_ELECTR","Template_TS","ELECTR","FINCONS","Template","Template","GWH","Template"]
["Time_series_NATGAS","Time_series_NATGAS","Template_TS","NATGAS","FINCONS","Template","Template","TJ_GCV","Template"]
["Time_series_HEAT","Time_series_HEAT","Template_TS","HEAT","FINCONS","Template","Template","TJ_NCV","Template"]
["Time_series_TOTALOIL","Time_series_TOTALOIL","Template_TS","TOTALOIL","FINCONS","Template","Template","KT","Template"]
["Time_series_LPG","Time_series_LPG","Template_TS","LPG","FINCONS","Template","Template","KT","Template"]
["Time_series_GASDIES","Time_series_GASDIES","Template_TS","GASDIES","FINCONS","Template","Template","KT","Template"]
["Time_series_REN","Time_series_REN","Template_TS","REN","FINCONS","Template","Template","TJ_NCV","Template"]
["Time_series_SOLARTH","Time_series_SOLARTH","Template_TS","SOLARTH","FINCONS","Template","Template","TJ_NCV","Template"]
["Time_series_PRIMSBIO","Time_series_PRIMSBIO","Template_TS","PRIMSBIO","FINCONS","Template","Template","TJ_NCV","Template"]
["Time_series_BIOGASES","Time_series_BIOGASES","Template_TS","BIOGASES","FINCONS","Template","Template","TJ_NCV","Template"]
["Time_series_GEOTHERM","Time_series_GEOTHERM","Template_TS","GEOTHERM","FINCONS","Template","Template","TJ_NCV","Template"]
["Time_series_HEATPUMP","Time_series_HEATPUMP","Template_TS","HEATPUMP","FINCONS","Template","Template","TJ_NCV","Template"]
["Time_series_COAL","Time_series_COAL","Template_TS","COAL","FINCONS","Template","Template","KT","Template"]
["Time_series_NONREN","Time_series_NONREN","Template_TS","NONREN","FINCONS","Template","Template","TJ_NCV","Template"]
["Time_series_HYDROGEN","Time_series_HYDROGEN","Template_TS","HYDROGEN","FINCONS","Template","Template","TJ_NCV","Template"]
["REMARKS","REMARKS","TemplateRemarks",null,"REMARKS",null,"Template",null,{"$f":"PeriodSelected","v":2022}]
["REMARKSTS","REMARKSTS","TemplateRemarksTS",null,"REMARKS",null,"Template",null,"Template"]
["GRAPH","GRAPH","TemplateGraph",null,"FINCONS","Template","Template","Template","Template"]

{"sheet":"Param_Tables_Templates","index":33,"n_rows":45,"n_cols":7,"rows_kept":45,"cut":false,"hidden":true,"merged":[]}
["Name","TemplateTable1","Template_TS","TemplateCalorific_values","TemplateRemarks","TemplateRemarksTS","TemplateGraph"]
["SheetName","TemplateTable1","Template_TS","TemplateCalorific_values","TemplateRemarks","TemplateRemarksTS","TemplateGraph"]
["Format","OneYear","TimeSeries","TimeSeries","OneYear","TimeSeries","OneYear"]
["VersionRow",null,4]
["VersionCol",null,2]
["FirstRow",13,11,9,8,8,8]
["FirstCol",15,14,12,5,5,12]
["LastRow",139,137,12,35,35,927]
["LastCol",30,18,16,5,9,12]
["DataTypeRow",3,3,2,2,2,2]
["DataTypeCol",2,2,2,2,2,2]
["ProductRow",2,0,0,3,3,0]
["ProductCol",0,1,1,2,2,1]
["Item1Row",0,0,3,0,0,0]
["Item1Col",1,2,2,1,1,4]
["Item2Row",3,5,4,5,5,0]
["Item2Col",0,2,2,2,2,2]
["TimeRow",2,3,2,4,6,0]
["TimeCol",2,0,0,2,0,11]
["FormulaRow",4,4,3]
["FormulaCol",2,3,2,null,null,3]
["CheckCol1",3,4,3]
["CheckCol2",5,null,5]
["CheckCol3"]
["CheckRow",8,5]
["LabelCheckCol1",4,5,4]
["LabelCheckCol2",6,null,6]
["LabelCheckCol3"]
["LabelCheckRow",9,6]
["LockedRow",5,9,4,null,null,4]
["LockedCol",7,7,7,null,null,5]
["EmptyRow",6,7,5,null,null,5]
["EmptyCol",8,8,8,null,null,6]
["VoluntaryRow",7,8,6,null,null,6]
["VoluntaryCol",9,9,9,null,null,7]
["LabelRow",11,10,7,7,6,7]
["LabelCol",13,12,11,4,4,11]
["HideCol","A:L","A:K","A:J","A:C","A:C"]
["HideRow","2:10","2:9","2:7","4:7","4:5","2:6"]
["TableSourceCol",null,6]
["TableSourceRow"]
["NbDecimalRow",null,null,7]
["NbDecimalCol"]
["TypeRow",null,null,null,5,5]
["TypeCol"]