{"text_format":"1","workbook":"xlsx","n_sheets":10,"sheets":["COVER","REPORTING INSTRUCTIONS","REMARKS","TABLES-FORMS","COLUMN","PREFILLED-ANNUAL","LoadedData","PrefilledData","Parameter_mapping","Parameters"],"not_rendered":{"charts":0,"images":1,"macros":1,"external_links":1,"defined_names":24,"comments":0,"pivot_tables":0},"unopened":[],"bounds":{"document_bytes":16777216,"sheet_cells":100000,"rows_first":2000,"rows_last":500,"rows_between":2000,"halvings":0,"cell_chars":16384,"cell_head_chars":4096},"cells_cut":0,"cells_raw":0,"read":"whole","date_system":"1900"}

{"sheet":"COVER","index":0,"n_rows":81,"n_cols":6,"rows_kept":81,"cut":false,"hidden":false,"merged":[[7,0,7,19]]}
["MINI-QUESTIONNAIRE"]
["RENEWABLES & WASTES"]
[{"$f":"COLUMN!Q1","v":2020}]
[{"$f":"COLUMN!R1","v":"ZZZZ"}]
[]
["EDAMIS dataset:",null,null,null,null,"ENERGY_MINIREN_A"]
[]
["Please transmit to Eurostat by 31 May 2021."]
["This reporting template is operational if and only if Visual Basic macros are operational."]
["Please click the START button to make other sheets visible."]
["If the START button does not work, please enable execution of Visual Basic macros."]
[]
[]
[]
[]
{"$rows_left_out":67}
{"sheet":"REPORTING INSTRUCTIONS","index":1,"n_rows":35,"n_cols":2,"rows_kept":35,"cut":false,"hidden":true,"merged":[[9,0,9,8],[18,0,18,8]]}
["REPORTING INSTRUCTIONS"]
[]
["Data are automatically copied between sheets TABLE-FORM and COLUMN."]
["You can enter values or formulas. Please do not enter links to outside files."]
[]
["When completed, please transmit via EDAMIS to Eurostat: dataset ENERGY_MINIREN_A"]
[]
["Table 1: Mini commodity balances"]
["All definitions and instructions as for annual renewables & wastes questionnaire apply."]
["http://ec.europa.eu/eurostat/web/energy/methodology/annual"]
["Units and definitions correspond to annual energy questionanires."]
[]
["Table 2: Net maximum capacity at the end of the year"]
["All definitions and instructions as for annual renewables & wastes questionnaire apply."]
[]
{"$rows_left_out":21}
{"sheet":"REMARKS","index":2,"n_rows":1,"n_cols":1,"rows_kept":1,"cut":false,"hidden":true,"merged":[]}
["REMARKS:"]

{"sheet":"TABLES-FORMS","index":3,"n_rows":43,"n_cols":54,"rows_kept":43,"cut":false,"hidden":true,"merged":[[1,1,2,1]]}
[null,"Table 1: Mini commodity balances"]
[null,{"$f":"COLUMN!I1","v":2020},"TJ NCV","TJ NCV","TJ NCV","TJ NCV","TJ NCV","TJ NCV","kt","TJ NCV","kt","kt","kt","kt","TJ NCV"]
[null,null,"Geothermal energy","Solar thermal","Industrial waste (non-renewable)","Municipal waste (renewable)","Municipal waste (non-renewable)","Solid biofuels excluding charcoal","Charcoal","Biogases","Biogasoline","Bio jet kerosenes","Biodiesels","Other liquid biofuels","Ambient heat (heat pumps)"]
[null,"Indigenous production",0,0,0,0,0,0,0,0,0,0,0,0,0]
[null,"Total imports (Balance)",0,0,0,0,0,0,0,0,0,0,0,0]
[null,"Total exports (Balance)",0,0,0,0,0,0,0,0,0,0,0,0]
[null,"Stock changes (National territory)",0,0,0,0,0,0,0,0,0,0,0,0]
[null,"Inland consumption (Calculated)",{"$f":"C4+C5-C6+C7","v":0},0,0,0,0,0,0,0,0,0,0,0,0]
[null,"Statistical Difference",{"$f":"C8-C10","v":0},0,0,0,0,0,0,0,0,0,0,0,0]
[null,"Inland consumption (Observed)",{"$f":"C11+C13+C14+C15","v":0},0,0,0,0,0,0,0,0,0,0,0,0]
[null,"Transformation sector",0,0,0,0,0,0,0,0,0,0,0,0,0]
[null,"     of which for blending",null,null,null,null,null,null,null,0,0,0,0,0]
[null,"Energy sector",0,0,0,0,0,0,0,0,0,0,0,0,0]
[null,"Distribution losses",0,0,0,0,0,0,0,0,0,0,0,0]
[null,"Total final energy consumption",{"$f":"C16+C17+C18","v":0},0,0,0,0,0,0,0,0,0,0,0,{"$f":"O16+O17+O18","v":0}]
{"$rows_left_out":29}
{"sheet":"COLUMN","index":4,"n_rows":212,"n_cols":134,"rows_kept":212,"cut":false,"hidden":true,"merged":[]}
[null,null,null,"product_id_e","flow_id_e","product_id_i","flow_id_i",{"$f":"Q1-1&\" prefilled from annual data\"","v":"2019 prefilled from annual data"},{"$f":"Q1","v":2020},"STATUS","Growth rates\nto previous\nyear","Comment",null,null,null,{"$f":"LOOKUP(R1,COVER!A40:A81,COVER!C40:C81)","v":0},2020,"ZZZZ",{"$f":"LOOKUP(R1,COVER!A40:A81,COVER!B40:B81)","v":"ZZ"},null,null,null,null,null,null,null,null,null,null,null,null,null,null,null,null,null,null,null,null,null,null,null,null,null,null,null,null,null,null,null,null,null,null,null,null,null,null,null,null,null,null,null,null,null,null,null,null,null,null,null,null,null,null,null,null,null,null,null,null,null,null,null,null,null,null,null,null,null,null,null,null,null,null,null,null,null,null,null,null,null,null,null,null,null,null,null,null,null,null,null,null,null,null,null,null,null,null,null,null,"VALUE","OBS_STATUS","OBS_COMMENT","REF_AREA","ENERGY_PRODUCT","MAIN_FLOW","FLOW_BREAKDOWN","PLANT_TECH","PLANT_TYPE","STOCKS","INFRASTRUCTURE_IND","VIS_A_VIS_AREA","MEASURE_VALUE_TYPE","FACILITY_ID","UNIT_MEASURE"]
["TJ NCV","Geothermal energy","Indigenous production","5550","B_100100","GEOTHERM","INDPROD",0,0,"P",{"$f":"IF(ISERROR(I2/H2),\"\",(I2/H2)-1)","v":""},null,null,null,null,null,null,null,null,null,null,null,null,null,null,null,null,null,null,null,null,null,null,null,null,null,null,null,null,null,null,null,null,null,null,null,null,null,null,null,null,null,null,null,null,null,null,null,null,null,null,null,null,null,null,null,null,null,null,null,null,null,null,null,null,null,null,null,null,null,null,null,null,null,null,null,null,null,null,null,null,null,null,null,null,null,null,null,null,null,null,null,null,null,null,null,null,null,null,null,null,null,null,null,null,null,null,null,null,{"$f":"IF(J2=\"O\",\"NaN\",ROUND(I2,3))","v":0},{"$f":"IF(J2=\"\",\"A\",J2)","v":"P"},{"$f":"LEFT(TRIM(L2),255)","v":""},{"$f":"$S$1","v":"ZZ"},"RA200","PRODUCT","INDPROD","_Z","_Z","_Z","_Z","_Z","ENERGY","_Z","TJ_NCV"]
["TJ NCV","Geothermal energy","Total imports (Balance)","5550","B_100300","GEOTHERM","TOTIMPSB",0,0,"P","",null,null,null,null,null,null,null,null,null,null,null,null,null,null,null,null,null,null,null,null,null,null,null,null,null,null,null,null,null,null,null,null,null,null,null,null,null,null,null,null,null,null,null,null,null,null,null,null,null,null,null,null,null,null,null,null,null,null,null,null,null,null,null,null,null,null,null,null,null,null,null,null,null,null,null,null,null,null,null,null,null,null,null,null,null,null,null,null,null,null,null,null,null,null,null,null,null,null,null,null,null,null,null,null,null,null,null,null,{"$f":"IF(J3=\"O\",\"NaN\",ROUND(I3,3))","v":0},{"$f":"IF(J3=\"\",\"A\",J3)","v":"P"},{"$f":"LEFT(TRIM(L3),255)","v":""},"ZZ","RA200","IMPORTS","TOTIMPSB","_Z","_Z","_Z","_Z","_Z","ENERGY","_Z","TJ_NCV"]
["TJ NCV","Geothermal energy","Total exports (Balance)","5550","B_100500","GEOTHERM","TOTEXPSB",0,0,"P","",null,null,null,null,null,null,null,null,null,null,null,null,null,null,null,null,null,null,null,null,null,null,null,null,null,null,null,null,null,null,null,null,null,null,null,null,null,null,null,null,null,null,null,null,null,null,null,null,null,null,null,null,null,null,null,null,null,null,null,null,null,null,null,null,null,null,null,null,null,null,null,null,null,null,null,null,null,null,null,null,null,null,null,null,null,null,null,null,null,null,null,null,null,null,null,null,null,null,null,null,null,null,null,null,null,null,null,null,0,"P","","ZZ","RA200","EXPORTS","TOTEXPSB","_Z","_Z","_Z","_Z","_Z","ENERGY","_Z","TJ_NCV"]
["TJ NCV","Geothermal energy","Stock changes (National territory)","5550","B_100400","GEOTHERM","STCHANAT",0,0,"P",null,null,null,null,null,null,null,null,null,null,null,null,null,null,null,null,null,null,null,null,null,null,null,null,null,null,null,null,null,null,null,null,null,null,null,null,null,null,null,null,null,null,null,null,null,null,null,null,null,null,null,null,null,null,null,null,null,null,null,null,null,null,null,null,null,null,null,null,null,null,null,null,null,null,null,null,null,null,null,null,null,null,null,null,null,null,null,null,null,null,null,null,null,null,null,null,null,null,null,null,null,null,null,null,null,null,null,null,null,0,"P","","ZZ","RA200","STOCKS","STOCKCH","_Z","_Z","NATTER","_Z","_Z","ENERGY","_Z","TJ_NCV"]
["TJ NCV","Geothermal energy","Inland consumption (Calculated)",null,null,null,null,{"$f":"H2+H3-H4+H5","v":0},{"$f":"I2+I3-I4+I5","v":0},"P","",null,null,null,null,null,null,null,null,null,null,null,null,null,null,null,null,null,null,null,null,null,null,null,null,null,null,null,null,null,null,null,null,null,null,null,null,null,null,null,null,null,null,null,null,null,null,null,null,null,null,null,null,null,null,null,null,null,null,null,null,null,null,null,null,null,null,null,null,null,null,null,null,null,null,null,null,null,null,null,null,null,null,null,null,null,null,null,null,null,null,null,null,null,null,null,null,null,null,null,null,null,null,null,null,null,null,null,null,0,"P","","ZZ","RA200","SUPPLY","INLDEMC","_Z","_Z","_Z","_Z","_Z","ENERGY","_Z","TJ_NCV"]
["TJ NCV","Geothermal energy","Statistical Difference",null,null,null,null,{"$f":"H6-H8","v":0},{"$f":"I6-I8","v":0},"P",null,null,null,null,null,null,null,null,null,null,null,null,null,null,null,null,null,null,null,null,null,null,null,null,null,null,null,null,null,null,null,null,null,null,null,null,null,null,null,null,null,null,null,null,null,null,null,null,null,null,null,null,null,null,null,null,null,null,null,null,null,null,null,null,null,null,null,null,null,null,null,null,null,null,null,null,null,null,null,null,null,null,null,null,null,null,null,null,null,null,null,null,null,null,null,null,null,null,null,null,null,null,null,null,null,null,null,null,null,0,"P","","ZZ","RA200","STATDIFF","_Z","_Z","_Z","_Z","_Z","_Z","ENERGY","_Z","TJ_NCV"]
["TJ NCV","Geothermal energy","Inland consumption (Observed)",null,null,"GEOTHERM",null,{"$f":"H9+H11+H12+H13","v":0},{"$f":"I9+I11+I12+I13","v":0},"P","",null,null,null,null,null,null,null,null,null,null,null,null,null,null,null,null,null,null,null,null,null,null,null,null,null,null,null,null,null,null,null,null,null,null,null,null,null,null,null,null,null,null,null,null,null,null,null,null,null,null,null,null,null,null,null,null,null,null,null,null,null,null,null,null,null,null,null,null,null,null,null,null,null,null,null,null,null,null,null,null,null,null,null,null,null,null,null,null,null,null,null,null,null,null,null,null,null,null,null,null,null,null,null,null,null,null,null,null,0,"P","","ZZ","RA200","DEMAND","INLDEMO","_Z","_Z","_Z","_Z","_Z","ENERGY","_Z","TJ_NCV"]
["TJ NCV","Geothermal energy","Transformation sector","5550","DB_101000","GEOTHERM","TOTTRANF",0,0,"P","",null,null,null,null,null,null,null,null,null,null,null,null,null,null,null,null,null,null,null,null,null,null,null,null,null,null,null,null,null,null,null,null,null,null,null,null,null,null,null,null,null,null,null,null,null,null,null,null,null,null,null,null,null,null,null,null,null,null,null,null,null,null,null,null,null,null,null,null,null,null,null,null,null,null,null,null,null,null,null,null,null,null,null,null,null,null,null,null,null,null,null,null,null,null,null,null,null,null,null,null,null,null,null,null,null,null,null,null,0,"P","","ZZ","RA200","TRANSFOR","TOTRANSF","_Z","_Z","_Z","_Z","_Z","ENERGY","_Z","TJ_NCV"]
["TJ NCV","Geothermal energy","     of which for blending",null,null,null,null,null,null,"P",null,null,null,null,null,null,null,null,null,null,null,null,null,null,null,null,null,null,null,null,null,null,null,null,null,null,null,null,null,null,null,null,null,null,null,null,null,null,null,null,null,null,null,null,null,null,null,null,null,null,null,null,null,null,null,null,null,null,null,null,null,null,null,null,null,null,null,null,null,null,null,null,null,null,null,null,null,null,null,null,null,null,null,null,null,null,null,null,null,null,null,null,null,null,null,null,null,null,null,null,null,null,null,null,null,null,null,null,null,0,"P","","ZZ","RA200",null,null,null,null,null,null,null,"ENERGY","_Z","TJ_NCV"]
["TJ NCV","Geothermal energy","Energy sector","5550","DB_101300","GEOTHERM","TOTENGY",0,0,"P","",null,null,null,null,null,null,null,null,null,null,null,null,null,null,null,null,null,null,null,null,null,null,null,null,null,null,null,null,null,null,null,null,null,null,null,null,null,null,null,null,null,null,null,null,null,null,null,null,null,null,null,null,null,null,null,null,null,null,null,null,null,null,null,null,null,null,null,null,null,null,null,null,null,null,null,null,null,null,null,null,null,null,null,null,null,null,null,null,null,null,null,null,null,null,null,null,null,null,null,null,null,null,null,null,null,null,null,null,0,"P","","ZZ","RA200","ENERGUSE","ENERSECT","_Z","_Z","_Z","_Z","_Z","ENERGY","_Z","TJ_NCV"]
["TJ NCV","Geothermal energy","Distribution losses","5550","B_101400","GEOTHERM","DISTLOSS",0,0,"P","",null,null,null,null,null,null,null,null,null,null,null,null,null,null,null,null,null,null,null,null,null,null,null,null,null,null,null,null,null,null,null,null,null,null,null,null,null,null,null,null,null,null,null,null,null,null,null,null,null,null,null,null,null,null,null,null,null,null,null,null,null,null,null,null,null,null,null,null,null,null,null,null,null,null,null,null,null,null,null,null,null,null,null,null,null,null,null,null,null,null,null,null,null,null,null,null,null,null,null,null,null,null,null,null,null,null,null,null,0,"P","","ZZ","RA200","LOSSES","DISTLOSS","_Z","_Z","_Z","_Z","_Z","ENERGY","_Z","TJ_NCV"]
["TJ NCV","Geothermal energy","Total final energy consumption",null,null,null,null,{"$f":"H14+H15+H16","v":0},{"$f":"I14+I15+I16","v":0},"P","",null,null,null,null,null,null,null,null,null,null,null,null,null,null,null,null,null,null,null,null,null,null,null,null,null,null,null,null,null,null,null,null,null,null,null,null,null,null,null,null,null,null,null,null,null,null,null,null,null,null,null,null,null,null,null,null,null,null,null,null,null,null,null,null,null,null,null,null,null,null,null,null,null,null,null,null,null,null,null,null,null,null,null,null,null,null,null,null,null,null,null,null,null,null,null,null,null,null,null,null,null,null,null,null,null,null,null,null,0,"P","","ZZ","RA200","ENERGUSE","FINCONS","_Z","_Z","_Z","_Z","_Z","ENERGY","_Z","TJ_NCV"]
["TJ NCV","Geothermal energy","Industry sector","5550","DB_101800","GEOTHERM","TOTIND",0,0,"P","",null,null,null,null,null,null,null,null,null,null,null,null,null,null,null,null,null,null,null,null,null,null,null,null,null,null,null,null,null,null,null,null,null,null,null,null,null,null,null,null,null,null,null,null,null,null,null,null,null,null,null,null,null,null,null,null,null,null,null,null,null,null,null,null,null,null,null,null,null,null,null,null,null,null,null,null,null,null,null,null,null,null,null,null,null,null,null,null,null,null,null,null,null,null,null,null,null,null,null,null,null,null,null,null,null,null,null,null,0,"P","","ZZ","RA200","ENERGUSE","INDUSTRY","_Z","_Z","_Z","_Z","_Z","ENERGY","_Z","TJ_NCV"]
["TJ NCV","Geothermal energy","Transport sector","5550","B_101900","GEOTHERM","TOTTRANS",0,0,"P","",null,null,null,null,null,null,null,null,null,null,null,null,null,null,null,null,null,null,null,null,null,null,null,null,null,null,null,null,null,null,null,null,null,null,null,null,null,null,null,null,null,null,null,null,null,null,null,null,null,null,null,null,null,null,null,null,null,null,null,null,null,null,null,null,null,null,null,null,null,null,null,null,null,null,null,null,null,null,null,null,null,null,null,null,null,null,null,null,null,null,null,null,null,null,null,null,null,null,null,null,null,null,null,null,null,null,null,null,0,"P","","ZZ","RA200","ENERGUSE","TRANSPOR","_Z","_Z","_Z","_Z","_Z","ENERGY","_Z","TJ_NCV"]
{"$rows_left_out":198}
{"sheet":"PREFILLED-ANNUAL","index":5,"n_rows":54,"n_cols":15,"rows_kept":54,"cut":false,"hidden":true,"merged":[]}
[]
[null,null,"TJ NCV","TJ NCV","TJ NCV","TJ NCV","TJ NCV","TJ NCV","kt","TJ NCV","kt","kt","kt","kt","TJ NCV"]
[null,{"$f":"COLUMN!Q1-1","v":2019},"Geothermal energy","Solar thermal","Industrial waste (non-renewable)","Municipal waste (renewable)","Municipal waste (non-renewable)","Solid biofuels excluding charcoal","Charcoal","Biogases","Biogasoline","Bio jet kerosenes","Biodiesels","Other liquid biofuels","Ambient heat (heat pumps)"]
[null,"Indigenous production",{"$f":"COLUMN!H2","v":0},{"$f":"COLUMN!H17","v":0},{"$f":"COLUMN!H32","v":0},{"$f":"COLUMN!H47","v":0},{"$f":"COLUMN!H62","v":0},{"$f":"COLUMN!H77","v":0},{"$f":"COLUMN!H92","v":0},{"$f":"COLUMN!H107","v":0},{"$f":"COLUMN!H122","v":0},{"$f":"COLUMN!H137","v":0},{"$f":"COLUMN!H152","v":0},{"$f":"COLUMN!H167","v":0},{"$f":"COLUMN!H182","v":0}]
[null,"Total imports (Balance)",{"$f":"COLUMN!H3","v":0},{"$f":"COLUMN!H18","v":0},{"$f":"COLUMN!H33","v":0},{"$f":"COLUMN!H48","v":0},{"$f":"COLUMN!H63","v":0},{"$f":"COLUMN!H78","v":0},{"$f":"COLUMN!H93","v":0},{"$f":"COLUMN!H108","v":0},{"$f":"COLUMN!H123","v":0},{"$f":"COLUMN!H138","v":0},{"$f":"COLUMN!H153","v":0},{"$f":"COLUMN!H168","v":0},{"$f":"COLUMN!H183","v":0}]
[null,"Total exports (Balance)",{"$f":"COLUMN!H4","v":0},{"$f":"COLUMN!H19","v":0},{"$f":"COLUMN!H34","v":0},{"$f":"COLUMN!H49","v":0},{"$f":"COLUMN!H64","v":0},{"$f":"COLUMN!H79","v":0},{"$f":"COLUMN!H94","v":0},{"$f":"COLUMN!H109","v":0},{"$f":"COLUMN!H124","v":0},{"$f":"COLUMN!H139","v":0},{"$f":"COLUMN!H154","v":0},{"$f":"COLUMN!H169","v":0},{"$f":"COLUMN!H184","v":0}]
[null,"Stock changes (National territory)",{"$f":"COLUMN!H5","v":0},{"$f":"COLUMN!H20","v":0},{"$f":"COLUMN!H35","v":0},{"$f":"COLUMN!H50","v":0},{"$f":"COLUMN!H65","v":0},{"$f":"COLUMN!H80","v":0},{"$f":"COLUMN!H95","v":0},{"$f":"COLUMN!H110","v":0},{"$f":"COLUMN!H125","v":0},{"$f":"COLUMN!H140","v":0},{"$f":"COLUMN!H155","v":0},{"$f":"COLUMN!H170","v":0},{"$f":"COLUMN!H185","v":0}]
[null,"Inland consumption (Calculated)",{"$f":"COLUMN!H6","v":0},{"$f":"COLUMN!H21","v":0},{"$f":"COLUMN!H36","v":0},{"$f":"COLUMN!H51","v":0},{"$f":"COLUMN!H66","v":0},{"$f":"COLUMN!H81","v":0},{"$f":"COLUMN!H96","v":0},{"$f":"COLUMN!H111","v":0},{"$f":"COLUMN!H126","v":0},{"$f":"COLUMN!H141","v":0},{"$f":"COLUMN!H156","v":0},{"$f":"COLUMN!H171","v":0},{"$f":"COLUMN!H186","v":0}]
[null,"Statistical Difference",{"$f":"COLUMN!H7","v":0},{"$f":"COLUMN!H22","v":0},{"$f":"COLUMN!H37","v":0},{"$f":"COLUMN!H52","v":0},{"$f":"COLUMN!H67","v":0},{"$f":"COLUMN!H82","v":0},{"$f":"COLUMN!H97","v":0},{"$f":"COLUMN!H112","v":0},{"$f":"COLUMN!H127","v":0},{"$f":"COLUMN!H142","v":0},{"$f":"COLUMN!H157","v":0},{"$f":"COLUMN!H172","v":0},{"$f":"COLUMN!H187","v":0}]
[null,"Inland consumption (Observed)",{"$f":"COLUMN!H8","v":0},{"$f":"COLUMN!H23","v":0},{"$f":"COLUMN!H38","v":0},{"$f":"COLUMN!H53","v":0},{"$f":"COLUMN!H68","v":0},{"$f":"COLUMN!H83","v":0},{"$f":"COLUMN!H98","v":0},{"$f":"COLUMN!H113","v":0},{"$f":"COLUMN!H128","v":0},{"$f":"COLUMN!H143","v":0},{"$f":"COLUMN!H158","v":0},{"$f":"COLUMN!H173","v":0},{"$f":"COLUMN!H188","v":0}]
[null,"Transformation sector",{"$f":"COLUMN!H9","v":0},{"$f":"COLUMN!H24","v":0},{"$f":"COLUMN!H39","v":0},{"$f":"COLUMN!H54","v":0},{"$f":"COLUMN!H69","v":0},{"$f":"COLUMN!H84","v":0},{"$f":"COLUMN!H99","v":0},{"$f":"COLUMN!H114","v":0},{"$f":"COLUMN!H129","v":0},{"$f":"COLUMN!H144","v":0},{"$f":"COLUMN!H159","v":0},{"$f":"COLUMN!H174","v":0},{"$f":"COLUMN!H189","v":0}]
[null,"     of which for blending",{"$f":"COLUMN!H10","v":0},{"$f":"COLUMN!H25","v":0},{"$f":"COLUMN!H40","v":0},{"$f":"COLUMN!H55","v":0},{"$f":"COLUMN!H70","v":0},{"$f":"COLUMN!H85","v":0},{"$f":"COLUMN!H100","v":0},{"$f":"COLUMN!H115","v":0},{"$f":"COLUMN!H130","v":0},{"$f":"COLUMN!H145","v":0},{"$f":"COLUMN!H160","v":0},{"$f":"COLUMN!H175","v":0},{"$f":"COLUMN!H190","v":0}]
[null,"Energy sector",{"$f":"COLUMN!H11","v":0},{"$f":"COLUMN!H26","v":0},{"$f":"COLUMN!H41","v":0},{"$f":"COLUMN!H56","v":0},{"$f":"COLUMN!H71","v":0},{"$f":"COLUMN!H86","v":0},{"$f":"COLUMN!H101","v":0},{"$f":"COLUMN!H116","v":0},{"$f":"COLUMN!H131","v":0},{"$f":"COLUMN!H146","v":0},{"$f":"COLUMN!H161","v":0},{"$f":"COLUMN!H176","v":0},{"$f":"COLUMN!H191","v":0}]
[null,"Distribution losses",{"$f":"COLUMN!H12","v":0},{"$f":"COLUMN!H27","v":0},{"$f":"COLUMN!H42","v":0},{"$f":"COLUMN!H57","v":0},{"$f":"COLUMN!H72","v":0},{"$f":"COLUMN!H87","v":0},{"$f":"COLUMN!H102","v":0},{"$f":"COLUMN!H117","v":0},{"$f":"COLUMN!H132","v":0},{"$f":"COLUMN!H147","v":0},{"$f":"COLUMN!H162","v":0},{"$f":"COLUMN!H177","v":0},{"$f":"COLUMN!H192","v":0}]
[null,"Total final energy consumption",{"$f":"COLUMN!H13","v":0},{"$f":"COLUMN!H28","v":0},{"$f":"COLUMN!H43","v":0},{"$f":"COLUMN!H58","v":0},{"$f":"COLUMN!H73","v":0},{"$f":"COLUMN!H88","v":0},{"$f":"COLUMN!H103","v":0},{"$f":"COLUMN!H118","v":0},{"$f":"COLUMN!H133","v":0},{"$f":"COLUMN!H148","v":0},{"$f":"COLUMN!H163","v":0},{"$f":"COLUMN!H178","v":0},{"$f":"COLUMN!H193","v":0}]
{"$rows_left_out":40}
{"sheet":"LoadedData","index":6,"n_rows":199,"n_cols":44,"rows_kept":199,"cut":false,"hidden":true,"merged":[]}
[]
[null,null,null,null,null,null,null,null,null,null,null,null,null,null,null,null,null,null,null,"Geothermal energy","Indigenous production",{"$f":"H211","v":0}]
[null,null,null,null,null,null,null,null,null,{"$f":"SUM(G195:AR199)","v":82},"number of errors",null,null,null,null,null,null,null,null,"Geothermal energy","Total imports (Balance)",{"$f":"H212","v":0}]
[null,null,null,null,null,null,null,null,null,null,null,null,null,null,null,null,null,null,null,"Geothermal energy","Total exports (Balance)",{"$f":"H213","v":0}]
[null,null,null,null,null,null,null,null,null,null,null,null,null,null,null,null,null,null,null,"Geothermal energy","Stock changes (National territory)",{"$f":"H214","v":0}]
[null,null,null,null,null,null,null,null,null,null,null,null,null,null,null,null,null,null,null,"Geothermal energy","Inland consumption (Calculated)"]
[null,null,null,null,null,null,null,null,null,null,null,null,null,null,null,null,null,null,null,"Geothermal energy","Statistical Difference"]
[null,null,null,null,null,null,null,null,null,null,null,null,null,null,null,null,null,null,null,"Geothermal energy","Inland consumption (Observed)"]
[null,null,null,null,null,null,null,null,null,null,null,null,null,null,null,null,null,null,null,"Geothermal energy","Transformation sector",{"$f":"H217","v":0}]
[null,null,null,null,null,null,null,null,null,null,null,null,null,null,null,null,null,null,null,"Geothermal energy","     of which for blending"]
[null,null,null,null,null,null,null,null,null,null,null,null,null,null,null,null,null,null,null,"Geothermal energy","Energy sector",{"$f":"H221","v":0}]
[null,null,null,null,null,null,null,null,null,null,null,null,null,null,null,null,null,null,null,"Geothermal energy","Distribution losses",{"$f":"H222","v":0}]
[null,null,null,null,null,null,null,null,null,null,null,null,null,null,null,null,null,null,null,"Geothermal energy","Total final energy consumption",{"$f":"H224","v":0}]
[null,null,null,null,null,null,null,null,null,null,null,null,null,null,null,null,null,null,null,"Geothermal energy","Industry sector",{"$f":"H225","v":0}]
[null,null,null,null,null,null,null,null,null,null,null,null,null,null,null,null,null,null,null,"Geothermal energy","Transport sector",{"$f":"H226","v":0}]
{"$rows_left_out":185}
{"sheet":"PrefilledData","index":7,"n_rows":210,"n_cols":20,"rows_kept":210,"cut":false,"hidden":true,"merged":[]}
[]
[]
[]
[null,null,null,null,null,null,null,null,null,null,null,null,null,null,null,null,null,null,null,"Prefilled from annual data (previous year)"]
[null,null,null,null,null,null,null,null,null,null,null,null,null,null,null,null,"TJ NCV","Geothermal energy","Indigenous production",{"$f":"C17","v":0}]
[null,null,null,null,null,null,null,null,null,null,null,null,null,null,null,null,"TJ NCV","Geothermal energy","Total imports (Balance)",{"$f":"C18","v":0}]
[null,null,null,null,null,null,null,null,null,null,null,null,null,null,null,null,"TJ NCV","Geothermal energy","Total exports (Balance)",{"$f":"C19","v":0}]
[null,null,null,null,null,null,null,null,null,null,null,null,null,null,null,null,"TJ NCV","Geothermal energy","Stock changes (National territory)",{"$f":"C20","v":0}]
[null,null,null,null,null,null,null,null,null,null,null,null,null,null,null,null,"TJ NCV","Geothermal energy","Inland consumption (Calculated)"]
[null,null,null,null,null,null,null,null,null,null,null,null,null,null,null,null,"TJ NCV","Geothermal energy","Statistical Difference"]
[null,null,null,null,null,null,null,null,null,null,null,null,null,null,null,null,"TJ NCV","Geothermal energy","Inland consumption (Observed)"]
[null,null,null,null,null,null,null,null,null,null,null,null,null,null,null,null,"TJ NCV","Geothermal energy","Transformation sector",{"$f":"C21","v":0}]
[null,null,null,null,null,null,null,null,null,null,null,null,null,null,null,null,"TJ NCV","Geothermal energy","     of which for blending"]
[null,null,null,null,null,null,null,null,null,null,null,null,null,null,null,null,"TJ NCV","Geothermal energy","Energy sector",{"$f":"C24","v":0}]
[null,null,null,null,null,null,null,null,null,null,null,null,null,null,null,null,"TJ NCV","Geothermal energy","Distribution losses",{"$f":"C25","v":0}]
{"$rows_left_out":196}
{"sheet":"Parameter_mapping","index":8,"n_rows":2,"n_cols":2,"rows_kept":2,"cut":false,"hidden":true,"merged":[]}
["Data sheet","Parameter sheet"]
["COLUMN","Parameters"]

{"sheet":"Parameters","index":9,"n_rows":21,"n_cols":7,"rows_kept":21,"cut":false,"hidden":true,"merged":[]}
["Element","Type","PosType","Position",null,"DataStart","DP2"]
["QUEST_SOURCE","DIM","FIX","A_MINIREN",null,"DataEnd","DP213"]
["FREQ","DIM","FIX","A",null,"SkipIncompleteKeys","true"]
["REF_AREA","DIM","COLUMN","DS"]
["ENERGY_PRODUCT","DIM","COLUMN","DT"]
["MAIN_FLOW","DIM","COLUMN","DU"]
["FLOW_BREAKDOWN","DIM","COLUMN","DV"]
["PLANT_TECH","DIM","COLUMN","DW"]
["PLANT_TYPE","DIM","COLUMN","DX"]
["STOCKS","DIM","COLUMN","DY"]
["INFRASTRUCTURE_IND","DIM","COLUMN","DZ"]
["VIS_A_VIS_AREA","DIM","COLUMN","EA"]
["MEASURE_VALUE_TYPE","DIM","COLUMN","EB"]
["TIME_PERIOD","DIM","CELL","I1"]
["FACILITY_ID","DIM","COLUMN","EC"]
{"$rows_left_out":6}