{"text_format":"1","workbook":"xlsx","n_sheets":9,"sheets":["COVER","REPORTING INSTRUCTIONS","REMARKS","ELECTRICITY","HEAT","LoadedData","PrefilledData","Parameter_mapping","Parameters"],"not_rendered":{"charts":0,"images":1,"macros":1,"external_links":0,"defined_names":20,"comments":0,"pivot_tables":0},"unopened":[],"bounds":{"document_bytes":16777216,"sheet_cells":100000,"rows_first":2000,"rows_last":500,"rows_between":2000,"halvings":0,"cell_chars":16384,"cell_head_chars":4096},"cells_cut":0,"cells_raw":0,"read":"whole","date_system":"1900"}

{"sheet":"COVER","index":0,"n_rows":81,"n_cols":6,"rows_kept":81,"cut":false,"hidden":false,"merged":[[7,0,7,19]]}
["MINI-QUESTIONNAIRE"]
["ELECTRICITY & HEAT"]
[{"$f":"ELECTRICITY!Q1","v":2020}]
[{"$f":"ELECTRICITY!R1","v":"ZZZZ"}]
[]
["EDAMIS dataset:",null,null,null,null,"ENERGY_MINIELE_A"]
[]
["Please transmit to Eurostat by 31 May 2021."]
["This reporting template is operational if and only if Visual Basic macros are operational."]
["Please click the START button to make other sheets visible."]
{"$rows_left_out":72}
{"sheet":"REPORTING INSTRUCTIONS","index":1,"n_rows":27,"n_cols":2,"rows_kept":27,"cut":false,"hidden":true,"merged":[[7,0,7,8]]}
["REPORTING INSTRUCTIONS"]
[]
["You can enter values or formulas. Please do not enter links to outside files."]
[]
["When completed, please transmit via EDAMIS to Eurostat: dataset ENERGY_MINIELE_A"]
[]
["All definitions and instructions as for annual electricity and heat questionnaire apply."]
["http://ec.europa.eu/eurostat/web/energy/methodology/annual"]
["Specifically for the energy sector:"]
["Under Own use please report own use of generating units in power plants, chp plants and district heating plants."]
{"$rows_left_out":18}
{"sheet":"REMARKS","index":2,"n_rows":1,"n_cols":1,"rows_kept":1,"cut":false,"hidden":true,"merged":[]}
["REMARKS:"]

{"sheet":"ELECTRICITY","index":3,"n_rows":74,"n_cols":134,"rows_kept":74,"cut":false,"hidden":true,"merged":[]}
[null,null,"Electricity: GWh\nGROSS PRODUCTION","product_id_e","flow_id_e","product_id_i","flow_id_i",{"$f":"Q1-1&\" prefilled from annual data\"","v":"2019 prefilled from annual data"},{"$f":"Q1","v":2020},"STATUS","Growth rates\nto previous\nyear","Observation Comment",null,null,null,{"$f":"LOOKUP(R1,COVER!A40:A81,COVER!C40:C81)","v":0},2020,"ZZZZ",{"$f":"LOOKUP(R1,COVER!A40:A81,COVER!B40:B81)","v":"ZZ"},null,null,null,null,null,null,null,null,null,null,null,null,null,null,null,null,null,null,null,null,null,null,null,null,null,null,null,null,null,null,null,null,null,null,null,null,null,null,null,null,null,null,null,null,null,null,null,null,null,null,null,null,null,null,null,null,null,null,null,null,null,null,null,null,null,null,null,null,null,null,null,null,null,null,null,null,null,null,null,null,null,null,null,null,null,null,null,null,null,null,null,null,null,null,null,null,null,null,null,null,"VALUE","OBS_STATUS","OBS_COMMENT","REF_AREA","ENERGY_PRODUCT","MAIN_FLOW","FLOW_BREAKDOWN","PLANT_TECH","PLANT_TYPE","STOCKS","INFRASTRUCTURE_IND","VIS_A_VIS_AREA","MEASURE_VALUE_TYPE","FACILITY_ID","UNIT_MEASURE"]
["GWh","Electricity","Nuclear","6000",null,"GELEPROD","NUCLEAR",{"$f":"PrefilledData!B73","v":0},0,"P",{"$f":"IF(ISERROR(I2/H2),\"\",(I2/H2)-1)","v":""},null,null,null,null,null,null,null,null,null,null,null,null,null,null,null,null,null,null,null,null,null,null,null,null,null,null,null,null,null,null,null,null,null,null,null,null,null,null,null,null,null,null,null,null,null,null,null,null,null,null,null,null,null,null,null,null,null,null,null,null,null,null,null,null,null,null,null,null,null,null,null,null,null,null,null,null,null,null,null,null,null,null,null,null,null,null,null,null,null,null,null,null,null,null,null,null,null,null,null,null,null,null,null,null,null,null,null,null,{"$f":"IF(J2=\"O\",\"NaN\",ROUND(I2,3))","v":0},{"$f":"IF(J2=\"\",\"A\",J2)","v":"P"},{"$f":"LEFT(TRIM(L2),255)","v":""},{"$f":"$S$1","v":"ZZ"},"E7000","GROSPROD","_Z","NUCLEAR","_T","_Z","_Z","_Z","ENERGY","_Z","GWH"]
["GWh","Electricity","Hydro","6000",null,"GELEPROD","HYDRO",{"$f":"H4+H5+H7","v":0},{"$f":"I4+I5+I7","v":0},"P","",null,null,null,null,null,null,null,null,null,null,null,null,null,null,null,null,null,null,null,null,null,null,null,null,null,null,null,null,null,null,null,null,null,null,null,null,null,null,null,null,null,null,null,null,null,null,null,null,null,null,null,null,null,null,null,null,null,null,null,null,null,null,null,null,null,null,null,null,null,null,null,null,null,null,null,null,null,null,null,null,null,null,null,null,null,null,null,null,null,null,null,null,null,null,null,null,null,null,null,null,null,null,null,null,null,null,null,null,{"$f":"IF(J3=\"O\",\"NaN\",ROUND(I3,3))","v":0},{"$f":"IF(J3=\"\",\"A\",J3)","v":"P"},{"$f":"LEFT(TRIM(L3),255)","v":""},"ZZ","E7000","GROSPROD","_Z","HYDRO","_T","_Z","_Z","_Z","ENERGY","_Z","GWH"]
["GWh","Electricity","     Pure hydro","6000",null,"GELEPROD",null,{"$f":"PrefilledData!B152+PrefilledData!B157","v":0},0,"P","",null,null,null,null,null,null,null,null,null,null,null,null,null,null,null,null,null,null,null,null,null,null,null,null,null,null,null,null,null,null,null,null,null,null,null,null,null,null,null,null,null,null,null,null,null,null,null,null,null,null,null,null,null,null,null,null,null,null,null,null,null,null,null,null,null,null,null,null,null,null,null,null,null,null,null,null,null,null,null,null,null,null,null,null,null,null,null,null,null,null,null,null,null,null,null,null,null,null,null,null,null,null,null,null,null,null,null,null,0,"P","","ZZ","E7000","GROSPROD","_Z","HYDPUR","_T","_Z","_Z","_Z","ENERGY","_Z","GWH"]
["GWh","Electricity","     Mixed hydro","6000",null,"GELEPROD",null,{"$f":"PrefilledData!B153+PrefilledData!B158","v":0},0,"P","",null,null,null,null,null,null,null,null,null,null,null,null,null,null,null,null,null,null,null,null,null,null,null,null,null,null,null,null,null,null,null,null,null,null,null,null,null,null,null,null,null,null,null,null,null,null,null,null,null,null,null,null,null,null,null,null,null,null,null,null,null,null,null,null,null,null,null,null,null,null,null,null,null,null,null,null,null,null,null,null,null,null,null,null,null,null,null,null,null,null,null,null,null,null,null,null,null,null,null,null,null,null,null,null,null,null,null,null,0,"P","","ZZ","E7000","GROSPROD","_Z","HYDMIX","_T","_Z","_Z","_Z","ENERGY","_Z","GWH"]
["GWh","Electricity","          of which:  pumping",null,null,null,null,{"$f":"H5-PrefilledData!B148","v":0},0,"P","",null,null,null,null,null,null,null,null,null,null,null,null,null,null,null,null,null,null,null,null,null,null,null,null,null,null,null,null,null,null,null,null,null,null,null,null,null,null,null,null,null,null,null,null,null,null,null,null,null,null,null,null,null,null,null,null,null,null,null,null,null,null,null,null,null,null,null,null,null,null,null,null,null,null,null,null,null,null,null,null,null,null,null,null,null,null,null,null,null,null,null,null,null,null,null,null,null,null,null,null,null,null,null,null,null,null,null,null,0,"P","","ZZ","E7000","GROSPROD","_Z","HYDPUMP","_T","_Z","_Z","_Z","ENERGY","_Z","GWH"]
["GWh","Electricity","     Pure pumped storage","6000",null,"GELEPROD",null,{"$f":"PrefilledData!B154+PrefilledData!B159","v":0},0,"P","",null,null,null,null,null,null,null,null,null,null,null,null,null,null,null,null,null,null,null,null,null,null,null,null,null,null,null,null,null,null,null,null,null,null,null,null,null,null,null,null,null,null,null,null,null,null,null,null,null,null,null,null,null,null,null,null,null,null,null,null,null,null,null,null,null,null,null,null,null,null,null,null,null,null,null,null,null,null,null,null,null,null,null,null,null,null,null,null,null,null,null,null,null,null,null,null,null,null,null,null,null,null,null,null,null,null,null,null,0,"P","","ZZ","E7000","GROSPROD","_Z","HYDPPS","_T","_Z","_Z","_Z","ENERGY","_Z","GWH"]
["GWh","Electricity","Geothermal","6000",null,"GELEPROD","GEOTHERM",{"$f":"PrefilledData!B53","v":0},0,"P","",null,null,null,null,null,null,null,null,null,null,null,null,null,null,null,null,null,null,null,null,null,null,null,null,null,null,null,null,null,null,null,null,null,null,null,null,null,null,null,null,null,null,null,null,null,null,null,null,null,null,null,null,null,null,null,null,null,null,null,null,null,null,null,null,null,null,null,null,null,null,null,null,null,null,null,null,null,null,null,null,null,null,null,null,null,null,null,null,null,null,null,null,null,null,null,null,null,null,null,null,null,null,null,null,null,null,null,null,0,"P","","ZZ","E7000","GROSPROD","_Z","GEOTHERM","_T","_Z","_Z","_Z","ENERGY","_Z","GWH"]
["GWh","Electricity","Solar","6000",null,"GELEPROD","SOLAR",{"$f":"H10+H11","v":0},{"$f":"I10+I11","v":0},"P","",null,null,null,null,null,null,null,null,null,null,null,null,null,null,null,null,null,null,null,null,null,null,null,null,null,null,null,null,null,null,null,null,null,null,null,null,null,null,null,null,null,null,null,null,null,null,null,null,null,null,null,null,null,null,null,null,null,null,null,null,null,null,null,null,null,null,null,null,null,null,null,null,null,null,null,null,null,null,null,null,null,null,null,null,null,null,null,null,null,null,null,null,null,null,null,null,null,null,null,null,null,null,null,null,null,null,null,null,0,"P","","ZZ","E7000","GROSPROD","_Z","SOLAR","_T","_Z","_Z","_Z","ENERGY","_Z","GWH"]
["GWh","Electricity","     Solar photovoltaic","6000",null,"GELEPROD","SOLARPV",{"$f":"PrefilledData!B56","v":0},0,"P","",null,null,null,null,null,null,null,null,null,null,null,null,null,null,null,null,null,null,null,null,null,null,null,null,null,null,null,null,null,null,null,null,null,null,null,null,null,null,null,null,null,null,null,null,null,null,null,null,null,null,null,null,null,null,null,null,null,null,null,null,null,null,null,null,null,null,null,null,null,null,null,null,null,null,null,null,null,null,null,null,null,null,null,null,null,null,null,null,null,null,null,null,null,null,null,null,null,null,null,null,null,null,null,null,null,null,null,null,0,"P","","ZZ","E7000","GROSPROD","_Z","SOLARPV","_T","_Z","_Z","_Z","ENERGY","_Z","GWH"]
{"$rows_left_out":65}
{"sheet":"HEAT","index":4,"n_rows":62,"n_cols":134,"rows_kept":62,"cut":false,"hidden":true,"merged":[]}
[null,null,"Heat: TJ\nGROSS PRODUCTION","product_id_e","flow_id_e","product_id_i","flow_id_i",{"$f":"ELECTRICITY!Q1-1&\" prefilled from annual data\"","v":"2019 prefilled from annual data"},{"$f":"ELECTRICITY!Q1","v":2020},"STATUS","Growth rates\nto previous\nyear","Observation Comment",null,null,null,null,null,null,null,null,null,null,null,null,null,null,null,null,null,null,null,null,null,null,null,null,null,null,null,null,null,null,null,null,null,null,null,null,null,null,null,null,null,null,null,null,null,null,null,null,null,null,null,null,null,null,null,null,null,null,null,null,null,null,null,null,null,null,null,null,null,null,null,null,null,null,null,null,null,null,null,null,null,null,null,null,null,null,null,null,null,null,null,null,null,null,null,null,null,null,null,null,null,null,null,null,null,null,null,"VALUE","OBS_STATUS","OBS_COMMENT","REF_AREA","ENERGY_PRODUCT","MAIN_FLOW","FLOW_BREAKDOWN","PLANT_TECH","PLANT_TYPE","STOCKS","INFRASTRUCTURE_IND","VIS_A_VIS_AREA","MEASURE_VALUE_TYPE","FACILITY_ID","UNIT_MEASURE"]
["TJ","Heat","Nuclear","5200",null,"GHEATPRO","NUCLEAR",{"$f":"PrefilledData!E73","v":0},0,"P",{"$f":"IF(ISERROR(I2/H2),\"\",(I2/H2)-1)","v":""},null,null,null,null,null,null,null,null,null,null,null,null,null,null,null,null,null,null,null,null,null,null,null,null,null,null,null,null,null,null,null,null,null,null,null,null,null,null,null,null,null,null,null,null,null,null,null,null,null,null,null,null,null,null,null,null,null,null,null,null,null,null,null,null,null,null,null,null,null,null,null,null,null,null,null,null,null,null,null,null,null,null,null,null,null,null,null,null,null,null,null,null,null,null,null,null,null,null,null,null,null,null,null,null,null,null,null,null,{"$f":"IF(J2=\"O\",\"NaN\",ROUND(I2,3))","v":0},{"$f":"IF(J2=\"\",\"A\",J2)","v":"P"},{"$f":"LEFT(TRIM(L2),255)","v":""},{"$f":"ELECTRICITY!$S$1","v":"ZZ"},"H8000","GROSPROD","_Z","NUCLEAR","_T","_Z","_Z","_Z","ENERGY","_Z","TJ"]
["TJ","Heat","Geothermal","5200",null,"GHEATPRO","GEOTHERM",{"$f":"PrefilledData!E53","v":0},0,"P","",null,null,null,null,null,null,null,null,null,null,null,null,null,null,null,null,null,null,null,null,null,null,null,null,null,null,null,null,null,null,null,null,null,null,null,null,null,null,null,null,null,null,null,null,null,null,null,null,null,null,null,null,null,null,null,null,null,null,null,null,null,null,null,null,null,null,null,null,null,null,null,null,null,null,null,null,null,null,null,null,null,null,null,null,null,null,null,null,null,null,null,null,null,null,null,null,null,null,null,null,null,null,null,null,null,null,null,null,{"$f":"IF(J3=\"O\",\"NaN\",ROUND(I3,3))","v":0},{"$f":"IF(J3=\"\",\"A\",J3)","v":"P"},{"$f":"LEFT(TRIM(L3),255)","v":""},{"$f":"ELECTRICITY!$S$1","v":"ZZ"},"H8000","GROSPROD","_Z","GEOTHERM","_T","_Z","_Z","_Z","ENERGY","_Z","TJ"]
["TJ","Heat","Solar thermal","5200",null,"GHEATPRO","SOLARTH",{"$f":"PrefilledData!E55","v":0},0,"P","",null,null,null,null,null,null,null,null,null,null,null,null,null,null,null,null,null,null,null,null,null,null,null,null,null,null,null,null,null,null,null,null,null,null,null,null,null,null,null,null,null,null,null,null,null,null,null,null,null,null,null,null,null,null,null,null,null,null,null,null,null,null,null,null,null,null,null,null,null,null,null,null,null,null,null,null,null,null,null,null,null,null,null,null,null,null,null,null,null,null,null,null,null,null,null,null,null,null,null,null,null,null,null,null,null,null,null,null,0,"P","",{"$f":"ELECTRICITY!$S$1","v":"ZZ"},"H8000","GROSPROD","_Z","SOLARTH","_T","_Z","_Z","_Z","ENERGY","_Z","TJ"]
["TJ","Heat","Industrial Waste (Non-Renew.)","5200",null,"GHEATPRO","INDWASTE",{"$f":"PrefilledData!E69","v":0},0,"P","",null,null,null,null,null,null,null,null,null,null,null,null,null,null,null,null,null,null,null,null,null,null,null,null,null,null,null,null,null,null,null,null,null,null,null,null,null,null,null,null,null,null,null,null,null,null,null,null,null,null,null,null,null,null,null,null,null,null,null,null,null,null,null,null,null,null,null,null,null,null,null,null,null,null,null,null,null,null,null,null,null,null,null,null,null,null,null,null,null,null,null,null,null,null,null,null,null,null,null,null,null,null,null,null,null,null,null,null,0,"P","",{"$f":"ELECTRICITY!$S$1","v":"ZZ"},"H8000","GROSPROD","_Z","COMBINWA","_T","_Z","_Z","_Z","ENERGY","_Z","TJ"]
["TJ","Heat","Municipal Waste (Renew.)","5200",null,"GHEATPRO","MUNWASTER",{"$f":"PrefilledData!E70","v":0},0,"P","",null,null,null,null,null,null,null,null,null,null,null,null,null,null,null,null,null,null,null,null,null,null,null,null,null,null,null,null,null,null,null,null,null,null,null,null,null,null,null,null,null,null,null,null,null,null,null,null,null,null,null,null,null,null,null,null,null,null,null,null,null,null,null,null,null,null,null,null,null,null,null,null,null,null,null,null,null,null,null,null,null,null,null,null,null,null,null,null,null,null,null,null,null,null,null,null,null,null,null,null,null,null,null,null,null,null,null,null,0,"P","",{"$f":"ELECTRICITY!$S$1","v":"ZZ"},"H8000","GROSPROD","_Z","COMBMURW","_T","_Z","_Z","_Z","ENERGY","_Z","TJ"]
["TJ","Heat","Municipal Waste (Non-Renew.)","5200",null,"GHEATPRO","MUNWASTEN",{"$f":"PrefilledData!E71","v":0},0,"P","",null,null,null,null,null,null,null,null,null,null,null,null,null,null,null,null,null,null,null,null,null,null,null,null,null,null,null,null,null,null,null,null,null,null,null,null,null,null,null,null,null,null,null,null,null,null,null,null,null,null,null,null,null,null,null,null,null,null,null,null,null,null,null,null,null,null,null,null,null,null,null,null,null,null,null,null,null,null,null,null,null,null,null,null,null,null,null,null,null,null,null,null,null,null,null,null,null,null,null,null,null,null,null,null,null,null,null,null,0,"P","",{"$f":"ELECTRICITY!$S$1","v":"ZZ"},"H8000","GROSPROD","_Z","COMBMUNR","_T","_Z","_Z","_Z","ENERGY","_Z","TJ"]
["TJ","Heat","Solid Biofuels","5200",null,"GHEATPRO","SBIOFUELS",{"$f":"PrefilledData!E59","v":0},0,"P","",null,null,null,null,null,null,null,null,null,null,null,null,null,null,null,null,null,null,null,null,null,null,null,null,null,null,null,null,null,null,null,null,null,null,null,null,null,null,null,null,null,null,null,null,null,null,null,null,null,null,null,null,null,null,null,null,null,null,null,null,null,null,null,null,null,null,null,null,null,null,null,null,null,null,null,null,null,null,null,null,null,null,null,null,null,null,null,null,null,null,null,null,null,null,null,null,null,null,null,null,null,null,null,null,null,null,null,null,0,"P","",{"$f":"ELECTRICITY!$S$1","v":"ZZ"},"H8000","GROSPROD","_Z","COMBSOBI","_T","_Z","_Z","_Z","ENERGY","_Z","TJ"]
["TJ","Heat","Biogases","5200",null,"GHEATPRO","BIOGASES",{"$f":"PrefilledData!E68","v":0},0,"P","",null,null,null,null,null,null,null,null,null,null,null,null,null,null,null,null,null,null,null,null,null,null,null,null,null,null,null,null,null,null,null,null,null,null,null,null,null,null,null,null,null,null,null,null,null,null,null,null,null,null,null,null,null,null,null,null,null,null,null,null,null,null,null,null,null,null,null,null,null,null,null,null,null,null,null,null,null,null,null,null,null,null,null,null,null,null,null,null,null,null,null,null,null,null,null,null,null,null,null,null,null,null,null,null,null,null,null,null,0,"P","",{"$f":"ELECTRICITY!$S$1","v":"ZZ"},"H8000","GROSPROD","_Z","COMBBIGA","_T","_Z","_Z","_Z","ENERGY","_Z","TJ"]
["TJ","Heat","Biodiesel","5200",null,"GHEATPRO","BIODIESEL",{"$f":"PrefilledData!E63","v":0},0,"P","",null,null,null,null,null,null,null,null,null,null,null,null,null,null,null,null,null,null,null,null,null,null,null,null,null,null,null,null,null,null,null,null,null,null,null,null,null,null,null,null,null,null,null,null,null,null,null,null,null,null,null,null,null,null,null,null,null,null,null,null,null,null,null,null,null,null,null,null,null,null,null,null,null,null,null,null,null,null,null,null,null,null,null,null,null,null,null,null,null,null,null,null,null,null,null,null,null,null,null,null,null,null,null,null,null,null,null,null,0,"P","",{"$f":"ELECTRICITY!$S$1","v":"ZZ"},"H8000","GROSPROD","_Z","COMBBIDI","_T","_Z","_Z","_Z","ENERGY","_Z","TJ"]
{"$rows_left_out":53}
{"sheet":"LoadedData","index":5,"n_rows":163,"n_cols":11,"rows_kept":163,"cut":false,"hidden":true,"merged":[]}
[null,null,null,null,{"$f":"COUNTIF(E2:E163, \"Error\")","v":137},"Total Number of Errors"]
[null,null,null,null,null,null,null,null,"Electricity","Nuclear",{"$f":"C4","v":0}]
[null,null,null,null,null,null,null,null,"Electricity","Hydro",{"$f":"C5","v":0}]
[null,null,null,null,{"$f":"IF(A4=F4,\"OK\",\"Error\")","v":"Error"},"Nuclear",null,null,"Electricity","     Pure hydro"]
[null,null,null,null,"Error","Hydro",null,null,"Electricity","     Mixed hydro"]
[null,null,null,null,"Error","   of which: Pumped Hydro",null,null,"Electricity","          of which generation without pumping"]
[null,null,null,null,"Error","Geothermal",null,null,"Electricity","     Pure pumped storage"]
[null,null,null,null,"Error","Solar",null,null,"Electricity","Geothermal",{"$f":"C7","v":0}]
[null,null,null,null,"Error","Tide, Wave, Ocean",null,null,"Electricity","Solar",{"$f":"C8","v":0}]
[null,null,null,null,"Error","Wind",null,null,"Electricity","     Solar photovoltaic"]
{"$rows_left_out":154}
{"sheet":"PrefilledData","index":6,"n_rows":0,"n_cols":0,"rows_kept":0,"cut":false,"hidden":true,"merged":[]}

{"sheet":"Parameter_mapping","index":7,"n_rows":3,"n_cols":2,"rows_kept":3,"cut":false,"hidden":true,"merged":[]}
["Data sheet","Parameter sheet"]
["ELECTRICITY","Parameters"]
["HEAT","Parameters"]

{"sheet":"Parameters","index":8,"n_rows":21,"n_cols":7,"rows_kept":21,"cut":false,"hidden":true,"merged":[]}
["Element","Type","PosType","Position",null,"DataStart","DP2"]
["QUEST_SOURCE","DIM","FIX","A_MINIELE",null,"DataEnd","DP85"]
["FREQ","DIM","FIX","A",null,"SkipIncompleteKeys","true"]
["REF_AREA","DIM","COLUMN","DS"]
["ENERGY_PRODUCT","DIM","COLUMN","DT"]
["MAIN_FLOW","DIM","COLUMN","DU"]
["FLOW_BREAKDOWN","DIM","COLUMN","DV"]
["PLANT_TECH","DIM","COLUMN","DW"]
["PLANT_TYPE","DIM","COLUMN","DX"]
["STOCKS","DIM","COLUMN","DY"]
{"$rows_left_out":11}