{"text_format":"1","workbook":"xlsx","n_sheets":11,"sheets":["COVER","REPORTING INSTRUCTIONS","REMARKS","TABLES-FORMS","COLUMN","PREFILLED-ANNUAL","PREFILLED-MONTHLY","LoadedData","PrefilledData","Parameter_mapping","Parameters"],"not_rendered":{"charts":0,"images":1,"macros":1,"external_links":0,"defined_names":20,"comments":0,"pivot_tables":0},"unopened":[],"bounds":{"document_bytes":16777216,"sheet_cells":100000,"rows_first":2000,"rows_last":500,"rows_between":2000,"halvings":0,"cell_chars":16384,"cell_head_chars":4096},"cells_cut":0,"cells_raw":0,"read":"whole","date_system":"1900"}

{"sheet":"COVER","index":0,"n_rows":81,"n_cols":6,"rows_kept":81,"cut":false,"hidden":false,"merged":[[7,0,7,19]]}
["MINI-QUESTIONNAIRE"]
["SOLID FOSSIL FUELS & MANUFACTURED GASES"]
[{"$f":"COLUMN!Q1","v":2020}]
[{"$f":"COLUMN!R1","v":"ZZZZ"}]
[]
["EDAMIS dataset:",null,null,null,null,"ENERGY_MINICOA_A"]
[]
["Please transmit to Eurostat by 31 May 2021."]
["This reporting template is operational if and only if Visual Basic macros are operational."]
["Please click the START button to make other sheets visible."]
{"$rows_left_out":72}
{"sheet":"REPORTING INSTRUCTIONS","index":1,"n_rows":23,"n_cols":2,"rows_kept":23,"cut":false,"hidden":true,"merged":[[7,0,7,8]]}
["REPORTING INSTRUCTIONS"]
[]
["You can enter values or formulas. Please do not enter links to outside files."]
[]
["When completed, please transmit via EDAMIS to Eurostat: dataset ENERGY_MINICOA_A"]
[]
["All definitions and instructions as for annual coal questionnaire apply."]
["http://ec.europa.eu/eurostat/web/energy/methodology/annual"]
[]
["FLAGS - STATUS of data points"]
{"$rows_left_out":14}
{"sheet":"REMARKS","index":2,"n_rows":1,"n_cols":1,"rows_kept":1,"cut":false,"hidden":true,"merged":[]}
["REMARKS:"]

{"sheet":"TABLES-FORMS","index":3,"n_rows":20,"n_cols":19,"rows_kept":20,"cut":false,"hidden":true,"merged":[]}
[]
[null,"units:","kt","kt","kt","kt","kt","kt","kt","kt","kt","kt","TJ GCV","TJ GCV","TJ GCV","TJ GCV","kt","kt","kt"]
[null,{"$f":"COLUMN!Q1","v":2020},"Anthracite","Coking coal","Other bituminous coal","Sub-bituminous coal","Lignite","Patent fuel","Coke oven coke","Gas coke","Coal tar","BKB","Gas works gas","Coke oven gas","Blast furnace gas","Other recovered gases","Peat","Peat products","Oil shale and oil sands"]
[null,"Indigenous production",0,0,0,0,0,0,0,0,0,0,0,0,0,0,0,0,0]
[null,"From other sources",0,0,0,0,0,0,0,0,0,0,0,0,0,0,0,0,0]
[null,"Total imports (Balance)",0,0,0,0,0,0,0,0,0,0,0,0,0,0,0,0,0]
[null,"Total exports (Balance)",0,0,0,0,0,0,0,0,0,0,0,0,0,0,0,0,0]
[null,"Stock changes (National territory)",0,0,0,0,0,0,0,0,0,0,0,0,0,0,0,0,0]
[null,"Inland consumption (Calculated)",{"$f":"C4+C5+C6-C7+C8","v":0},0,0,0,0,0,0,0,0,0,0,0,0,0,0,0,0]
[null,"Statistical Difference",{"$f":"C9-C11","v":0},0,0,0,0,0,0,0,0,0,0,0,0,0,0,0,0]
{"$rows_left_out":11}
{"sheet":"COLUMN","index":4,"n_rows":324,"n_cols":134,"rows_kept":324,"cut":false,"hidden":true,"merged":[]}
[null,null,null,"product_id_e","flow_id_e","product_id_i","flow_id_i",{"$f":"Q1-1&\" prefilled from annual data\"","v":"2019 prefilled from annual data"},{"$f":"Q1 & \" as sum of monthly data\"","v":"2020 as sum of monthly data"},{"$f":"Q1","v":2020},"STATUS","Growth rates\nto previous\nyear","Growth rates to sum of monthly","Observation Comment",null,null,2020,"ZZZZ",{"$f":"LOOKUP(R1,COVER!A40:A81,COVER!B40:B81)","v":"ZZ"},null,null,null,null,null,null,null,null,null,null,null,null,null,null,null,null,null,null,null,null,null,null,null,null,null,null,null,null,null,null,null,null,null,null,null,null,null,null,null,null,null,null,null,null,null,null,null,null,null,null,null,null,null,null,null,null,null,null,null,null,null,null,null,null,null,null,null,null,null,null,null,null,null,null,null,null,null,null,null,null,null,null,null,null,null,null,null,null,null,null,null,null,null,null,null,null,null,null,null,null,"VALUE","OBS_STATUS","OBS_COMMENT","REF_AREA","ENERGY_PRODUCT","MAIN_FLOW","FLOW_BREAKDOWN","PLANT_TECH","PLANT_TYPE","STOCKS","INFRASTRUCTURE_IND","VIS_A_VIS_AREA","MEASURE_VALUE_TYPE","FACILITY_ID","UNIT_MEASURE"]
["kt","Anthracite","Indigenous production","2115","B_100100","ANTCOAL","INDPROD",{"$f":"PrefilledData!D6","v":0},null,0,"P",{"$f":"IF(ISERROR(J2/H2),\"\",(J2/H2)-1)","v":""},{"$f":"IF(ISERROR(J2/I2),\"\",(J2/I2)-1)","v":""},null,null,null,null,null,null,null,null,null,null,null,null,null,null,null,null,null,null,null,null,null,null,null,null,null,null,null,null,null,null,null,null,null,null,null,null,null,null,null,null,null,null,null,null,null,null,null,null,null,null,null,null,null,null,null,null,null,null,null,null,null,null,null,null,null,null,null,null,null,null,null,null,null,null,null,null,null,null,null,null,null,null,null,null,null,null,null,null,null,null,null,null,null,null,null,null,null,null,null,null,null,null,null,null,null,null,{"$f":"IF(K2=\"O\",\"NaN\",ROUND(J2,3))","v":0},{"$f":"IF(K2=\"\",\"A\",K2)","v":"P"},{"$f":"LEFT(TRIM(N2),255)","v":""},{"$f":"$S$1","v":"ZZ"},"C0110","PRODUCT","INDPROD","_Z","_Z","_Z","_Z","_Z","WEIGHT","_Z","KT"]
["kt","Anthracite","From other sources","2115","B_100200","ANTCOAL","OSOURCES",{"$f":"PrefilledData!D7","v":0},null,0,"P",{"$f":"IF(ISERROR(J3/H3),\"\",(J3/H3)-1)","v":""},{"$f":"IF(ISERROR(J3/I3),\"\",(J3/I3)-1)","v":""},null,null,null,null,null,null,null,null,null,null,null,null,null,null,null,null,null,null,null,null,null,null,null,null,null,null,null,null,null,null,null,null,null,null,null,null,null,null,null,null,null,null,null,null,null,null,null,null,null,null,null,null,null,null,null,null,null,null,null,null,null,null,null,null,null,null,null,null,null,null,null,null,null,null,null,null,null,null,null,null,null,null,null,null,null,null,null,null,null,null,null,null,null,null,null,null,null,null,null,null,null,null,null,null,null,null,{"$f":"IF(K3=\"O\",\"NaN\",ROUND(J3,3))","v":0},{"$f":"IF(K3=\"\",\"A\",K3)","v":"P"},{"$f":"LEFT(TRIM(N3),255)","v":""},"ZZ","C0110","SUPPLY","OSOURCES","_Z","_Z","_Z","_Z","_Z","WEIGHT","_Z","KT"]
["kt","Anthracite","Total imports (Balance)","2115","B_100300","ANTCOAL","TOTIMPSB",{"$f":"PrefilledData!D8","v":0},null,0,"P","","",null,null,null,null,null,null,null,null,null,null,null,null,null,null,null,null,null,null,null,null,null,null,null,null,null,null,null,null,null,null,null,null,null,null,null,null,null,null,null,null,null,null,null,null,null,null,null,null,null,null,null,null,null,null,null,null,null,null,null,null,null,null,null,null,null,null,null,null,null,null,null,null,null,null,null,null,null,null,null,null,null,null,null,null,null,null,null,null,null,null,null,null,null,null,null,null,null,null,null,null,null,null,null,null,null,null,0,"P","","ZZ","C0110","IMPORTS","TOTIMPSB","_Z","_Z","_Z","_Z","_Z","WEIGHT","_Z","KT"]
["kt","Anthracite","Total exports (Balance)","2115","B_100500","ANTCOAL","TOTEXPSB",{"$f":"PrefilledData!D9","v":0},null,0,"P","","",null,null,null,null,null,null,null,null,null,null,null,null,null,null,null,null,null,null,null,null,null,null,null,null,null,null,null,null,null,null,null,null,null,null,null,null,null,null,null,null,null,null,null,null,null,null,null,null,null,null,null,null,null,null,null,null,null,null,null,null,null,null,null,null,null,null,null,null,null,null,null,null,null,null,null,null,null,null,null,null,null,null,null,null,null,null,null,null,null,null,null,null,null,null,null,null,null,null,null,null,null,null,null,null,null,null,0,"P","","ZZ","C0110","EXPORTS","TOTEXPSB","_Z","_Z","_Z","_Z","_Z","WEIGHT","_Z","KT"]
["kt","Anthracite","Stock changes (National territory)","2115","B_100400","ANTCOAL","STCHANAT",{"$f":"PrefilledData!D10","v":0},null,0,"P","","",null,null,null,null,null,null,null,null,null,null,null,null,null,null,null,null,null,null,null,null,null,null,null,null,null,null,null,null,null,null,null,null,null,null,null,null,null,null,null,null,null,null,null,null,null,null,null,null,null,null,null,null,null,null,null,null,null,null,null,null,null,null,null,null,null,null,null,null,null,null,null,null,null,null,null,null,null,null,null,null,null,null,null,null,null,null,null,null,null,null,null,null,null,null,null,null,null,null,null,null,null,null,null,null,null,null,0,"P","","ZZ","C0110","STOCKS","STOCKCH","_Z","_Z","NATTER","_Z","_Z","WEIGHT","_Z","KT"]
["kt","Anthracite","Inland consumption (Calculated)",null,null,null,null,{"$f":"H2+H3+H4-H5+H6","v":0},null,{"$f":"J2+J3+J4-J5+J6","v":0},"P","","",null,null,null,null,null,null,null,null,null,null,null,null,null,null,null,null,null,null,null,null,null,null,null,null,null,null,null,null,null,null,null,null,null,null,null,null,null,null,null,null,null,null,null,null,null,null,null,null,null,null,null,null,null,null,null,null,null,null,null,null,null,null,null,null,null,null,null,null,null,null,null,null,null,null,null,null,null,null,null,null,null,null,null,null,null,null,null,null,null,null,null,null,null,null,null,null,null,null,null,null,null,null,null,null,null,null,0,"P","","ZZ","C0110","SUPPLY","INLDEMC","_Z","_Z","_Z","_Z","_Z","WEIGHT","_Z","KT"]
["kt","Anthracite","Statistical Difference",null,null,null,null,{"$f":"H7-H9","v":0},null,{"$f":"J7-J9","v":0},"P",null,null,null,null,null,null,null,null,null,null,null,null,null,null,null,null,null,null,null,null,null,null,null,null,null,null,null,null,null,null,null,null,null,null,null,null,null,null,null,null,null,null,null,null,null,null,null,null,null,null,null,null,null,null,null,null,null,null,null,null,null,null,null,null,null,null,null,null,null,null,null,null,null,null,null,null,null,null,null,null,null,null,null,null,null,null,null,null,null,null,null,null,null,null,null,null,null,null,null,null,null,null,null,null,null,null,null,null,0,"P","","ZZ","C0110","STATDIFF","_Z","_Z","_Z","_Z","_Z","_Z","WEIGHT","_Z","KT"]
["kt","Anthracite","Inland consumption (Observed)",null,null,null,null,{"$f":"H10+H11+H12+H13","v":0},null,{"$f":"J10+J11+J12+J13","v":0},"P","","",null,null,null,null,null,null,null,null,null,null,null,null,null,null,null,null,null,null,null,null,null,null,null,null,null,null,null,null,null,null,null,null,null,null,null,null,null,null,null,null,null,null,null,null,null,null,null,null,null,null,null,null,null,null,null,null,null,null,null,null,null,null,null,null,null,null,null,null,null,null,null,null,null,null,null,null,null,null,null,null,null,null,null,null,null,null,null,null,null,null,null,null,null,null,null,null,null,null,null,null,null,null,null,null,null,null,0,"P","","ZZ","C0110","DEMAND","INLDEMO","_Z","_Z","_Z","_Z","_Z","WEIGHT","_Z","KT"]
["kt","Anthracite","Transformation sector","2115","DB_101000","ANTCOAL","TOTTRANF",{"$f":"PrefilledData!D12","v":0},null,0,"P","","",null,null,null,null,null,null,null,null,null,null,null,null,null,null,null,null,null,null,null,null,null,null,null,null,null,null,null,null,null,null,null,null,null,null,null,null,null,null,null,null,null,null,null,null,null,null,null,null,null,null,null,null,null,null,null,null,null,null,null,null,null,null,null,null,null,null,null,null,null,null,null,null,null,null,null,null,null,null,null,null,null,null,null,null,null,null,null,null,null,null,null,null,null,null,null,null,null,null,null,null,null,null,null,null,null,null,0,"P","","ZZ","C0110","TRANSFOR","TOTRANSF","_Z","_Z","_Z","_Z","_Z","WEIGHT","_Z","KT"]
{"$rows_left_out":315}
{"sheet":"PREFILLED-ANNUAL","index":5,"n_rows":39,"n_cols":19,"rows_kept":39,"cut":false,"hidden":true,"merged":[]}
[]
[null,"units:","kt","kt","kt","kt","kt","kt","kt","kt","kt","kt","TJ GCV","TJ GCV","TJ GCV","TJ GCV","kt","kt","kt"]
[null,{"$f":"COLUMN!Q1-1&\" prefilled from annual data\"","v":"2019 prefilled from annual data"},"Anthracite","Coking coal","Other bituminous coal","Sub-bituminous coal","Lignite","Patent fuel","Coke oven coke","Gas coke","Coal tar","BKB","Gas works gas","Coke oven gas","Blast furnace gas","Other recovered gases","Peat","Peat products","Oil shale and oil sands"]
[null,"Indigenous production",{"$f":"COLUMN!H2","v":0},{"$f":"COLUMN!H19","v":0},{"$f":"COLUMN!H36","v":0},{"$f":"COLUMN!H53","v":0},{"$f":"COLUMN!H70","v":0},{"$f":"COLUMN!H87","v":0},{"$f":"COLUMN!H104","v":0},{"$f":"COLUMN!H121","v":0},{"$f":"COLUMN!H138","v":0},{"$f":"COLUMN!H155","v":0},{"$f":"COLUMN!H172","v":0},{"$f":"COLUMN!H189","v":0},{"$f":"COLUMN!H206","v":0},{"$f":"COLUMN!H223","v":0},{"$f":"COLUMN!H240","v":0},{"$f":"COLUMN!H257","v":0},{"$f":"COLUMN!H274","v":0}]
[null,"From other sources",{"$f":"COLUMN!H3","v":0},{"$f":"COLUMN!H20","v":0},{"$f":"COLUMN!H37","v":0},{"$f":"COLUMN!H54","v":0},{"$f":"COLUMN!H71","v":0},{"$f":"COLUMN!H88","v":0},{"$f":"COLUMN!H105","v":0},{"$f":"COLUMN!H122","v":0},{"$f":"COLUMN!H139","v":0},{"$f":"COLUMN!H156","v":0},{"$f":"COLUMN!H173","v":0},{"$f":"COLUMN!H190","v":0},{"$f":"COLUMN!H207","v":0},{"$f":"COLUMN!H224","v":0},{"$f":"COLUMN!H241","v":0},{"$f":"COLUMN!H258","v":0},{"$f":"COLUMN!H275","v":0}]
[null,"Total imports (Balance)",{"$f":"COLUMN!H4","v":0},{"$f":"COLUMN!H21","v":0},{"$f":"COLUMN!H38","v":0},{"$f":"COLUMN!H55","v":0},{"$f":"COLUMN!H72","v":0},{"$f":"COLUMN!H89","v":0},{"$f":"COLUMN!H106","v":0},{"$f":"COLUMN!H123","v":0},{"$f":"COLUMN!H140","v":0},{"$f":"COLUMN!H157","v":0},{"$f":"COLUMN!H174","v":0},{"$f":"COLUMN!H191","v":0},{"$f":"COLUMN!H208","v":0},{"$f":"COLUMN!H225","v":0},{"$f":"COLUMN!H242","v":0},{"$f":"COLUMN!H259","v":0},{"$f":"COLUMN!H276","v":0}]
[null,"Total exports (Balance)",{"$f":"COLUMN!H5","v":0},{"$f":"COLUMN!H22","v":0},{"$f":"COLUMN!H39","v":0},{"$f":"COLUMN!H56","v":0},{"$f":"COLUMN!H73","v":0},{"$f":"COLUMN!H90","v":0},{"$f":"COLUMN!H107","v":0},{"$f":"COLUMN!H124","v":0},{"$f":"COLUMN!H141","v":0},{"$f":"COLUMN!H158","v":0},{"$f":"COLUMN!H175","v":0},{"$f":"COLUMN!H192","v":0},{"$f":"COLUMN!H209","v":0},{"$f":"COLUMN!H226","v":0},{"$f":"COLUMN!H243","v":0},{"$f":"COLUMN!H260","v":0},{"$f":"COLUMN!H277","v":0}]
[null,"Stock changes (National territory)",{"$f":"COLUMN!H6","v":0},{"$f":"COLUMN!H23","v":0},{"$f":"COLUMN!H40","v":0},{"$f":"COLUMN!H57","v":0},{"$f":"COLUMN!H74","v":0},{"$f":"COLUMN!H91","v":0},{"$f":"COLUMN!H108","v":0},{"$f":"COLUMN!H125","v":0},{"$f":"COLUMN!H142","v":0},{"$f":"COLUMN!H159","v":0},{"$f":"COLUMN!H176","v":0},{"$f":"COLUMN!H193","v":0},{"$f":"COLUMN!H210","v":0},{"$f":"COLUMN!H227","v":0},{"$f":"COLUMN!H244","v":0},{"$f":"COLUMN!H261","v":0},{"$f":"COLUMN!H278","v":0}]
[null,"Inland consumption (Calculated)",{"$f":"C4+C5+C6-C7+C8","v":0},0,0,0,0,0,0,0,0,0,0,0,0,0,0,0,0]
[null,"Statistical Difference",{"$f":"C9-C11","v":0},{"$f":"D9-D11","v":0},0,0,0,0,0,0,0,0,0,0,0,0,0,0,0]
{"$rows_left_out":30}
{"sheet":"PREFILLED-MONTHLY","index":6,"n_rows":21,"n_cols":7,"rows_kept":21,"cut":false,"hidden":true,"merged":[]}
[]
[null,"unit: kt (thousand tons)"]
[null,{"$f":"COLUMN!Q1&\" prefilled from monthly data\"","v":"2020 prefilled from monthly data"},"Hard coal","Brown coal","Coke oven coke","Peat","Oil shale and oil sands"]
[null,"Indigenous production",{"$f":"COLUMN!I291","v":0},{"$f":"COLUMN!I308","v":0},{"$f":"COLUMN!I104","v":0},{"$f":"COLUMN!I240","v":0},{"$f":"COLUMN!I274","v":0}]
[null,"From other sources",{"$f":"COLUMN!I292","v":0}]
[null,"Total imports (Balance)",{"$f":"COLUMN!I293","v":0},{"$f":"COLUMN!I310","v":0},{"$f":"COLUMN!I106","v":0},{"$f":"COLUMN!I242","v":0},{"$f":"COLUMN!I276","v":0}]
[null,"Total exports (Balance)",{"$f":"COLUMN!I294","v":0},{"$f":"COLUMN!I311","v":0},{"$f":"COLUMN!I107","v":0},{"$f":"COLUMN!I243","v":0},{"$f":"COLUMN!I277","v":0}]
[null,"Stock changes (National territory)",{"$f":"COLUMN!I295","v":0},{"$f":"COLUMN!I312","v":0},{"$f":"COLUMN!I108","v":0},{"$f":"COLUMN!I244","v":0},{"$f":"COLUMN!I278","v":0}]
[null,"Inland consumption (Calculated)",{"$f":"C4+C5+C6-C7+C8","v":0},{"$f":"D4+D5+D6-D7+D8","v":0},{"$f":"E4+E5+E6-E7+E8","v":0},{"$f":"F4+F5+F6-F7+F8","v":0},{"$f":"G4+G5+G6-G7+G8","v":0}]
[]
{"$rows_left_out":12}
{"sheet":"LoadedData","index":7,"n_rows":344,"n_cols":22,"rows_kept":344,"cut":false,"hidden":true,"merged":[]}
[]
[null,null,null,null,null,null,null,null,null,null,null,null,null,null,null,null,"Anthracite","Indigenous production",{"$f":"OFFSET($E$4,MATCH(V2,$O$5:$O$344,0),0)","v":0},"INDPROD","ANTCOAL",{"$f":"T2&U2","v":"INDPRODANTCOAL"}]
[null,null,null,null,null,null,null,null,null,null,"Errors:",{"$f":"COUNTIF(L4:L344,\"Error\") + COUNTIF(K4:K344,\"Error\")","v":357},null,null,null,null,"Anthracite","From other sources",{"$f":"OFFSET($E$4,MATCH(V3,$O$5:$O$344,0),0)","v":0},"OSOURCES","ANTCOAL",{"$f":"T3&U3","v":"OSOURCESANTCOAL"}]
[null,null,null,null,null,null,null,null,null,null,null,null,null,null,null,null,"Anthracite","Total imports (Balance)",0,"TOTIMPSB","ANTCOAL","TOTIMPSBANTCOAL"]
[null,null,null,null,null,null,null,"INDPROD","ANTCOAL",null,{"$f":"IF(B5=M5,\"OK\",\"Error\")","v":"Error"},{"$f":"IF(C5=N5,\"OK\",\"Error\")","v":"Error"},"Anthracite\n[000 t]","Indigenous production",{"$f":"H5&I5","v":"INDPRODANTCOAL"},null,"Anthracite","Total exports (Balance)",0,"TOTEXPSB","ANTCOAL","TOTEXPSBANTCOAL"]
[null,null,null,null,null,null,null,"OSOURCES","ANTCOAL",null,{"$f":"IF(B6=M6,\"OK\",\"Error\")","v":"OK"},{"$f":"IF(C6=N6,\"OK\",\"Error\")","v":"Error"},null,"From other sources",{"$f":"H6&I6","v":"OSOURCESANTCOAL"},null,"Anthracite","Stock changes (National territory)",0,"STCHANAT","ANTCOAL","STCHANATANTCOAL"]
[null,null,null,null,null,null,null,"TOTIMPSB","ANTCOAL",null,"OK","Error",null,"Total imports (Balance)","TOTIMPSBANTCOAL",null,"Anthracite","Inland consumption (Calculated)",null,null,"ANTCOAL","ANTCOAL"]
[null,null,null,null,null,null,null,"TOTEXPSB","ANTCOAL",null,"OK","Error",null,"Total exports (Balance)","TOTEXPSBANTCOAL",null,"Anthracite","Statistical Difference",null,null,"ANTCOAL","ANTCOAL"]
[null,null,null,null,null,null,null,"STCHANAT","ANTCOAL",null,"OK","Error",null,"Stock changes (National territory)","STCHANATANTCOAL",null,"Anthracite","Inland consumption (Observed)",null,null,"ANTCOAL","ANTCOAL"]
[null,null,null,null,null,null,null,"INDCONC","ANTCOAL",null,"OK","Error",null,"Inland consumption (calculated)","INDCONCANTCOAL",null,"Anthracite","Transformation sector",0,"TOTTRANF","ANTCOAL","TOTTRANFANTCOAL"]
{"$rows_left_out":335}
{"sheet":"PrefilledData","index":8,"n_rows":0,"n_cols":0,"rows_kept":0,"cut":false,"hidden":true,"merged":[]}

{"sheet":"Parameter_mapping","index":9,"n_rows":2,"n_cols":2,"rows_kept":2,"cut":false,"hidden":true,"merged":[]}
["Data sheet","Parameter sheet"]
["COLUMN","Parameters"]

{"sheet":"Parameters","index":10,"n_rows":21,"n_cols":7,"rows_kept":21,"cut":false,"hidden":true,"merged":[]}
["Element","Type","PosType","Position",null,"DataStart","DP2"]
["QUEST_SOURCE","DIM","FIX","A_MINICOA",null,"DataEnd","DP325"]
["FREQ","DIM","FIX","A",null,"SkipIncompleteKeys","true"]
["REF_AREA","DIM","COLUMN","DS"]
["ENERGY_PRODUCT","DIM","COLUMN","DT"]
["MAIN_FLOW","DIM","COLUMN","DU"]
["FLOW_BREAKDOWN","DIM","COLUMN","DV"]
["PLANT_TECH","DIM","COLUMN","DW"]
["PLANT_TYPE","DIM","COLUMN","DX"]
["STOCKS","DIM","COLUMN","DY"]
{"$rows_left_out":11}