{"text_format":"1","workbook":"xlsx","n_sheets":22,"sheets":["COVER","INDEX","Basic Instructions","GETTING STARTED","Footnotes list","Metadata sheet","EFA A 1a","EFA A 1b","EFA A 2a","EFA A 2b","EFA B 1","EFA B 2","EFA B 3a","EFA B 3b","EFA C 1a","EFA C 1b","ErrorLog","Changelog","Lists","Mandatory","Summations","MustNotBeNegative"],"not_rendered":{"charts":0,"images":3,"macros":1,"external_links":0,"defined_names":2,"comments":0,"pivot_tables":0},"unopened":[],"bounds":{"document_bytes":16777216,"sheet_cells":100000,"rows_first":2000,"rows_last":500,"rows_between":2000,"halvings":0,"cell_chars":16384,"cell_head_chars":4096},"cells_cut":0,"cells_raw":0,"read":"whole","date_system":"1900"}

{"sheet":"COVER","index":0,"n_rows":9,"n_cols":3,"rows_kept":9,"cut":false,"hidden":false,"merged":[]}
[]
[]
[null,null,{"$f":"UPPER(Lists!K3)","v":"STATISTICAL OFFICE OF THE EUROPEAN UNION"}]
[]
[null,null,{"$f":"Lists!K4","v":"Directorate E: Sectoral and regional statistics"}]
[null,null,{"$f":"Lists!K5","v":"Unit E-2: Environmental statistics and accounts; sustainable development"}]
{"$rows_left_out":4}
{"sheet":"INDEX","index":1,"n_rows":34,"n_cols":5,"rows_kept":34,"cut":false,"hidden":false,"merged":[[12,2,12,4],[1,2,1,4],[3,2,3,4],[4,2,4,4],[6,2,6,4],[8,2,8,4]]}
[]
[]
[null,null,null,null,{"$f":"UPPER(Lists!K3)","v":"STATISTICAL OFFICE OF THE EUROPEAN UNION"}]
[null,null,{"$f":"UPPER(Lists!K7)","v":"EUROPEAN FOREST ACCOUNTS"}]
[null,null,{"$f":"CONCATENATE(Lists!K8,\" DATA COLLECTION\")","v":"2022 DATA COLLECTION"}]
[]
{"$rows_left_out":29}
{"sheet":"Basic Instructions","index":2,"n_rows":104,"n_cols":6,"rows_kept":104,"cut":false,"hidden":false,"merged":[[73,2,73,5],[34,2,34,5],[39,2,39,5],[24,2,24,5],[60,2,60,5],[61,2,61,5],[64,2,64,5],[65,3,65,5],[71,2,71,5],[30,2,30,5],[51,2,51,5],[52,2,52,5],[53,2,53,5],[55,2,55,5],[72,2,72,5],[103,2,103,5],[97,2,97,5],[99,2,99,5],[100,2,100,5],[102,2,102,5],[92,2,92,5],[26,2,26,5],[44,2,44,5],[32,2,32,5],[33,2,33,5],[75,2,75,5],[90,2,90,5],[77,2,77,5],[48,2,48,5],[35,2,35,5],[79,2,79,5],[81,2,81,5],[84,2,84,5],[86,2,86,5],[56,2,56,5],[59,2,59,5],[14,2,14,5],[22,2,22,5],[23,2,23,5],[3,2,3,5],[4,2,4,5],[6,2,6,5],[8,2,8,5],[9,2,9,5],[10,2,10,5],[11,2,11,5],[12,2,12,5],[13,2,13,5],[15,2,15,5],[19,2,19,5],[20,2,20,5],[21,2,21,5]]}
[]
[]
[null,null,null,null,null,{"$f":"UPPER(Lists!K3)","v":"STATISTICAL OFFICE OF THE EUROPEAN UNION"}]
[null,null,{"$f":"UPPER(Lists!K7)","v":"EUROPEAN FOREST ACCOUNTS"}]
[null,null,{"$f":"CONCATENATE(Lists!K8,\" DATA COLLECTION\")","v":"2022 DATA COLLECTION"}]
[]
{"$rows_left_out":99}
{"sheet":"GETTING STARTED","index":3,"n_rows":24,"n_cols":7,"rows_kept":24,"cut":false,"hidden":false,"merged":[[18,3,18,6],[20,3,20,6],[22,3,22,6],[23,2,23,6],[3,2,3,6],[4,2,4,6],[6,2,6,6],[12,2,12,6],[14,3,14,6],[16,3,16,6],[8,2,8,3]]}
[]
[]
[null,null,null,null,null,null,{"$f":"UPPER(Lists!K3)","v":"STATISTICAL OFFICE OF THE EUROPEAN UNION"}]
[null,null,{"$f":"UPPER(Lists!K7)","v":"EUROPEAN FOREST ACCOUNTS"}]
[null,null,{"$f":"CONCATENATE(Lists!K8,\" DATA COLLECTION\")","v":"2022 DATA COLLECTION"}]
[]
{"$rows_left_out":19}
{"sheet":"Footnotes list","index":4,"n_rows":58,"n_cols":5,"rows_kept":58,"cut":false,"hidden":false,"merged":[[1,3,1,4],[3,3,3,4],[4,3,4,4],[6,3,6,4],[7,3,7,4]]}
[]
[]
[null,null,null,null,{"$f":"UPPER(Lists!K3)","v":"STATISTICAL OFFICE OF THE EUROPEAN UNION"}]
[null,null,null,{"$f":"UPPER(Lists!K7)","v":"EUROPEAN FOREST ACCOUNTS"}]
[null,null,null,{"$f":"CONCATENATE(Lists!K8,\" DATA COLLECTION\")","v":"2022 DATA COLLECTION"}]
[]
{"$rows_left_out":53}
{"sheet":"Metadata sheet","index":5,"n_rows":26,"n_cols":6,"rows_kept":26,"cut":false,"hidden":false,"merged":[[1,2,1,5],[2,2,2,5],[3,2,3,5],[4,2,4,5],[6,2,6,5]]}
[]
[]
[null,null,{"$f":"UPPER(Lists!K3)","v":"STATISTICAL OFFICE OF THE EUROPEAN UNION"}]
[null,null,{"$f":"UPPER(Lists!K7)","v":"EUROPEAN FOREST ACCOUNTS"}]
[null,null,{"$f":"CONCATENATE(Lists!K8,\" DATA COLLECTION\")","v":"2022 DATA COLLECTION"}]
[]
{"$rows_left_out":21}
{"sheet":"EFA A 1a","index":6,"n_rows":30,"n_cols":31,"rows_kept":30,"cut":false,"hidden":false,"merged":[[27,4,27,18],[30,4,30,18],[16,1,16,2],[8,5,8,6],[9,5,9,6],[10,5,10,6],[11,5,11,6],[12,5,12,6],[19,5,19,15],[6,7,7,7],[6,11,7,11],[6,15,7,15],[24,4,24,18],[6,16,7,16],[6,4,6,6],[7,5,7,6],[18,5,18,15],[13,5,13,6],[6,9,7,10],[6,8,7,8],[6,12,7,12],[6,13,7,14],[6,28,7,28],[6,29,7,30],[6,17,7,18],[6,20,7,20],[6,21,7,22],[6,24,7,24],[6,25,7,26],[6,27,7,27],[6,19,7,19],[6,23,7,23]]}
[]
[null,null,null,null,"Table A 1 - Wooded land"]
[null,null,null,null,"(a) Area of wooded land, in 1000 ha"]
[null,null,"GEO =>",null,"Country:",{"$f":"'GETTING STARTED'!G9","v":""},{"$f":"IF('GETTING STARTED'!E9=\"\",\"\",'GETTING STARTED'!E9)","v":""}]
[null,null,"TIME=>",null,"Year:",{"$f":"IF('GETTING STARTED'!E10=\"\",\"\",'GETTING STARTED'!E10)","v":""}]
[]
{"$rows_left_out":25}
{"sheet":"EFA A 1b","index":7,"n_rows":30,"n_cols":35,"rows_kept":30,"cut":false,"hidden":false,"merged":[[16,1,16,2],[6,4,6,6],[7,5,7,6],[8,5,8,6],[6,7,7,7],[9,5,9,6],[10,5,10,6],[11,5,11,6],[12,5,12,6],[13,5,13,6],[18,5,18,15],[19,5,19,15],[24,4,24,18],[30,4,30,18],[6,29,7,30],[6,28,7,28],[6,20,7,20],[6,21,7,22],[6,24,7,24],[6,25,7,26],[6,32,7,32],[6,33,7,34],[6,8,7,8],[6,9,7,10],[6,12,7,12],[6,13,7,14],[6,16,7,16],[6,11,7,11],[6,15,7,15],[6,23,7,23],[6,27,7,27],[6,31,7,31],[6,19,7,19],[6,17,7,18]]}
[]
[null,null,null,null,"Table A 1 - Wooded land"]
[null,null,null,null,"(b) Area of wooded land, in million national currency"]
[null,null,"GEO =>",null,"Country:",{"$f":"'GETTING STARTED'!G9","v":""},{"$f":"IF('GETTING STARTED'!E9=\"\",\"\",'GETTING STARTED'!E9)","v":""}]
[null,null,"TIME=>",null,"Year:",{"$f":"IF('GETTING STARTED'!E10=\"\",\"\",'GETTING STARTED'!E10)","v":""},{"$f":"CONCATENATE(\"Currency: \", 'GETTING STARTED'!$E$11)","v":"Currency: "}]
[]
{"$rows_left_out":25}
{"sheet":"EFA A 2a","index":8,"n_rows":40,"n_cols":35,"rows_kept":40,"cut":false,"hidden":false,"merged":[[18,5,18,15],[19,5,19,15],[37,4,37,18],[40,4,40,18],[16,1,16,2],[6,20,7,20],[6,21,7,22],[6,24,7,24],[7,5,7,6],[6,11,7,11],[6,15,7,15],[6,19,7,19],[6,23,7,23],[6,8,7,8],[9,5,9,6],[6,4,6,6],[11,5,11,6],[6,7,7,7],[6,17,7,18],[12,5,12,6],[13,5,13,6],[10,5,10,6],[34,4,34,18],[6,33,7,34],[6,25,7,26],[6,27,7,27],[6,31,7,31],[6,28,7,28],[6,29,7,30],[6,32,7,32],[6,9,7,10],[6,12,7,12],[6,13,7,14],[6,16,7,16],[8,5,8,6]]}
[]
[null,null,null,null,"Table A 2 - Timber"]
[null,null,null,null,"(a) Timber on wooded land, in 1000 m3 over bark"]
[null,null,"GEO =>",null,"Country:",{"$f":"'GETTING STARTED'!G9","v":""},{"$f":"IF('GETTING STARTED'!E9=\"\",\"\",'GETTING STARTED'!E9)","v":""}]
[null,null,"TIME=>",null,"Year:",{"$f":"IF('GETTING STARTED'!E10=\"\",\"\",'GETTING STARTED'!E10)","v":""}]
[]
{"$rows_left_out":35}
{"sheet":"EFA A 2b","index":9,"n_rows":32,"n_cols":39,"rows_kept":32,"cut":false,"hidden":false,"merged":[[16,1,16,2],[20,5,20,15],[6,4,6,6],[6,7,7,7],[6,11,7,11],[7,5,7,6],[6,15,7,15],[6,8,7,8],[6,9,7,10],[18,5,18,15],[19,5,19,15],[25,4,25,18],[29,4,29,18],[32,4,32,18],[6,33,7,34],[6,36,7,36],[9,5,9,6],[10,5,10,6],[11,5,11,6],[12,5,12,6],[6,19,7,19],[6,27,7,27],[6,31,7,31],[6,35,7,35],[6,23,7,23],[13,5,13,6],[6,37,7,38],[8,5,8,6],[6,21,7,22],[6,24,7,24],[6,25,7,26],[6,28,7,28],[6,29,7,30],[6,12,7,12],[6,13,7,14],[6,16,7,16],[6,17,7,18],[6,20,7,20],[6,32,7,32]]}
[]
[null,null,null,null,"Table A 2 - Timber"]
[null,null,null,null,"(b) Timber on wooded land, in million national currency  "]
[null,null,"GEO =>",null,"Country:",{"$f":"'GETTING STARTED'!G9","v":""},{"$f":"IF('GETTING STARTED'!E9=\"\",\"\",'GETTING STARTED'!E9)","v":""}]
[null,null,"TIME=>",null,"Year:",{"$f":"IF('GETTING STARTED'!E10=\"\",\"\",'GETTING STARTED'!E10)","v":""},{"$f":"CONCATENATE(\"Currency: \", 'GETTING STARTED'!$E$11)","v":"Currency: "}]
[]
{"$rows_left_out":27}
{"sheet":"EFA B 1","index":10,"n_rows":92,"n_cols":11,"rows_kept":92,"cut":false,"hidden":false,"merged":[[81,4,81,10],[74,5,74,10],[84,4,85,10],[88,4,89,10],[92,4,93,10],[69,5,69,10],[70,5,70,10],[71,5,71,10],[72,5,72,10],[73,5,73,10],[68,5,68,10],[0,1,0,2],[2,4,2,8],[7,5,7,6],[54,5,54,6],[6,4,6,7],[6,8,7,8],[5,4,5,10],[6,9,7,10],[54,9,54,10],[63,5,63,10],[64,5,64,10],[65,5,65,10],[66,5,66,10],[67,5,67,10]]}
[null,"Constants"]
[null,"INDIC_FO","NAP",null,"Table B 1 (Former table 3c) Economic aggregates of the forestry and logging industry"]
[null,"STK_FLOW","TOTAL",null,"in million national currency  [former Table 3c]\nForestry and logging industry only"]
[null,"INDUSE","A02","GEO =>","Country:",{"$f":"'GETTING STARTED'!G9","v":""},{"$f":"IF('GETTING STARTED'!E9=\"\",\"\",'GETTING STARTED'!E9)","v":""}]
[null,"PROD_WD","NAP","TIME=>","Year:",{"$f":"IF('GETTING STARTED'!E10=\"\",\"\",'GETTING STARTED'!E10)","v":""},{"$f":"CONCATENATE(\"Currency: \", 'GETTING STARTED'!$E$11)","v":"Currency: "}]
[null,"TREESPEC","TOTAL",null,"If the data do not allow you to report on the forestry and logging industry only, as separate from other industries, please explain this in the \"Comments on the compilation of the table\" below.  "]
{"$rows_left_out":87}
{"sheet":"EFA B 2","index":11,"n_rows":26,"n_cols":26,"rows_kept":26,"cut":false,"hidden":false,"merged":[[6,23,7,23],[6,24,7,25],[17,3,17,17],[20,3,20,17],[15,3,15,17],[18,0,18,1],[1,3,1,22],[2,3,2,22],[7,4,7,5],[6,3,6,5],[6,7,7,7],[6,8,7,9],[6,11,7,11],[6,12,7,13],[6,15,7,15],[6,16,7,17],[6,19,7,19],[6,20,7,21]]}
[]
[null,null,null,"Table B 2 - Output of the forest and logging industry by type"]
[null,null,null,"Output by economic type and institutional producing sector, in million national currency\nForestry and logging industry only"]
[null,"GEO =>",null,"Country:",{"$f":"'GETTING STARTED'!$G$9","v":""},{"$f":"IF('GETTING STARTED'!E9=\"\",\"\",'GETTING STARTED'!E9)","v":""}]
[null,"TIME=>",null,"Year:",{"$f":"IF('GETTING STARTED'!E10=\"\",\"\",'GETTING STARTED'!E10)","v":""},{"$f":"CONCATENATE(\"Currency: \", 'GETTING STARTED'!$E$11)","v":"Currency: "}]
[]
{"$rows_left_out":21}
{"sheet":"EFA B 3a","index":12,"n_rows":26,"n_cols":39,"rows_kept":26,"cut":false,"hidden":false,"merged":[[6,33,7,34],[6,36,7,36],[6,37,7,38],[16,4,16,18],[19,4,19,18],[6,12,7,12],[6,13,7,14],[6,16,7,16],[6,17,7,18],[6,32,7,32],[6,20,7,20],[6,21,7,22],[6,24,7,24],[6,25,7,26],[6,28,7,28],[6,29,7,30],[18,1,18,2],[7,5,7,6],[6,4,6,6],[6,8,7,8],[6,9,7,10]]}
[]
[null,null,null,null,"Table B 3 - Monetary supply and use of wood in the rough"]
[null,null,null,null,"(a) Supply of wood in the rough by all industries, in million national currency"]
[null,null,"GEO =>",null,"Country:",{"$f":"'GETTING STARTED'!G9","v":""},{"$f":"IF('GETTING STARTED'!E9=\"\",\"\",'GETTING STARTED'!E9)","v":""}]
[null,null,"TIME=>",null,"Year:",{"$f":"IF('GETTING STARTED'!E10=\"\",\"\",'GETTING STARTED'!E10)","v":""},{"$f":"CONCATENATE(\"Currency: \", 'GETTING STARTED'!$E$11)","v":"Currency: "}]
[]
{"$rows_left_out":21}
{"sheet":"EFA B 3b","index":13,"n_rows":26,"n_cols":35,"rows_kept":26,"cut":false,"hidden":false,"merged":[[20,4,20,18],[23,4,23,18],[6,28,7,28],[6,29,7,30],[6,32,7,32],[6,33,7,34],[6,4,6,6],[18,1,18,2],[7,5,7,6],[6,8,7,8],[6,9,7,10],[6,12,7,12],[6,13,7,14],[6,16,7,16],[6,17,7,18],[6,20,7,20],[6,21,7,22],[6,24,7,24],[6,25,7,26],[13,4,13,18]]}
[]
[null,null,null,null,"Table B 3 - Monetary supply and use of wood in the rough"]
[null,null,null,null,"(b) Use of wood in the rough by all industries, in million national currency"]
[null,null,"GEO =>",null,"Country:",{"$f":"'GETTING STARTED'!G9","v":""},{"$f":"IF('GETTING STARTED'!E9=\"\",\"\",'GETTING STARTED'!E9)","v":""}]
[null,null,"TIME=>",null,"Year:",{"$f":"IF('GETTING STARTED'!E10=\"\",\"\",'GETTING STARTED'!E10)","v":""},{"$f":"CONCATENATE(\"Currency: \", 'GETTING STARTED'!$E$11)","v":"Currency: "}]
[]
{"$rows_left_out":21}
{"sheet":"EFA C 1a","index":14,"n_rows":32,"n_cols":27,"rows_kept":32,"cut":false,"hidden":false,"merged":[[6,24,7,24],[6,25,7,26],[29,4,29,18],[32,4,32,18],[6,4,6,6],[6,12,7,12],[6,13,7,14],[6,16,7,16],[6,17,7,18],[6,20,7,20],[6,21,7,22],[18,1,18,2],[19,4,21,4],[7,5,7,6],[6,8,7,8],[6,9,7,10]]}
[]
[null,null,null,null,"Table C 1 - Physical supply and use of wood in the rough"]
[null,null,null,null,"(a) Supply of wood in the rough by all industries, in 1000 m3 over bark"]
[null,null,"GEO =>",null,"Country:",{"$f":"'GETTING STARTED'!G9","v":""},{"$f":"IF('GETTING STARTED'!E9=\"\",\"\",'GETTING STARTED'!E9)","v":""}]
[null,null,"TIME=>",null,"Year:",{"$f":"IF('GETTING STARTED'!E10=\"\",\"\",'GETTING STARTED'!E10)","v":""},{"$f":"CONCATENATE(\"Currency: \", 'GETTING STARTED'!$E$11)","v":"Currency: "}]
[]
{"$rows_left_out":27}
{"sheet":"EFA C 1b","index":15,"n_rows":33,"n_cols":31,"rows_kept":33,"cut":false,"hidden":false,"merged":[[6,24,7,24],[18,1,18,2],[6,25,7,26],[6,28,7,28],[6,29,7,30],[6,20,7,20],[6,21,7,22],[30,4,30,18],[33,4,33,18],[19,4,21,4],[7,5,7,6],[6,4,6,6],[6,8,7,8],[6,9,7,10],[6,12,7,12],[6,13,7,14],[6,16,7,16],[6,17,7,18]]}
[]
[null,null,null,null,"Table C 1 - Physical supply and use of wood in the rough"]
[null,null,null,null,"(b) Use of wood in the rough by all industries, in 1000 m3 over bark"]
[null,null,"GEO =>",null,"Country:",{"$f":"'GETTING STARTED'!G9","v":""},{"$f":"IF('GETTING STARTED'!E9=\"\",\"\",'GETTING STARTED'!E9)","v":""}]
[null,null,"TIME=>",null,"Year:",{"$f":"IF('GETTING STARTED'!E10=\"\",\"\",'GETTING STARTED'!E10)","v":""},{"$f":"CONCATENATE(\"Currency: \", 'GETTING STARTED'!$E$11)","v":"Currency: "}]
[]
{"$rows_left_out":28}
{"sheet":"ErrorLog","index":16,"n_rows":1,"n_cols":7,"rows_kept":1,"cut":false,"hidden":false,"merged":[]}
["Link to Error","Validation Rule","Cell","Sheet","Description","Severity","Former Color"]

{"sheet":"Changelog","index":17,"n_rows":12,"n_cols":7,"rows_kept":12,"cut":false,"hidden":true,"merged":[]}
["Change","Changed by","SheetName","Cell","Version","Date","REMARKS"]
["Adapt questionnaire to Waste standards","CDD","All",null,"v00m19","2021-06-01"]
["Add footnotes/flags columns (priority sheets)","CDD","All data sheets",null,"v01m19","2021-06-21","Sent to VV for comments"]
["Add footnotes/flags columns non-priority sheets)","CDD","All data sheets",null,"v02m19","2021-06-22"]
["Apply comments by VV.","CDD","All data sheets",null,"v03","2021-06-28","Delete macros, resolve comments in yellow from version V02m19. Add missing columns in table B 3a."]
["Apply new comments by VV (mail 30/07/2021)","CDD","Several sheets",null,"v04m19","2021-08-02","- Worksheet INDEX: \no We should probable remove table A1b (land in monetary) from the list of core tables. Reason: in the legislative proposal that we are working on and which is based on EFA, this table is not included among ‘core’ (upon request by MS). I think the easiest way would be just to change the colour coding, the position of the table could stay the same. (any views on this?)\no Cell D24 – name of table seems unfinished in the hyperlink\no Cell C30 – should read ‘TABLES C1 - PHYSICAL SUPPLY AND USE OF WOOD IN THE ROUGH’\no Cell C33 – error log – this functionality would be very helpful if feasible to implement in the time we have\n- Worksheet basic instruction:\no Row 51 needs expanding (make it higher) as the last word is missing (not visible).\no Row 65: ‘Please do not report footnotes that elaborate on e.g. source data and compilation methods; these are to be described in the quality report and the metadata sheets.’ – this would be best practice; however, EFA does not have QR or country metadata sheet (and we will might not be ready with them by the launch of the 2022 EFA data collection) – to be discussed with Monika\no All text under the heading Definitions – could you please flag it ‘for further development; for now? The issue is that 1) those references actually use different definitions for some assets; 2) we are probably moving to FAO-FRA 2020 in the legal act (which makes almost no practical difference in terms of content, but still to have a recent reference); and 3) in reality, the SEEA Agriculture and forestry uses the definitions of SEEA Central framework, so that reference can be deleted from definitions; 4) we keep referring to CPA 2015 in EFA; however that does not seem to be the correct reference. It should read CPA ver.2.1 CPA Ver. 2.1 - CPA - Eurostat (europa.eu)\no Row 80: I don’t understand why XXXXX_EFADATA_A – is it not EFA_ACC_A? (in any case, we should align with ongoing work on the legal act. There A&A are proposing to call it only “forest accounts” – so we could drop the E from the acronym (?)\no Row 94: the hyperlink leads to the “waste” methodology” \no Row 96: this info is best practice; however, for now we do not have an EFA manual, hence we need to put this text about guidelines on hold. We will add it once EFA manual is ready \no All Tables A except for 1Ab (i.e. except for the one that is not core anymore), we will need to change the colour coding – grey, to align with the new legal act. Grey cells would be as follows:\nDescription  \n Opening area (December t-1)\n   Forest  \n     Forest available for wood supply  \n     Forest not available for wood supply  \n   Other wooded land  \n     Of which available for wood supply  \n   Other land with tree cover available for wood supply *1  \no In table A1b all cells would be white (as lower priority). Cell with formulas would remain dotted (but white, not grey).\no Table A2a – row 31, footnote 5 removals – could you please flag it for further development? We say removals are like in JFSQ; however, JFSQ is underbark, hence we probably need to add a statement “conversion to overbark is needed, if applicable” or something along those lines.\n\n"]
{"$rows_left_out":7}
{"sheet":"Lists","index":18,"n_rows":42,"n_cols":11,"rows_kept":42,"cut":false,"hidden":true,"merged":[[1,9,1,10],[5,9,5,10],[10,9,10,10],[15,9,15,10]]}
["Country label","Country code","Currency","Valid flags (obs_status)","Label",null,"Valid flags (obs_conf)","Label",null,"Textual variables","String"]
["Belgium","BE","EUR","B","break in time series",null,"C","confidential",null,"Institutional names"]
["Bulgaria","BG","BGN","E","estimated data",null,"D","secondary confidentiality set by the sender",null,"Eurostat Text","Statistical Office of the European Union"]
["Czechia","CZ","CZK","P","provisional",null,null,null,null,"Directorate Text","Directorate E: Sectoral and regional statistics"]
["Denmark","DK","DKK","BE",null,null,null,null,null,"Unit Text","Unit E-2: Environmental statistics and accounts; sustainable development"]
["Germany","DE","EUR","BP",null,null,null,null,null,"Data collection information"]
{"$rows_left_out":37}
{"sheet":"Mandatory","index":19,"n_rows":4,"n_cols":9,"rows_kept":4,"cut":false,"hidden":true,"merged":[]}
["Severity","SheetName","Top Left Cell","Bottom Right Cell","Row Step","Column Step","Empty Is Valid If Footnote Exists","Footnote Shift From Value"]
["Error","GETTING STARTED","E9","E10",1,999,"NO",999]
["Error","GETTING STARTED","D15","D17",2,999,"NO",999]
["Error","GETTING STARTED","D23","D23",2,999,"NO",999,"Notice \"Telephone\" and \"unit \" are not mandatory"]

{"sheet":"Summations","index":20,"n_rows":133,"n_cols":13,"rows_kept":133,"cut":false,"hidden":true,"merged":[[34,5,34,6]]}
["Severity","Sheet Name","List of Cells\n (first block)","First Total Cell (first block)","Last Total Cell\n(Last block)","Row Block Repetition Step","Column Block Repetition Step","Greater or Equal","Valid Tolerance","Only if all data is available","Non compliance Is Valid If Footnote Exists","Footnote Shift From Value","Display text in error"]
["Error","EFA A 1a","H10,H11","H9","T9",999,4,"EQ",0.1,"YES","NO",3,"Value for Forest must be equal to the sum of values for FAWS and FNAWS"]
["Error","EFA A 1a","AB10,AB11","AB9","AB9",999,999,"EQ",0.1,"YES","NO",3,"Value for Forest must be equal to the sum of values for FAWS and FNAWS"]
["Error","EFA A 1a","H13","H12","T12",999,4,"GE",0.1,"YES","NO",3,"Value for Other Wooded Land must be greater or equal to OWLAWS"]
["Error","EFA A 1a","AB13","AB12","AB12",999,4,"GE",0.1,"YES","NO",3,"Value for Other Wooded Land must be greater or equal to OWLAWS"]
["Error","EFA A 1b","H10,H11","H9","X9",999,4,"EQ",0.1,"YES","NO",3,"Value for Forest must be equal to the sum of values for FAWS and FNAWS"]
{"$rows_left_out":128}
{"sheet":"MustNotBeNegative","index":21,"n_rows":5,"n_cols":6,"rows_kept":5,"cut":false,"hidden":true,"merged":[]}
["Severity","SheetName","TopLeftCell","BottomRightCell","RowStep","ColumnStep"]
["Error","EFA A 1a","P9","P14",1,999]
["Error","EFA A 1b","P9","P14",1,999]
["Error","EFA A 2a","P9","T14",1,4]
["Error","EFA A 2b","P9","T14",1,4]