{"text_format":"1","workbook":"xlsx","n_sheets":27,"sheets":["Codes and labels","COVER","INDEX","Basic instructions","Validation rules","Methodology","METADATA","GETTING STARTED","Footnotes list","PEDS_ESA","Input for ECR-range","Catalogue of measures","ECR - range","Implicit transfers","ErrorLog","Changelog","Lists","MacroBehaviour","x Locks","IsFormula","StandardFootnotes","FootnoteContent","Summations","MustNotBeNegative","IsNumeric","Thresholds","Mandatory"],"not_rendered":{"charts":0,"images":4,"macros":1,"external_links":0,"defined_names":14,"comments":2,"pivot_tables":0},"unopened":[],"bounds":{"document_bytes":16777216,"sheet_cells":100000,"rows_first":2000,"rows_last":500,"rows_between":2000,"halvings":0,"cell_chars":16384,"cell_head_chars":4096},"cells_cut":0,"cells_raw":0,"read":"whole","date_system":"1900"}

{"sheet":"Codes and labels","index":0,"n_rows":51,"n_cols":2,"rows_kept":51,"cut":false,"hidden":true,"merged":[]}
[]
[]
["Format and content still pending, but a list of the meaning of the codes (the ones in the heading of the sheets, the hidden ones NO)"]
["NA_ITEM: Codes in National Accounts (ESA 2010) for transactions"]
["D2","Taxes on production and imports"]
["D3","Subsidies"]
["D6","Social contributions and benefits"]
["D7","Other current transfers"]
{"$rows_left_out":44}
{"sheet":"COVER","index":1,"n_rows":9,"n_cols":3,"rows_kept":9,"cut":false,"hidden":false,"merged":[]}
[]
[]
[null,null,{"$f":"UPPER(Lists!K3)","v":"STATISTICAL OFFICE OF THE EUROPEAN UNION"}]
[]
[null,null,{"$f":"Lists!K4","v":"Directorate E: Sectoral and regional statistics"}]
[null,null,{"$f":"Lists!K5","v":"Unit E-2: Environmental statistics and accounts; sustainable development"}]
[null,null,{"$f":"UPPER(Lists!K7)","v":"ANNUAL REPORTING OF POTENTIAL ENVIRONMENTALLY DAMAGING SUBSIDIES (PEDS)"}]
[null,null,{"$f":"CONCATENATE(Lists!K8,\" DATA COLLECTION\")","v":"2023 DATA COLLECTION"}]
{"$rows_left_out":2}
{"sheet":"INDEX","index":2,"n_rows":26,"n_cols":5,"rows_kept":26,"cut":false,"hidden":false,"merged":[[23,2,23,4],[1,2,1,4],[3,2,3,4],[4,2,4,4],[6,2,6,4],[8,2,8,4],[14,2,14,4]]}
[]
[]
[null,null,null,null,{"$f":"UPPER(Lists!K3)","v":"STATISTICAL OFFICE OF THE EUROPEAN UNION"}]
[null,null,{"$f":"UPPER(Lists!K7)","v":"ANNUAL REPORTING OF POTENTIAL ENVIRONMENTALLY DAMAGING SUBSIDIES (PEDS)"}]
[null,null,{"$f":"CONCATENATE(Lists!K8,\" DATA COLLECTION\")","v":"2023 DATA COLLECTION"}]
[]
[null,null," INDEX - STRUCTURE OF THE QUESTIONNAIRE"]
[]
{"$rows_left_out":19}
{"sheet":"Basic instructions","index":3,"n_rows":104,"n_cols":6,"rows_kept":104,"cut":false,"hidden":false,"merged":[[87,2,87,4],[34,3,34,5],[28,3,28,5],[10,2,10,5],[11,2,11,5],[12,2,12,5],[13,2,13,5],[14,2,14,5],[15,2,15,5],[16,2,16,5],[18,2,18,5],[20,2,20,5],[22,2,22,5],[27,2,27,5],[72,2,72,5],[63,3,63,5],[9,2,9,5],[3,2,3,5],[4,2,4,5],[6,2,6,5],[7,2,7,5],[8,2,8,5],[64,3,64,5],[69,3,69,5],[56,2,56,5],[58,2,58,5],[61,2,61,5],[62,3,62,5],[67,2,67,5],[68,3,68,5],[65,2,65,5],[57,2,57,5],[36,2,36,5],[38,2,38,5],[43,2,43,5],[44,2,44,5],[45,2,45,5],[54,2,54,5],[47,2,47,5],[49,2,49,5],[50,2,50,5],[52,2,52,5],[104,2,104,5],[80,2,80,5],[81,2,81,5],[83,2,83,5],[85,2,85,5],[86,2,86,5],[88,2,88,5],[89,2,89,5],[90,2,90,5],[91,2,91,5],[103,2,103,5],[100,2,100,5],[101,2,101,5],[96,2,96,5],[97,2,97,5],[102,2,102,5],[73,2,73,5],[75,2,75,5],[76,2,76,5],[78,2,78,5],[79,2,79,5],[93,2,93,5],[94,2,94,5],[95,2,95,5],[98,2,98,5],[99,2,99,5]]}
[]
[]
[null,null,null,null,null,{"$f":"UPPER(Lists!K3)","v":"STATISTICAL OFFICE OF THE EUROPEAN UNION"}]
[null,null,{"$f":"UPPER(Lists!K7)","v":"ANNUAL REPORTING OF POTENTIAL ENVIRONMENTALLY DAMAGING SUBSIDIES (PEDS)"}]
[null,null,{"$f":"CONCATENATE(Lists!K8,\" DATA COLLECTION\")","v":"2023 DATA COLLECTION"}]
[]
[null,null,"BASIC INSTRUCTIONS"]
[null,null,"Eurostat invites you to read carefully the “Basic instructions” tab before editing the data worksheets: “PEDS_ESA” ,“Input for ECR-range” and “Catalogue of measures”.  This EXCEL workbook is the questionnaire. Please do not  delete or add rows in the questionnaire. Note also that the questionnaire has hidden columns used for internal data processing."]
{"$rows_left_out":97}
{"sheet":"Validation rules","index":4,"n_rows":27,"n_cols":6,"rows_kept":27,"cut":false,"hidden":false,"merged":[[9,2,9,5],[10,2,10,5],[14,2,14,5],[3,2,3,5],[4,2,4,5],[6,2,6,5],[7,2,7,5],[8,2,8,5],[21,2,21,5],[26,2,26,5],[22,2,22,5],[18,2,18,5],[19,2,19,5],[20,2,20,5]]}
[]
[]
[null,null,null,null,null,{"$f":"UPPER(Lists!K3)","v":"STATISTICAL OFFICE OF THE EUROPEAN UNION"}]
[null,null,{"$f":"UPPER(Lists!K7)","v":"ANNUAL REPORTING OF POTENTIAL ENVIRONMENTALLY DAMAGING SUBSIDIES (PEDS)"}]
[null,null,{"$f":"CONCATENATE(Lists!K8,\" DATA COLLECTION\")","v":"2023 DATA COLLECTION"}]
[]
[null,null,"VALIDATION RULES"]
[null,null,"Table of contents"]
{"$rows_left_out":20}
{"sheet":"Methodology","index":5,"n_rows":147,"n_cols":6,"rows_kept":147,"cut":false,"hidden":false,"merged":[[144,2,144,5],[128,2,128,5],[129,2,129,5],[130,2,130,5],[131,2,131,5],[147,2,147,5],[124,2,124,5],[125,2,125,5],[126,2,126,5],[143,2,143,5],[136,2,136,5],[140,2,140,5],[137,2,137,5],[145,2,145,5],[146,2,146,5],[141,2,141,5],[142,2,142,5],[97,2,97,5],[98,2,98,5],[80,2,80,5],[82,2,82,5],[81,2,81,5],[83,2,83,5],[85,2,85,5],[84,2,84,5],[87,2,87,5],[86,2,86,5],[88,2,88,5],[89,2,89,5],[90,2,90,5],[91,2,91,5],[93,2,93,5],[94,2,94,5],[95,2,95,5],[3,2,3,5],[4,2,4,5],[6,2,6,5],[7,2,7,5],[8,2,8,5],[19,2,19,5],[21,2,21,5],[23,2,23,5],[38,2,38,5],[34,2,34,5],[35,2,35,5],[36,2,36,5],[37,2,37,5],[9,2,9,5],[20,2,20,5],[10,2,10,5],[11,2,11,5],[12,2,12,5],[13,2,13,5],[14,2,14,5],[15,2,15,5],[30,2,30,5],[31,2,31,5],[32,2,32,5],[39,2,39,5],[72,2,72,5],[73,2,73,5],[74,2,74,5],[75,2,75,5],[76,2,76,5],[77,2,77,5],[40,2,40,5],[41,2,41,5],[78,2,78,5],[79,2,79,5],[42,2,42,5],[43,2,43,5],[45,2,45,5],[44,2,44,5],[58,2,58,5],[46,2,46,5],[47,2,47,5],[48,2,48,5],[49,2,49,5],[53,2,53,5],[54,2,54,5],[57,2,57,5],[59,2,59,5],[60,2,60,5],[100,2,100,5],[109,2,109,5],[110,2,110,5],[111,2,111,5],[123,2,123,5],[96,2,96,5],[55,2,55,5],[56,2,56,5],[50,2,50,5],[51,2,51,5],[52,2,52,5],[61,2,61,5],[62,2,62,5],[63,2,63,5],[64,2,64,5],[67,2,67,5],[102,2,102,5],[101,2,101,5],[68,2,68,5],[65,2,65,5],[66,2,66,5],[69,2,69,5],[70,2,70,5],[71,2,71,5],[103,2,103,5],[104,2,104,5],[105,2,105,5],[106,2,106,5],[107,2,107,5],[108,2,108,5],[138,2,138,5],[139,2,139,5],[92,2,92,5],[112,2,112,5],[113,2,113,5],[114,2,114,5],[115,2,115,5],[116,2,116,5],[117,2,117,5],[118,2,118,5],[127,2,127,5],[133,2,133,5],[119,2,119,5],[120,2,120,5],[121,2,121,5],[122,2,122,5],[135,2,135,5],[99,2,99,5]]}
[]
[]
[null,null,null,null,null,{"$f":"UPPER(Lists!K3)","v":"STATISTICAL OFFICE OF THE EUROPEAN UNION"}]
[null,null,{"$f":"UPPER(Lists!K7)","v":"ANNUAL REPORTING OF POTENTIAL ENVIRONMENTALLY DAMAGING SUBSIDIES (PEDS)"}]
[null,null,{"$f":"CONCATENATE(Lists!K8,\" DATA COLLECTION\")","v":"2023 DATA COLLECTION"}]
[]
[null,null,"METHODOLOGY AND LEGAL ACTS"]
[null,null,"Table of contents"]
{"$rows_left_out":140}
{"sheet":"METADATA","index":6,"n_rows":29,"n_cols":6,"rows_kept":29,"cut":false,"hidden":false,"merged":[[29,2,29,5],[28,1,28,5],[3,2,3,5],[4,2,4,5],[6,2,6,5],[5,1,5,5],[7,1,7,5],[8,2,8,5],[9,1,9,5],[20,2,20,5],[22,2,22,5],[24,2,24,5],[26,2,26,5],[19,1,19,5],[21,1,21,5],[23,1,23,5],[25,1,25,5],[10,2,10,5],[12,2,12,5],[14,2,14,5],[16,2,16,5],[18,2,18,5],[11,1,11,5],[13,1,13,5],[15,1,15,5],[17,1,17,5]]}
[]
[]
[null,null,null,null,null,{"$f":"UPPER(Lists!K3)","v":"STATISTICAL OFFICE OF THE EUROPEAN UNION"}]
[null,null,{"$f":"UPPER(Lists!K7)","v":"ANNUAL REPORTING OF POTENTIAL ENVIRONMENTALLY DAMAGING SUBSIDIES (PEDS)"}]
[null,null,{"$f":"CONCATENATE(Lists!K8,\" DATA COLLECTION\")","v":"2023 DATA COLLECTION"}]
[null,"1. Statistical description. Please, explain any particularity, concerning statistical units, coverage, statistical population, classification system etc that deviates or complements the general guidance provided for PEDS compilation"]
[]
[null,"2. Please indicate how far back you would be in a position to report? (Currently 2019)"]
{"$rows_left_out":22}
{"sheet":"GETTING STARTED","index":7,"n_rows":22,"n_cols":7,"rows_kept":22,"cut":false,"hidden":false,"merged":[[17,3,17,6],[19,3,19,6],[21,3,21,6],[22,2,22,6],[3,2,3,6],[4,2,4,6],[6,2,6,6],[11,2,11,6],[13,3,13,6],[15,3,15,6]]}
[]
[]
[null,null,null,null,null,null,{"$f":"UPPER(Lists!K3)","v":"STATISTICAL OFFICE OF THE EUROPEAN UNION"}]
[null,null,{"$f":"UPPER(Lists!K7)","v":"ANNUAL REPORTING OF POTENTIAL ENVIRONMENTALLY DAMAGING SUBSIDIES (PEDS)"}]
[null,null,{"$f":"CONCATENATE(Lists!K8,\" DATA COLLECTION\")","v":"2023 DATA COLLECTION"}]
[]
[null,null," GETTING STARTED"]
[]
{"$rows_left_out":15}
{"sheet":"Footnotes list","index":8,"n_rows":58,"n_cols":5,"rows_kept":58,"cut":false,"hidden":false,"merged":[[1,3,1,4],[3,3,3,4],[4,3,4,4],[6,3,6,4],[7,3,7,4]]}
[]
[]
[null,null,null,null,{"$f":"UPPER(Lists!K3)","v":"STATISTICAL OFFICE OF THE EUROPEAN UNION"}]
[null,null,null,{"$f":"UPPER(Lists!K7)","v":"ANNUAL REPORTING OF POTENTIAL ENVIRONMENTALLY DAMAGING SUBSIDIES (PEDS)"}]
[null,null,null,{"$f":"CONCATENATE(Lists!K8,\" DATA COLLECTION\")","v":"2023 DATA COLLECTION"}]
[]
[null,null,null,"EXPLANATORY FOOTNOTES"]
[null,null,null,{"$f":"IF('GETTING STARTED'!E9=\"\",\"\",'GETTING STARTED'!E9)","v":""}]
{"$rows_left_out":51}
{"sheet":"PEDS_ESA","index":9,"n_rows":54,"n_cols":26,"rows_kept":54,"cut":false,"hidden":false,"merged":[[2,5,4,5],[2,6,4,25],[6,24,6,25],[21,9,21,10],[21,14,21,15],[21,19,21,20],[21,24,21,25],[36,9,36,10],[36,14,36,15],[36,19,36,20],[36,24,36,25],[6,9,6,10],[6,14,6,15],[6,19,6,20]]}
[]
[]
[null,null,null,null,"GEO",{"$f":"IF('GETTING STARTED'!E9=\"\",\"Country not selected\", \"  \" & UPPER( 'GETTING STARTED'!E9))","v":"Country not selected"},"ESA TRANSFERS - Explicit transfers"]
[null,null,null,null,{"$f":"IF('GETTING STARTED'!G9=\"\",\"\",'GETTING STARTED'!G9)","v":""}]
[]
[]
[null,null,"NACE_R2","unit","PEDS"," Fossil fuels\nESA transfers related to fossil fuels paid to institutional sectors \n(In millions national currency)",2019,"Standard footnote","Confidentiality footnote","Explanatory footnote",null,2020,"Standard footnote","Confidentiality footnote","Explanatory footnote",null,2021,"Standard footnote","Confidentiality footnote","Explanatory footnote",null,2022,"Standard footnote","Confidentiality footnote","Explanatory footnote"]
[null,null,"TOTAL_HH","MIO_NAC","PEDS_FF","Total Subsidies on Fossil Fuels paid (Corporations + households)",{"$f":"IF(COUNT(G9,G10)<2,\"\",SUM(G9,G10))","v":""},null,null,null,{"$f":"IF(TRIM(J8)=\"\", \"\", IF(VLOOKUP(J8,'Footnotes list'!$D$9:$E$58,2,FALSE)=0,\"\",VLOOKUP(J8,'Footnotes list'!$D$9:$E$58,2,FALSE) ) )","v":""},{"$f":"IF(COUNT(L9,L10)<2,\"\",SUM(L9,L10))","v":""},null,null,null,{"$f":"IF(TRIM(O8)=\"\", \"\", IF(VLOOKUP(O8,'Footnotes list'!$D$9:$E$58,2,FALSE)=0,\"\",VLOOKUP(O8,'Footnotes list'!$D$9:$E$58,2,FALSE) ) )","v":""},{"$f":"IF(COUNT(Q9,Q10)<2,\"\",SUM(Q9,Q10))","v":""},null,null,null,{"$f":"IF(TRIM(T8)=\"\", \"\", IF(VLOOKUP(T8,'Footnotes list'!$D$9:$E$58,2,FALSE)=0,\"\",VLOOKUP(T8,'Footnotes list'!$D$9:$E$58,2,FALSE) ) )","v":""},{"$f":"IF(COUNT(V9,V10)<2,\"\",SUM(V9,V10))","v":""},null,null,null,{"$f":"IF(TRIM(Y8)=\"\", \"\", IF(VLOOKUP(Y8,'Footnotes list'!$D$9:$E$58,2,FALSE)=0,\"\",VLOOKUP(Y8,'Footnotes list'!$D$9:$E$58,2,FALSE) ) )","v":""}]
{"$rows_left_out":47}
{"sheet":"Input for ECR-range","index":10,"n_rows":38,"n_cols":26,"rows_kept":38,"cut":false,"hidden":false,"merged":[[2,5,4,5],[2,6,4,25],[21,9,21,10],[21,14,21,15],[21,19,21,20],[21,24,21,25],[6,9,6,10],[6,14,6,15],[6,19,6,20],[6,24,6,25]]}
[]
[]
[null,null,null,null,"GEO",{"$f":"IF('GETTING STARTED'!E9=\"\",\"Country not selected\", \"  \" & UPPER( 'GETTING STARTED'!E9))","v":"Country not selected"},"Taxes and CO2 emissions for average Effective Carbon Rates (ECR)"]
[null,null,null,null,{"$f":"IF('GETTING STARTED'!G9=\"\",\"\",'GETTING STARTED'!G9)","v":""}]
[]
[]
[null,null,"NACE_R2","unit","PEDS","Taxes imposed to fossil fuel combustion\nby institutional sector, in million national currency",2019,"Standard footnote","Confidentiality footnote","Explanatory footnote",null,2020,"Standard footnote","Confidentiality footnote","Explanatory footnote",null,2021,"Standard footnote","Confidentiality footnote","Explanatory footnote",null,2022,"Standard footnote","Confidentiality footnote","Explanatory footnote"]
[null,null,"TOTAL_HH","MIO_NAC","NAP","TOTAL taxes paid (Corporations + households)",{"$f":"IF(COUNT(G9,G10)<2,\"\",SUM(G9,G10))","v":""},null,null,null,{"$f":"IF(TRIM(J8)=\"\", \"\", IF(VLOOKUP(J8,'Footnotes list'!$D$9:$E$58,2,FALSE)=0,\"\",VLOOKUP(J8,'Footnotes list'!$D$9:$E$58,2,FALSE) ) )","v":""},{"$f":"IF(COUNT(L9,L10)<2,\"\",SUM(L9,L10))","v":""},null,null,null,{"$f":"IF(TRIM(O8)=\"\", \"\", IF(VLOOKUP(O8,'Footnotes list'!$D$9:$E$58,2,FALSE)=0,\"\",VLOOKUP(O8,'Footnotes list'!$D$9:$E$58,2,FALSE) ) )","v":""},{"$f":"IF(COUNT(Q9,Q10)<2,\"\",SUM(Q9,Q10))","v":""},null,null,null,{"$f":"IF(TRIM(T8)=\"\", \"\", IF(VLOOKUP(T8,'Footnotes list'!$D$9:$E$58,2,FALSE)=0,\"\",VLOOKUP(T8,'Footnotes list'!$D$9:$E$58,2,FALSE) ) )","v":""},{"$f":"IF(COUNT(V9,V10)<2,\"\",SUM(V9,V10))","v":""},null,null,null,{"$f":"IF(TRIM(Y8)=\"\", \"\", IF(VLOOKUP(Y8,'Footnotes list'!$D$9:$E$58,2,FALSE)=0,\"\",VLOOKUP(Y8,'Footnotes list'!$D$9:$E$58,2,FALSE) ) )","v":""}]
{"$rows_left_out":31}
{"sheet":"Catalogue of measures","index":11,"n_rows":41,"n_cols":44,"rows_kept":41,"cut":false,"hidden":false,"merged":[[18,1,18,6],[19,1,19,6],[20,1,20,6],[21,1,21,6],[14,1,14,6],[13,1,13,6],[15,1,15,6],[16,1,16,6],[17,1,17,6],[1,1,1,6],[4,1,4,6],[3,1,3,6],[11,1,11,6],[12,1,12,6],[9,1,9,6],[10,1,10,6],[5,1,5,6],[7,1,7,6],[37,17,39,25],[37,28,39,32],[37,35,39,43],[28,1,28,6],[22,1,22,6],[23,1,23,6],[24,1,24,6],[25,1,25,6],[26,1,26,6],[27,1,27,6],[37,1,39,10]]}
[]
[null,"CATALOGUE OF MEASURES"]
[]
[null,"This tab might be considered as a hybrid between data reporting and provision of information/metadata. The data tabs \"PEDS_ESA\" represents aggregated measures that are more detailed here."]
[null,"The provision of technical details, described in this tab, are extremely useful for data validation. It will allow Eurostat to gain experience on the transfers existing in your country and, therefore, be able to streamline the methodology and guidance in the future data collections."]
[null,"Eurostat lets countries decide on the level of details they would like to report here."]
[]
[null,"Countries are free to insert new lines if necessary under each table."]
{"$rows_left_out":34}
{"sheet":"ECR - range","index":12,"n_rows":35,"n_cols":26,"rows_kept":35,"cut":false,"hidden":false,"merged":[[2,5,4,5],[2,6,4,25],[21,9,21,10],[21,14,21,15],[21,19,21,20],[21,24,21,25],[6,9,6,10],[6,14,6,15],[6,19,6,20],[6,24,6,25]]}
[]
[]
[null,null,null,null,"GEO",{"$f":"IF('GETTING STARTED'!E9=\"\",\"Country not selected\", \"  \" & UPPER( 'GETTING STARTED'!E9))","v":"Country not selected"},"Average Effective Carbon Rates (AECR)"]
[null,null,null,null,{"$f":"IF('GETTING STARTED'!G9=\"\",\"\",'GETTING STARTED'!G9)","v":""}]
[]
[]
[null,null,"NACE_R2","UNIT","PEDS","Average ECR and emission range\nby institutional sector, in national currency per tonne",2019,"Standard footnote","Confidentiality footnote","Explanatory footnote",null,2020,"Standard footnote","Confidentiality footnote","Explanatory footnote",null,2021,"Standard footnote","Confidentiality footnote","Explanatory footnote",null,2022,"Standard footnote","Confidentiality footnote","Explanatory footnote"]
[null,null,"TOTAL_HH","NAC_T","NAP","Average (Corporations + households)",{"$f":"IF(COUNT('Input for ECR-range'!G8,'Input for ECR-range'!G23)<2,\"\",'Input for ECR-range'!G8*1000/'Input for ECR-range'!G23)","v":""},null,null,null,{"$f":"IF(TRIM(J8)=\"\", \"\", IF(VLOOKUP(J8,'Footnotes list'!$D$9:$E$58,2,FALSE)=0,\"\",VLOOKUP(J8,'Footnotes list'!$D$9:$E$58,2,FALSE) ) )","v":""},{"$f":"IF(COUNT('Input for ECR-range'!L8,'Input for ECR-range'!L23)<2,\"\",'Input for ECR-range'!L8*1000/'Input for ECR-range'!L23)","v":""},null,null,null,{"$f":"IF(TRIM(O8)=\"\", \"\", IF(VLOOKUP(O8,'Footnotes list'!$D$9:$E$58,2,FALSE)=0,\"\",VLOOKUP(O8,'Footnotes list'!$D$9:$E$58,2,FALSE) ) )","v":""},{"$f":"IF(COUNT('Input for ECR-range'!Q8,'Input for ECR-range'!Q23)<2,\"\",'Input for ECR-range'!Q8*1000/'Input for ECR-range'!Q23)","v":""},null,null,null,{"$f":"IF(TRIM(T8)=\"\", \"\", IF(VLOOKUP(T8,'Footnotes list'!$D$9:$E$58,2,FALSE)=0,\"\",VLOOKUP(T8,'Footnotes list'!$D$9:$E$58,2,FALSE) ) )","v":""},{"$f":"IF(COUNT('Input for ECR-range'!V8,'Input for ECR-range'!V23)<2,\"\",'Input for ECR-range'!V8*1000/'Input for ECR-range'!V23)","v":""},null,null,null,{"$f":"IF(TRIM(Y8)=\"\", \"\", IF(VLOOKUP(Y8,'Footnotes list'!$D$9:$E$58,2,FALSE)=0,\"\",VLOOKUP(Y8,'Footnotes list'!$D$9:$E$58,2,FALSE) ) )","v":""}]
{"$rows_left_out":28}
{"sheet":"Implicit transfers","index":13,"n_rows":4,"n_cols":4,"rows_kept":4,"cut":false,"hidden":false,"merged":[]}
[]
[]
[]
[null,null,null,"Free format for countries to report"]

{"sheet":"ErrorLog","index":14,"n_rows":1,"n_cols":7,"rows_kept":1,"cut":false,"hidden":false,"merged":[]}
["Link to Error","Validation Rule","Cell","Sheet","Description","Severity","Former Color"]

{"sheet":"Changelog","index":15,"n_rows":2,"n_cols":8,"rows_kept":2,"cut":false,"hidden":true,"merged":[]}
["Change","Changed by","Change","SheetName","Cell","Version","Date","REMARKS"]
["Adapt to Waste questionnaires standards m24.","CDD",null,"Standard macros",null,1,"2022-10-18"]

{"sheet":"Lists","index":16,"n_rows":40,"n_cols":13,"rows_kept":40,"cut":false,"hidden":false,"merged":[[1,9,1,10],[5,9,5,10],[10,9,10,10],[15,9,15,10]]}
["Country label","Country code",null,"Valid flags (obs_status)","Label",null,"Valid flags (obs_conf)","Label",null,"Textual variables","String",null,"PEDS-2022-DC"]
["Belgium","BE",null,"B","break in time series",null,"C","confidential",null,"Institutional names"]
["Bulgaria","BG",null,"E","estimated data",null,"D","secondary confidentiality set by the sender",null,"Eurostat Text","Statistical Office of the European Union"]
["Czechia","CZ",null,"P","provisional",null,"N","Not to be published",null,"Directorate Text","Directorate E: Sectoral and regional statistics"]
["Denmark","DK",null,"BE",null,null,null,null,null,"Unit Text","Unit E-2: Environmental statistics and accounts; sustainable development"]
["Germany","DE",null,"BP",null,null,null,null,null,"Data collection information"]
["Estonia","EE",null,"EP",null,null,null,null,null,"Data Collection Title","Annual reporting of Potential Environmentally Damaging Subsidies (PEDS)"]
["Ireland","IE",null,"BEP",null,null,null,null,null,"Data Collection Year",2023]
{"$rows_left_out":33}
{"sheet":"MacroBehaviour","index":17,"n_rows":3,"n_cols":7,"rows_kept":3,"cut":false,"hidden":true,"merged":[[0,0,0,2],[0,4,0,6]]}
["COMMON TO ALL (OR MOST) QUESTIONNAIRE",null,null,null,"SPECIFIC TO THIS QUESTIONNAIRE"]
["Parameter","Value","(Valid values)",null,"Parameter","Value","(Valid values)"]
["DevelopementMode",true,"TRUE (during development)\nFALSE (For real reporting and testing)"]

{"sheet":"x Locks","index":18,"n_rows":5,"n_cols":7,"rows_kept":5,"cut":false,"hidden":true,"merged":[]}
["Sheet Name","Top Left Cell","Bottom Right Cell","Row Step","Column Step","Lock Type","Focus Back To"]
["PEDS_ESA","G10","V10",999,5,"Formulas","G8"]
["PEDS_ESA","G25","V25",999,5,"Formulas","G8"]
["Input for ECR-range","G10","V10",999,5,"Formulas","G8"]
["Input for ECR-range","G25","V25",999,5,"Formulas","G8"]

{"sheet":"IsFormula","index":19,"n_rows":10,"n_cols":6,"rows_kept":10,"cut":false,"hidden":true,"merged":[]}
["Severity","Sheet Name","Top Left Cell","Bottom Right Cell","Row Step","Column Step"]
["error","PEDS_ESA","G8","V8",999,5]
["Info","PEDS_ESA","G10","V10",999,5]
["error","PEDS_ESA","G23","V23",999,5]
["Info","PEDS_ESA","G25","V25",999,5]
["error","PEDS_ESA","G38","V50",1,5]
["error","Input for ECR-range","G8","V8",999,5]
["Info","Input for ECR-range","G10","V10",999,5]
{"$rows_left_out":3}
{"sheet":"StandardFootnotes","index":20,"n_rows":15,"n_cols":7,"rows_kept":15,"cut":false,"hidden":true,"merged":[]}
["Severity","SheetName","Top Left Cell","Bottom Right Cell","Row Step","Column Step","Footnote type \n(CONF/STATUS)"]
["error","PEDS_ESA","H8","W20",1,5,"STATUS"]
["error","PEDS_ESA","H23","W35",1,5,"STATUS"]
["error","PEDS_ESA","H38","W50",1,5,"STATUS"]
["error","Input for ECR-range","H8","W20",1,5,"STATUS"]
["error","Input for ECR-range","H23","W35",1,5,"STATUS"]
["error","ECR - range","H8","W20",1,5,"STATUS"]
["error","ECR - range","H23","W35",1,5,"STATUS"]
{"$rows_left_out":8}
{"sheet":"FootnoteContent","index":21,"n_rows":8,"n_cols":7,"rows_kept":8,"cut":false,"hidden":true,"merged":[]}
["Severity","SheetName","TopLeftCell","BottomRightCell","RowStep","ColumnStep","DistanceFromReferenceToText"]
["error","PEDS_ESA","J8","Y20",1,5,1]
["error","PEDS_ESA","J23","Y35",1,5,1]
["error","PEDS_ESA","J38","Y50",1,5,1]
["error","Input for ECR-range","J8","Y20",1,5,1]
["error","Input for ECR-range","J23","Y35",1,5,1]
["error","ECR - range","J8","Y20",1,5,1]
["error","ECR - range","J23","Y35",1,5,1]
{"$rows_left_out":1}
{"sheet":"Summations","index":22,"n_rows":111,"n_cols":13,"rows_kept":111,"cut":false,"hidden":true,"merged":[[12,5,12,6]]}
["Severity","Sheet Name","List of Cells\n (first block)","First Total Cell (first block)","Last Total Cell\n(Last block)","Row Block Repetition Step","Column Block Repetition Step","Greater or Equal","Valid Tolerance","Only if all data is available","Non compliance Is Valid If Footnote Exists","Footnote Shift From Value","Display text in error"]
["Error","PEDS_ESA","G11,G12,G13,G14,G15,G16,G17,G18, G19,G20","G10","V10",999,5,"EQ",0.1,"NO","NO",4,"Total paid to corporations (total NACE) not consistent to the sum of NACE Sections (A to I-U)"]
["Error","PEDS_ESA","G26,G27,G28,G29,G30,G31,G32,G33, G34,G35","G25","V25",999,5,"EQ",0.1,"NO","NO",4,"Total paid to corporations (total NACE) not consistent to the sum of NACE Sections (A to I-U)"]
["Error","PEDS_ESA","G9, G10","G8","V8",999,5,"EQ",0.1,"NO","NO",4,"Total subsidies must be equal to subsidies paid to households + subsidies paid to corporations"]
["Error","PEDS_ESA","G24, G25","G23","V23",999,5,"EQ",0.1,"NO","NO",4,"Total subsidies must be equal to subsidies paid to households + subsidies paid to corporations"]
["Error","PEDS_ESA","G8,G23","G38","V50",1,5,"EQ",0.1,"NO","NO",4,"Total PEDS must be equal to transfers related to fossil fuels + other transfers."]
["Error","Input for ECR-range","G11,G12,G13,G14,G15,G16,G17,G18, G19,G20","G10","V10",999,5,"EQ",0.1,"NO","NO",4,"Total taxes paid by corporations (total NACE) not consistent to the sum of NACE Sections (A to I-U)"]
["Error","Input for ECR-range","G26,G27,G28,G29,G30,G31,G32,G33, G34,G35","G25","V25",999,5,"EQ",0.1,"NO","NO",4,"Total CO2 emissions by corporations (total NACE) not consistent to the sum of NACE Sections (A to I-U)"]
{"$rows_left_out":104}
{"sheet":"MustNotBeNegative","index":23,"n_rows":8,"n_cols":6,"rows_kept":8,"cut":false,"hidden":true,"merged":[]}
["Severity","SheetName","TopLeftCell","BottomRightCell","RowStep","ColumnStep"]
["Error","PEDS_ESA","G8","V20",1,5]
["Error","PEDS_ESA","G23","V35",1,5]
["Error","PEDS_ESA","G38","J50",1,5]
["Error","Input for ECR-range","G8","V20",1,5]
["Error","Input for ECR-range","G23","V35",1,5]
["Error","ECR - range","G8","V20",1,5]
["Error","ECR - range","G23","V35",1,5]
{"$rows_left_out":1}
{"sheet":"IsNumeric","index":24,"n_rows":8,"n_cols":6,"rows_kept":8,"cut":false,"hidden":true,"merged":[]}
["Severity","SheetName","TopLeftCell","BottomRightCell","RowStep","ColumnStep"]
["Error","PEDS_ESA","G8","V20",1,5]
["Error","PEDS_ESA","G23","V35",1,5]
["Error","PEDS_ESA","G38","J50",1,5]
["Error","Input for ECR-range","G8","V20",1,5]
["Error","Input for ECR-range","G23","V35",1,5]
["Error","ECR - range","G8","V20",1,5]
["Error","ECR - range","G23","V35",1,5]
{"$rows_left_out":1}
{"sheet":"Thresholds","index":25,"n_rows":3,"n_cols":10,"rows_kept":3,"cut":false,"hidden":true,"merged":[]}
["Severity","SheetName","Top Left Cell","Bottom Right Cell","Row Step","Column Step","Lower value","Upper value","Error Is Valid If Footnote Exists","Footnote Shift From Value"]
["Error","ECR - range","G24","V35",1,5,0,100,"NO",999]
["Error","ECR - range","G23","V23",1,5,100,100,"NO",999]

{"sheet":"Mandatory","index":26,"n_rows":3,"n_cols":9,"rows_kept":3,"cut":false,"hidden":true,"merged":[]}
["Severity","SheetName","Top Left Cell","Bottom Right Cell","Row Step","Column Step","Empty Is Valid If Footnote Exists","Footnote Shift From Value"]
["Error","GETTING STARTED","E9","E9",1,999,"NO",999,"STANDARD FOR ALL QUESTIONNAIRES"]
["Error","GETTING STARTED","D14","D22",2,999,"NO",999]