{"text_format":"1","workbook":"xlsx","n_sheets":29,"sheets":["COVER","Basic Instructions","GETTING STARTED","Footnotes list","METADATA_Output data","METADATA_Model_Description","METADATA_Sources","Table 1 - Supply","Table 2 - Use","Table 3 - Complementary","Table 4 - Carbon seq_stor","CODES","ErrorLog","Lists","MacroBehaviour","Specific Lists","Locks","Mandatory","IsNumeric","MustNotBeNegative","Summations","x StandardFootnotes","x ContentInHiddenSheets","x Between2Cells","x ForbiddenStrings","x MandatoryAtLeast","x Thresholds","x IsFormula","x FootnoteContent"],"not_rendered":{"charts":0,"images":3,"macros":1,"external_links":0,"defined_names":1,"comments":0,"pivot_tables":0},"unopened":[],"bounds":{"document_bytes":16777216,"sheet_cells":100000,"rows_first":2000,"rows_last":500,"rows_between":2000,"halvings":0,"cell_chars":16384,"cell_head_chars":4096},"cells_cut":0,"cells_raw":0,"read":"whole","date_system":"1900"}

{"sheet":"COVER","index":0,"n_rows":9,"n_cols":3,"rows_kept":9,"cut":false,"hidden":false,"merged":[]}
[]
[]
[null,null,{"$f":"UPPER(Lists!K3)","v":"STATISTICAL OFFICE OF THE EUROPEAN UNION"}]
[]
[null,null,{"$f":" Lists!K4","v":"Directorate E: Sectoral and regional statistics"}]
[null,null,{"$f":" Lists!K5","v":"Unit E-2: Environmental statistics and accounts; sustainable development"}]
{"$rows_left_out":4}
{"sheet":"Basic Instructions","index":1,"n_rows":92,"n_cols":6,"rows_kept":92,"cut":false,"hidden":false,"merged":[[17,2,17,5],[3,2,3,5],[4,2,4,5],[6,2,6,5],[8,2,8,5],[9,2,9,5],[10,2,10,5],[11,2,11,5],[12,2,12,5],[13,2,13,5],[14,2,14,5],[15,2,15,5],[43,2,43,5],[18,2,18,5],[19,2,19,5],[20,2,20,5],[21,2,21,5],[22,2,22,5],[24,2,24,5],[28,2,28,5],[29,2,29,5],[30,2,30,5],[34,2,34,5],[40,2,40,5],[64,2,64,5],[44,2,44,5],[45,2,45,5],[46,2,46,5],[47,2,47,5],[49,2,49,5],[50,2,50,5],[51,2,51,5],[54,2,54,5],[55,3,55,5],[61,2,61,5],[62,2,62,5],[91,2,91,5],[66,2,66,5],[68,2,68,5],[70,2,70,5],[72,2,72,5],[74,2,74,5],[78,2,78,5],[80,2,80,5],[85,2,85,5],[87,2,87,5],[88,2,88,5],[90,2,90,5]]}
[]
[]
[null,null,null,null,null,{"$f":"UPPER( Lists!K3)","v":"STATISTICAL OFFICE OF THE EUROPEAN UNION"}]
[null,null,{"$f":"UPPER( Lists!K7)","v":"ECOSYSTEM SERVICES ACCOUNTS"}]
[null,null,{"$f":"CONCATENATE( Lists!K8,\" DATA COLLECTION\")","v":"2024 DATA COLLECTION"}]
[]
{"$rows_left_out":87}
{"sheet":"GETTING STARTED","index":2,"n_rows":23,"n_cols":7,"rows_kept":23,"cut":false,"hidden":false,"merged":[[14,3,14,6],[3,2,3,6],[4,2,4,6],[6,2,6,6],[8,2,8,3],[12,2,12,6],[16,3,16,6],[18,3,18,6],[20,3,20,6],[22,3,22,6],[23,2,23,6]]}
[]
[]
[null,null,null,null,null,null,{"$f":"UPPER(Lists!K3)","v":"STATISTICAL OFFICE OF THE EUROPEAN UNION"}]
[null,null,{"$f":"UPPER(Lists!K7)","v":"ECOSYSTEM SERVICES ACCOUNTS"}]
[null,null,{"$f":"CONCATENATE(Lists!K8,\" DATA COLLECTION\")","v":"2024 DATA COLLECTION"}]
[]
{"$rows_left_out":18}
{"sheet":"Footnotes list","index":3,"n_rows":58,"n_cols":5,"rows_kept":58,"cut":false,"hidden":false,"merged":[[1,3,1,4],[3,3,3,4],[4,3,4,4],[6,3,6,4],[7,3,7,4]]}
[]
[]
[null,null,null,null,{"$f":"UPPER( Lists!K3)","v":"STATISTICAL OFFICE OF THE EUROPEAN UNION"}]
[null,null,null,{"$f":"UPPER( Lists!K7)","v":"ECOSYSTEM SERVICES ACCOUNTS"}]
[null,null,null,{"$f":"CONCATENATE( Lists!K8,\" DATA COLLECTION\")","v":"2024 DATA COLLECTION"}]
[]
{"$rows_left_out":53}
{"sheet":"METADATA_Output data","index":4,"n_rows":36,"n_cols":11,"rows_kept":36,"cut":false,"hidden":false,"merged":[[1,3,1,10],[6,3,6,10],[7,3,7,10],[3,3,3,10],[4,3,4,10],[5,3,5,10]]}
[]
[]
[]
[null,null,null,"ECOSYSTEM SERVICES ACCOUNTS"]
[]
[null,null,null,"Most headings contain additional instructions for filling requested information. These are shown after clicking on the heading."]
{"$rows_left_out":31}
{"sheet":"METADATA_Model_Description","index":5,"n_rows":18,"n_cols":13,"rows_kept":18,"cut":false,"hidden":false,"merged":[[7,3,7,5],[7,7,7,12],[1,3,1,4],[3,11,3,12],[3,3,3,5],[4,3,4,5],[5,3,5,5],[6,3,6,5],[2,11,2,12]]}
[]
[]
[]
[null,null,null,"ECOSYSTEM SERVICES ACCOUNTS"]
[]
[null,null,null,"Most headings contain additional instructions for filling requested information. These are shown after clicking on the heading."]
{"$rows_left_out":13}
{"sheet":"METADATA_Sources","index":6,"n_rows":30,"n_cols":11,"rows_kept":30,"cut":false,"hidden":false,"merged":[[7,8,7,10],[30,3,30,4],[1,3,1,4],[3,3,3,4],[4,3,4,4],[5,3,5,4],[6,3,6,4],[7,3,7,4]]}
[]
[]
[]
[null,null,null,"ECOSYSTEM SERVICES ACCOUNTS"]
[]
[null,null,null,"Most headings contain additional instructions for filling requested information. These are shown after clicking on the heading."]
{"$rows_left_out":25}
{"sheet":"Table 1 - Supply","index":7,"n_rows":67,"n_cols":58,"rows_kept":67,"cut":false,"hidden":false,"merged":[[5,50,5,53],[6,32,6,33],[6,36,6,37],[6,40,6,41],[6,44,6,45],[6,48,6,49],[5,30,5,33],[5,34,5,37],[5,38,5,41],[5,42,5,45],[5,46,5,49],[1,5,1,54],[6,56,6,57],[6,8,6,9],[5,6,5,9],[6,12,6,13],[5,10,5,13],[6,16,6,17],[5,14,5,17],[6,20,6,21],[5,18,5,21],[6,24,6,25],[6,28,6,29],[5,54,5,57],[6,52,6,53],[5,22,5,25],[5,26,5,29]]}
[]
[null,"GEO =>",{"$f":"IF('GETTING STARTED'!G9=\"\",\"\",'GETTING STARTED'!G9)","v":""},null,null,"Table 1 - Ecosystem services supply table"]
[null,"TIME=>",{"$f":"IF('GETTING STARTED'!E10=\"\",\"\",'GETTING STARTED'!E10)","v":""},null,"Country:",{"$f":"IF('GETTING STARTED'!$E$9=\"\",\"\",'GETTING STARTED'!$E$9)","v":""},{"$f":"IF('GETTING STARTED'!$G$9=\"\",\"\",'GETTING STARTED'!$G$9)","v":""}]
[null,"IND_ACCT","TS",null,"Reference year:",{"$f":"IF('GETTING STARTED'!$E$10=\"\",\"\",'GETTING STARTED'!$E$10)","v":""}]
[]
[null,null,null,null,null,null,1,null,null,null,2,null,null,null,3,null,null,null,4,null,null,null,5,null,null,null,6,null,null,null,7,null,null,null,8,null,null,null,9,null,null,null,10,null,null,null,11,null,null,null,12]
{"$rows_left_out":62}
{"sheet":"Table 2 - Use","index":8,"n_rows":59,"n_cols":30,"rows_kept":59,"cut":false,"hidden":false,"merged":[[6,28,6,29],[1,5,1,26],[6,8,6,9],[6,12,6,13],[6,16,6,17],[6,20,6,21],[6,24,6,25]]}
[]
[null,"GEO =>",{"$f":"IF('GETTING STARTED'!G9=\"\",\"\",'GETTING STARTED'!G9)","v":""},null,null,"Table 2 - Ecosystem services use table"]
[null,"TIME=>",{"$f":"IF('GETTING STARTED'!E10=\"\",\"\",'GETTING STARTED'!E10)","v":""},null,"Country:",{"$f":"IF('GETTING STARTED'!$E$9=\"\",\"\",'GETTING STARTED'!$E$9)","v":""},{"$f":"IF('GETTING STARTED'!$G$9=\"\",\"\",'GETTING STARTED'!$G$9)","v":""}]
[null,"ECOSYST","TOTAL",null,"Reference year:",{"$f":"IF('GETTING STARTED'!$E$10=\"\",\"\",'GETTING STARTED'!$E$10)","v":""}]
[]
[]
{"$rows_left_out":54}
{"sheet":"Table 3 - Complementary","index":9,"n_rows":16,"n_cols":7,"rows_kept":16,"cut":false,"hidden":false,"merged":[[1,4,1,6]]}
[]
[null,"GEO =>",{"$f":"IF('GETTING STARTED'!G9=\"\",\"\",'GETTING STARTED'!G9)","v":""},null,"Table 3 - Complementary data"]
[null,"TIME=>",{"$f":"IF('GETTING STARTED'!E10=\"\",\"\",'GETTING STARTED'!E10)","v":""},null,"Country:",{"$f":"IF('GETTING STARTED'!$E$9=\"\",\"\",'GETTING STARTED'!$E$9)","v":""},{"$f":"IF('GETTING STARTED'!$G$9=\"\",\"\",'GETTING STARTED'!$G$9)","v":""}]
[null,"IND_ACCT","TU",null,"Reference year:",{"$f":"IF('GETTING STARTED'!$E$10=\"\",\"\",'GETTING STARTED'!$E$10)","v":""}]
[]
[]
{"$rows_left_out":11}
{"sheet":"Table 4 - Carbon seq_stor","index":10,"n_rows":22,"n_cols":19,"rows_kept":22,"cut":false,"hidden":true,"merged":[[1,5,1,18]]}
[]
[null,null,null,null,null,"Table 4 - Carbon stock account by ecosystem type"]
[null,"GEO =>",{"$f":"IF('GETTING STARTED'!E10=\"\",\"\",'GETTING STARTED'!E10)","v":""},null,null,"Country:",{"$f":"IF('GETTING STARTED'!$E$9=\"\",\"\",'GETTING STARTED'!$E$9)","v":""}]
[null,"TIME=>",{"$f":"IF('GETTING STARTED'!E10=\"\",\"\",'GETTING STARTED'!E10)","v":""},null,null,"Reference year:",{"$f":"IF('GETTING STARTED'!$E$10=\"\",\"\",'GETTING STARTED'!$E$10)","v":""}]
[null,"IND_ACCT =>","TU"]
[null,null,null,null,null,null,1,2,3,4,5,6,7,8,9,10,11,12]
{"$rows_left_out":17}
{"sheet":"CODES","index":11,"n_rows":68,"n_cols":9,"rows_kept":68,"cut":false,"hidden":true,"merged":[[61,2,66,2],[7,1,46,1],[47,1,56,1],[57,1,58,1],[61,1,67,1]]}
[]
[]
[]
[]
[]
[]
{"$rows_left_out":63}
{"sheet":"ErrorLog","index":12,"n_rows":1,"n_cols":7,"rows_kept":1,"cut":false,"hidden":false,"merged":[]}
["Link to Error","Validation Rule","Cell","Sheet","Description","Severity","Former Color"]

{"sheet":"Lists","index":13,"n_rows":40,"n_cols":13,"rows_kept":40,"cut":false,"hidden":true,"merged":[[1,9,1,10],[5,9,5,10],[10,9,10,10],[15,9,15,10]]}
["Country label","Country code","Currency","Valid flags (obs_status)","Label",null,"Valid flags (obs_conf)","Label",null,"Textual variables","String",null,"TEST"]
["Belgium","BE","EUR","B","break in time series",null,"C","confidential",null,"Institutional names"]
["Bulgaria","BG","BGN","E","estimated data",null,"D","secondary confidentiality set by the sender",null,"Eurostat Text","Statistical Office of the European Union"]
["Czechia","CZ","CZK","P","provisional",null,null,null,null,"Directorate Text","Directorate E: Sectoral and regional statistics"]
["Denmark","DK","DKK","BE",null,null,null,null,null,"Unit Text","Unit E-2: Environmental statistics and accounts; sustainable development"]
["Germany","DE","EUR","BP",null,null,null,null,null,"Data collection information"]
{"$rows_left_out":35}
{"sheet":"MacroBehaviour","index":14,"n_rows":3,"n_cols":7,"rows_kept":3,"cut":false,"hidden":true,"merged":[[0,0,0,2],[0,4,0,6]]}
["COMMON TO ALL (OR MOST)  QUESTIONNAIRE",null,null,null,"SPECIFIC TO THIS QUESTIONNAIRE"]
["Parameter","Value","(Valid values)",null,"Parameter","Value","(Valid values)"]
["DevelopementMode",false,"TRUE (during development)\nFALSE (For real reporting and testing)"]

{"sheet":"Specific Lists","index":15,"n_rows":19,"n_cols":23,"rows_kept":19,"cut":false,"hidden":true,"merged":[]}
["YES / NO",null,"PM SIZES",null,"AIR FILTRATION - \nVd APPROACH",null,"CROP PROVISION - MFA CLASSES",null,"CROP POLLINATION - POLLINATOR SPECIES",null,"SUMMER PERIOD LENGTH",null,"SPATIAL RESOLUTION",null,"Extent used",null,"Crop dependency coefficients",null,"Buffer zone",null,"Temperature",null,"Habitat attractiveness corrections"]
["Yes",null,"PM10",null,"Default values",null,"MF.1.1   Crops (excluding fodder crops)",null,"Short distance flyers",null,"1 month",null,"> 1 km",null,"As reported in ECOEXT questionnaire",null,"for MF1.1 crops",null,"Yes, default 150m",null,"Air temperature",null,"Yes, for linear features"]
["No",null,"PM2.5",null,"LAI-based values",null,"MF.1.1.1   Cereals ",null,"Long distance flyers",null,"2 months",null,"100 m - 1 km",null,"CORINE Land Cover accounting layers",null,"for MF1.2 crops",null,"Yes, other distance",null,"Surface temperature",null,"Yes for management practices"]
[null,null,null,null,"Other",null,"MF.1.1.2   Roots, tubers",null,"Short & long distance flyers",null,"3 months",null,"10 m - 100 m",null,"EEA Extent",null,"for all crop types",null,"No",null,"Both",null,"Yes, for both"]
[null,null,null,null,null,null,"MF.1.1.3   Sugar crops ",null,null,null,"other",null,"< 10 m",null,null,null,"with modifications",null,null,null,null,null,"No"]
[null,null,null,null,null,null,"MF.1.1.4   Pulses"]
{"$rows_left_out":14}
{"sheet":"Locks","index":16,"n_rows":15,"n_cols":7,"rows_kept":15,"cut":false,"hidden":true,"merged":[]}
["Sheet Name","Top Left Cell","Bottom Right Cell","Row Step","Column Step","Lock Type","Focus Back To"]
["Table 1 - Supply","G8","AY9",{"$f":"IF(ROW(INDIRECT(B2))=ROW(INDIRECT(C2)),\"999\",1)","v":1},4,"Formulas","G8"]
["Table 1 - Supply","G20","AY21",{"$f":"IF(ROW(INDIRECT(B3))=ROW(INDIRECT(C3)),\"999\",1)","v":1},4,"Formulas","G8"]
["Table 1 - Supply","G24","AY24",{"$f":"IF(ROW(INDIRECT(B4))=ROW(INDIRECT(C4)),\"999\",1)","v":"999"},4,"Formulas","G8"]
["Table 1 - Supply","G27","AY28",{"$f":"IF(ROW(INDIRECT(B5))=ROW(INDIRECT(C5)),\"999\",1)","v":1},4,"Formulas","G8"]
["Table 1 - Supply","G39","AY40",{"$f":"IF(ROW(INDIRECT(B6))=ROW(INDIRECT(C6)),\"999\",1)","v":1},4,"Formulas","G8"]
{"$rows_left_out":10}
{"sheet":"Mandatory","index":17,"n_rows":16,"n_cols":8,"rows_kept":16,"cut":false,"hidden":true,"merged":[]}
["Severity","SheetName","Top Left Cell","Bottom Right Cell","Row Step","Column Step","Empty Is Valid If Footnote Exists","Footnote Shift From Value"]
["Error","GETTING STARTED","E9","E10",{"$f":"IF(ROW(INDIRECT(C2))=ROW(INDIRECT(D2)),\"999\",1)","v":1},{"$f":"IF(COLUMN(INDIRECT(C2))=COLUMN(INDIRECT(D2)),\"999\",1)","v":"999"},"NO",999]
["Error","GETTING STARTED","D15","D17",2,{"$f":"IF(COLUMN(INDIRECT(C3))=COLUMN(INDIRECT(D3)),\"999\",1)","v":"999"},"NO",999]
["Error","GETTING STARTED","D23","D23",999,{"$f":"IF(COLUMN(INDIRECT(C4))=COLUMN(INDIRECT(D4)),\"999\",1)","v":"999"},"NO",999]
["Warning","Table 1 - Supply","G8","AM46",1,4,"NO",999]
["Warning","Table 1 - Supply","G48","AM50",1,4,"NO",999]
{"$rows_left_out":11}
{"sheet":"IsNumeric","index":18,"n_rows":5,"n_cols":6,"rows_kept":5,"cut":false,"hidden":true,"merged":[]}
["Severity","SheetName","TopLeftCell","BottomRightCell","RowStep","ColumnStep"]
["Error","Table 1 - Supply","G8","BC57",{"$f":"IF(ROW(INDIRECT(C2))=ROW(INDIRECT(D2)),\"999\",1)","v":1},4]
["Error","Table 2 - Use","G8","AA57",{"$f":"IF(ROW(INDIRECT(C3))=ROW(INDIRECT(D3)),\"999\",1)","v":1},4]
["Error","Table 3 - Complementary","G8","G15",{"$f":"IF(ROW(INDIRECT(C4))=ROW(INDIRECT(D4)),\"999\",1)","v":1},{"$f":"IF(COLUMN(INDIRECT(C4))=COLUMN(INDIRECT(D4)),\"999\",1)","v":"999"}]
["Error","Table 4 - Carbon seq_stor","G8","S20",{"$f":"IF(ROW(INDIRECT(C5))=ROW(INDIRECT(D5)),\"999\",1)","v":1},{"$f":"IF(COLUMN(INDIRECT(C5))=COLUMN(INDIRECT(D5)),\"999\",1)","v":1}]

{"sheet":"MustNotBeNegative","index":19,"n_rows":9,"n_cols":6,"rows_kept":9,"cut":false,"hidden":true,"merged":[]}
["Severity","SheetName","TopLeftCell","BottomRightCell","RowStep","ColumnStep"]
["Error","Table 1 - Supply","G8","BC49",{"$f":"IF(ROW(INDIRECT(C2))=ROW(INDIRECT(D2)),\"999\",1)","v":1},4]
["Error","Table 1 - Supply","G52","BC57",{"$f":"IF(ROW(INDIRECT(C3))=ROW(INDIRECT(D3)),\"999\",1)","v":1},4]
["Error","Table 2 - Use","G8","AA49",{"$f":"IF(ROW(INDIRECT(C4))=ROW(INDIRECT(D4)),\"999\",1)","v":1},4]
["Error","Table 2 - Use","G52","BC57",{"$f":"IF(ROW(INDIRECT(C5))=ROW(INDIRECT(D5)),\"999\",1)","v":1},4]
["Error","Table 3 - Complementary","G8","G15",{"$f":"IF(ROW(INDIRECT(C6))=ROW(INDIRECT(D6)),\"999\",1)","v":1},{"$f":"IF(COLUMN(INDIRECT(C6))=COLUMN(INDIRECT(D6)),\"999\",1)","v":"999"}]
{"$rows_left_out":4}
{"sheet":"Summations","index":20,"n_rows":124,"n_cols":13,"rows_kept":124,"cut":false,"hidden":true,"merged":[[25,5,25,6]]}
["Severity","Sheet Name","List of Cells\n (first block)","First Total Cell (first block)","Last Total Cell\n(Last block)","Row Block Repetition Step","Column Block Repetition Step","Greater or Equal","Valid Tolerance","Only if all data is available","Non compliance Is Valid If Footnote Exists","Footnote Shift From Value","Display text in error"]
["Error","Table 1 - Supply","G9,G20","G8","BC8",999,4,"EQ",0.1,"YES","NO",999,"Crop provision supply total per ecosystem type"]
["Error","Table 1 - Supply","G10,G11,G12,G13,G14,G15,G16,G17,G18,G19","G9","BC9",999,4,"EQ",0.1,"YES","NO",999,"Crop provision supply total for MF1.1 components"]
["Error","Table 1 - Supply","G21,G24","G20","BC20",999,4,"EQ",0.1,"YES","NO",999,"Crop provision supply total for MF1.2 = MF1.2.1 + MF1.2.2"]
["Error","Table 1 - Supply","G22,G23","G21","BC21",999,4,"EQ",0.1,"YES","NO",999,"Crop provision supply total for MF1.2.1 = MF1.2.1.1 + MF1.2.1.2"]
["Error","Table 1 - Supply","G25,G26","G24","BC24",999,4,"EQ",0.1,"YES","NO",999,"Crop provision supply total for MF1.2.2 = MF1.2.2.1 + MF1.2.2.2"]
{"$rows_left_out":119}
{"sheet":"x StandardFootnotes","index":21,"n_rows":2,"n_cols":7,"rows_kept":2,"cut":false,"hidden":true,"merged":[]}
["Severity","SheetName","Top Left Cell","Bottom Right Cell","Row Step","Column Step","Footnote type \n(CONF/STATUS)"]
["Error","Table_1","H8","AJ18",1,4,"STATUS"]

{"sheet":"x ContentInHiddenSheets","index":22,"n_rows":2,"n_cols":6,"rows_kept":2,"cut":false,"hidden":true,"merged":[]}
["Severity","SheetName","Top Left Cell","Bottom Right Cell","Row Step","Column Step"]
["Error","Table_1","G8","AL18",1,1]

{"sheet":"x Between2Cells","index":23,"n_rows":8,"n_cols":8,"rows_kept":8,"cut":false,"hidden":true,"merged":[]}
["Severity","SheetName","Top Left Cell","Bottom Right Cell","Row Step","Column Step","Cell A\n(first block)","Cell B\n(first block)"]
["Error","Table_1","G8","G18",1,999,"K8","O8"]
[]
[]
[]
[]
{"$rows_left_out":3}
{"sheet":"x ForbiddenStrings","index":24,"n_rows":5,"n_cols":8,"rows_kept":5,"cut":false,"hidden":true,"merged":[]}
["Severity","SheetName","TopLeftCell","BottomRightCell","RowStep","ColumnStep","ForbiddenString","Display text in error"]
["Warning","Footnotes list","E9","E58",1,999,"not available","Please verify the explanatory note sufficiently explains why the data is not available"]
["Warning","Footnotes list","E9","E58",1,999,"not reported","Please verify the explanatory note sufficiently explains why the data is not available"]
["Warning","Footnotes list","E9","E58",1,999,"unavailable data","Please verify the explanatory note sufficiently explains why the data is not available"]
["Warning","Footnotes list","E9","E58",1,999,"no data available","Please verify the explanatory note sufficiently explains why the data is not available"]

{"sheet":"x MandatoryAtLeast","index":25,"n_rows":17,"n_cols":6,"rows_kept":17,"cut":false,"hidden":true,"merged":[]}
["Severity","Sheet Name","List of Cells","Mandatory at least X cells","Mandatory at most X cells","Display text in error"]
["Error","Table_1","G8,G9,G10,G15,G16,G17",2,999,"At least two cells must be filled-in"]
["Error","Table_1","K8,O8,S8",1,999]
["Error","Table_3","AA10",1,999]
[]
[]
{"$rows_left_out":12}
{"sheet":"x Thresholds","index":26,"n_rows":2,"n_cols":10,"rows_kept":2,"cut":false,"hidden":true,"merged":[]}
["Severity","SheetName","Top Left Cell","Bottom Right Cell","Row Step","Column Step","Lower value","Upper value","Error Is Valid If Footnote Exists","Footnote Shift From Value"]
["Error","Table_2","G8","J14",1,1,0,100,"NO",999]

{"sheet":"x IsFormula","index":27,"n_rows":7,"n_cols":6,"rows_kept":7,"cut":false,"hidden":true,"merged":[]}
["Severity","Sheet Name","Top Left Cell","Bottom Right Cell","Row Step","Column Step"]
["Info","Table_1","G18","AI18",999,4]
["Info","Table_1","G10","W10",999,4]
["Info","Table_1","AE10","AI10",999,4]
["Info","Table_1a","G13","K13",999,4]
["Info","Table_1a","G16","K16",999,4]
{"$rows_left_out":2}
{"sheet":"x FootnoteContent","index":28,"n_rows":4,"n_cols":7,"rows_kept":4,"cut":false,"hidden":true,"merged":[]}
["Severity","SheetName","TopLeftCell","BottomRightCell","RowStep","ColumnStep","DistanceFromReferenceToText"]
["Error","Table_1","I8","AK18",1,4,1]
["Error","Table_1a","I8","M16",1,4,1]
["Error","Table_3","I10","AS17",1,4,1]