{"text_format":"1","workbook":"xlsx","n_sheets":9,"sheets":["Cover","Service mapping","Service mapping - Continued","Survey","Results","Results - Continued(1)","Results - Continued(2)","Survey Result","eDelivery performance"],"not_rendered":{"charts":3,"images":3,"macros":1,"external_links":0,"defined_names":0,"comments":0,"pivot_tables":0},"unopened":[],"bounds":{"document_bytes":16777216,"sheet_cells":100000,"rows_first":2000,"rows_last":500,"rows_between":2000,"halvings":0,"cell_chars":16384,"cell_head_chars":4096},"cells_cut":0,"cells_raw":0,"read":"whole","date_system":"1900"}

{"sheet":"Cover","index":0,"n_rows":18,"n_cols":2,"rows_kept":18,"cut":false,"hidden":false,"merged":[]}
[]
[]
[]
[]
[]
[]
[]
[]
[]
[]
{"$rows_left_out":9}
{"sheet":"Service mapping","index":1,"n_rows":42,"n_cols":20,"rows_kept":42,"cut":false,"hidden":true,"merged":[]}
[]
[]
["ID","Needs","Access point","SMP","SML","PKI","Connectivity testing","Conformance testing","Helpdesk","Training & Deployment","Self-assessment","Onboarding of new stakeholders","Stakeholder follow-up","Connector","Trust Establishment","Goals","Interoperability","Security","Scalability & performance","Legal"]
[null,"SOFTWARE"]
[null,"Functionality"]
["SOFT.01","Exchange documents and/or data using a standardised messaging protocol which supports one-way push and/or two-way async message exchange patterns",12,null,null,null,null,null,null,null,null,null,null,7,null,null,4]
["SOFT.02","Exchange (multiple) attachments, e.g. PDF, in addition to messages ",1,null,null,null,null,null,null,null,null,null,null,1,null,null,1]
["SOFT.04","Advanced and configurable logging of events related to the exchange of data and documents",null,null,null,null,null,null,null,null,null,null,null,1,null,null,null,1]
[null,"Usability"]
["SOFT.05","Ensure information about the participants (what messages they can process, the messaging protocol that they support, …) is easily discoverable and accessible to everyone in the message exchange network",null,2,2,null,null,null,null,null,null,null,null,1,null,null,1]
{"$rows_left_out":33}
{"sheet":"Service mapping - Continued","index":2,"n_rows":14,"n_cols":6,"rows_kept":14,"cut":false,"hidden":true,"merged":[]}
[]
[]
["ID","Risk","Project risk","Organizational risk","Strategic/political risk","Functionality risk"]
[null,"Project risk"]
["PR.01","The implementation of the project requires changes to key business processes. ",1]
["PR.02","The implementation of the project may be subject to difficulties.",1]
[null,"Organizational risk"]
["OR.01","There are not enough internal resources available to execute the project. ",null,1]
["OR.02","Internal resources do not have the right skills to execute the project. ",null,1]
[null,"Strategic/political risk"]
{"$rows_left_out":5}
{"sheet":"Survey","index":3,"n_rows":182,"n_cols":16,"rows_kept":182,"cut":false,"hidden":false,"merged":[[173,10,173,13],[175,10,175,13],[177,10,177,13],[153,4,153,13],[167,4,167,13],[161,10,161,13],[163,10,163,13],[165,10,165,13],[171,10,171,13],[147,10,147,13],[149,10,149,13],[151,10,151,13],[157,10,157,13],[159,10,159,13],[135,10,135,13],[137,10,137,13],[139,10,139,13],[141,10,141,13],[145,10,145,13],[123,10,123,13],[125,10,125,13],[127,10,127,13],[131,10,131,13],[133,10,133,13],[62,6,62,13],[119,10,119,13],[97,4,97,13],[101,10,101,13],[103,10,103,13],[113,10,113,13],[115,10,115,13],[109,10,109,13],[111,10,111,13],[64,4,64,13],[68,4,68,13],[74,4,74,13],[105,10,105,13],[83,4,83,13],[22,6,22,13],[10,15,10,16],[30,15,30,16],[26,6,26,13],[28,6,28,13],[24,6,24,13],[20,6,20,13],[9,15,9,16],[12,6,12,13],[14,6,14,13],[16,6,16,13],[18,6,18,13],[34,8,34,13],[36,8,36,13],[38,8,38,13],[40,8,40,13],[42,8,42,13],[44,8,44,13],[46,15,46,16],[82,15,82,16],[54,6,54,13],[56,6,56,13],[70,6,70,13],[76,6,76,13],[78,6,78,13],[50,6,50,13],[80,6,80,13],[66,6,66,13],[48,4,48,13],[52,6,52,13],[72,6,72,13],[58,6,58,13],[60,6,60,13]]}
[]
[null,"Assess your situation"]
[null,"Please complete the questionnaire below in order to assess the goals you can achieve and the enabling services you need when starting a project on eDelivery."]
[]
[]
[null,"For more information on terms and concepts used in this survey, please refer to the CEF Glossary."]
[]
[]
[]
[null,"STEPS",null,null,null,null,null,null,null,null,null,null,null,null,null,"ANSWERS"]
{"$rows_left_out":173}
{"sheet":"Results","index":4,"n_rows":94,"n_cols":14,"rows_kept":94,"cut":false,"hidden":true,"merged":[[1,1,1,13]]}
[]
[null,"Service/component score"]
[null,"Access point","SMP","SML","PKI","Connectivity testing","Conformance testing","Helpdesk","Training & Deployment","Self-assessment","Onboarding of new stakeholders","Stakeholder follow-up","Connector","Trust Establishment"]
[null,{"$f":"IF(Survey!$B102<>\"\",IF(ISNA(VLOOKUP(Survey!$B102,Needs[],COLUMN()+1,FALSE)),0,Survey!$G102/2*VLOOKUP(Survey!$B102,Needs[],COLUMN()+1,FALSE)),0)","v":0},{"$f":"IF(Survey!$B102<>\"\",IF(ISNA(VLOOKUP(Survey!$B102,Needs[],COLUMN()+1,FALSE)),0,Survey!$G102/2*VLOOKUP(Survey!$B102,Needs[],COLUMN()+1,FALSE)),0)","v":0},{"$f":"IF(Survey!$B102<>\"\",IF(ISNA(VLOOKUP(Survey!$B102,Needs[],COLUMN()+1,FALSE)),0,Survey!$G102/2*VLOOKUP(Survey!$B102,Needs[],COLUMN()+1,FALSE)),0)","v":0},{"$f":"IF(Survey!$B102<>\"\",IF(ISNA(VLOOKUP(Survey!$B102,Needs[],COLUMN()+1,FALSE)),0,Survey!$G102/2*VLOOKUP(Survey!$B102,Needs[],COLUMN()+1,FALSE)),0)","v":0},{"$f":"IF(Survey!$B102<>\"\",IF(ISNA(VLOOKUP(Survey!$B102,Needs[],COLUMN()+1,FALSE)),0,Survey!$G102/2*VLOOKUP(Survey!$B102,Needs[],COLUMN()+1,FALSE)),0)","v":0},{"$f":"IF(Survey!$B102<>\"\",IF(ISNA(VLOOKUP(Survey!$B102,Needs[],COLUMN()+1,FALSE)),0,Survey!$G102/2*VLOOKUP(Survey!$B102,Needs[],COLUMN()+1,FALSE)),0)","v":0},{"$f":"IF(Survey!$B102<>\"\",IF(ISNA(VLOOKUP(Survey!$B102,Needs[],COLUMN()+1,FALSE)),0,Survey!$G102/2*VLOOKUP(Survey!$B102,Needs[],COLUMN()+1,FALSE)),0)","v":0},{"$f":"IF(Survey!$B102<>\"\",IF(ISNA(VLOOKUP(Survey!$B102,Needs[],COLUMN()+1,FALSE)),0,Survey!$G102/2*VLOOKUP(Survey!$B102,Needs[],COLUMN()+1,FALSE)),0)","v":0},{"$f":"IF(Survey!$B102<>\"\",IF(ISNA(VLOOKUP(Survey!$B102,Needs[],COLUMN()+1,FALSE)),0,Survey!$G102/2*VLOOKUP(Survey!$B102,Needs[],COLUMN()+1,FALSE)),0)","v":0},{"$f":"IF(Survey!$B102<>\"\",IF(ISNA(VLOOKUP(Survey!$B102,Needs[],COLUMN()+1,FALSE)),0,Survey!$G102/2*VLOOKUP(Survey!$B102,Needs[],COLUMN()+1,FALSE)),0)","v":0},{"$f":"IF(Survey!$B102<>\"\",IF(ISNA(VLOOKUP(Survey!$B102,Needs[],COLUMN()+1,FALSE)),0,Survey!$G102/2*VLOOKUP(Survey!$B102,Needs[],COLUMN()+1,FALSE)),0)","v":0},{"$f":"IF(Survey!$B102<>\"\",IF(ISNA(VLOOKUP(Survey!$B102,Needs[],COLUMN()+1,FALSE)),0,Survey!$G102/2*VLOOKUP(Survey!$B102,Needs[],COLUMN()+1,FALSE)),0)","v":0},{"$f":"IF(Survey!$B102<>\"\",IF(ISNA(VLOOKUP(Survey!$B102,Needs[],COLUMN()+1,FALSE)),0,Survey!$G102/2*VLOOKUP(Survey!$B102,Needs[],COLUMN()+1,FALSE)),0)","v":0}]
[null,{"$f":"IF(Survey!$B103<>\"\",IF(ISNA(VLOOKUP(Survey!$B103,Needs[],COLUMN()+1,FALSE)),0,Survey!$G103/2*VLOOKUP(Survey!$B103,Needs[],COLUMN()+1,FALSE)),0)","v":0},{"$f":"IF(Survey!$B103<>\"\",IF(ISNA(VLOOKUP(Survey!$B103,Needs[],COLUMN()+1,FALSE)),0,Survey!$G103/2*VLOOKUP(Survey!$B103,Needs[],COLUMN()+1,FALSE)),0)","v":0},{"$f":"IF(Survey!$B103<>\"\",IF(ISNA(VLOOKUP(Survey!$B103,Needs[],COLUMN()+1,FALSE)),0,Survey!$G103/2*VLOOKUP(Survey!$B103,Needs[],COLUMN()+1,FALSE)),0)","v":0},{"$f":"IF(Survey!$B103<>\"\",IF(ISNA(VLOOKUP(Survey!$B103,Needs[],COLUMN()+1,FALSE)),0,Survey!$G103/2*VLOOKUP(Survey!$B103,Needs[],COLUMN()+1,FALSE)),0)","v":0},{"$f":"IF(Survey!$B103<>\"\",IF(ISNA(VLOOKUP(Survey!$B103,Needs[],COLUMN()+1,FALSE)),0,Survey!$G103/2*VLOOKUP(Survey!$B103,Needs[],COLUMN()+1,FALSE)),0)","v":0},{"$f":"IF(Survey!$B103<>\"\",IF(ISNA(VLOOKUP(Survey!$B103,Needs[],COLUMN()+1,FALSE)),0,Survey!$G103/2*VLOOKUP(Survey!$B103,Needs[],COLUMN()+1,FALSE)),0)","v":0},{"$f":"IF(Survey!$B103<>\"\",IF(ISNA(VLOOKUP(Survey!$B103,Needs[],COLUMN()+1,FALSE)),0,Survey!$G103/2*VLOOKUP(Survey!$B103,Needs[],COLUMN()+1,FALSE)),0)","v":0},{"$f":"IF(Survey!$B103<>\"\",IF(ISNA(VLOOKUP(Survey!$B103,Needs[],COLUMN()+1,FALSE)),0,Survey!$G103/2*VLOOKUP(Survey!$B103,Needs[],COLUMN()+1,FALSE)),0)","v":0},{"$f":"IF(Survey!$B103<>\"\",IF(ISNA(VLOOKUP(Survey!$B103,Needs[],COLUMN()+1,FALSE)),0,Survey!$G103/2*VLOOKUP(Survey!$B103,Needs[],COLUMN()+1,FALSE)),0)","v":0},{"$f":"IF(Survey!$B103<>\"\",IF(ISNA(VLOOKUP(Survey!$B103,Needs[],COLUMN()+1,FALSE)),0,Survey!$G103/2*VLOOKUP(Survey!$B103,Needs[],COLUMN()+1,FALSE)),0)","v":0},{"$f":"IF(Survey!$B103<>\"\",IF(ISNA(VLOOKUP(Survey!$B103,Needs[],COLUMN()+1,FALSE)),0,Survey!$G103/2*VLOOKUP(Survey!$B103,Needs[],COLUMN()+1,FALSE)),0)","v":0},{"$f":"IF(Survey!$B103<>\"\",IF(ISNA(VLOOKUP(Survey!$B103,Needs[],COLUMN()+1,FALSE)),0,Survey!$G103/2*VLOOKUP(Survey!$B103,Needs[],COLUMN()+1,FALSE)),0)","v":0},{"$f":"IF(Survey!$B103<>\"\",IF(ISNA(VLOOKUP(Survey!$B103,Needs[],COLUMN()+1,FALSE)),0,Survey!$G103/2*VLOOKUP(Survey!$B103,Needs[],COLUMN()+1,FALSE)),0)","v":0}]
[null,{"$f":"IF(Survey!$B104<>\"\",IF(ISNA(VLOOKUP(Survey!$B104,Needs[],COLUMN()+1,FALSE)),0,Survey!$G104/2*VLOOKUP(Survey!$B104,Needs[],COLUMN()+1,FALSE)),0)","v":0},{"$f":"IF(Survey!$B104<>\"\",IF(ISNA(VLOOKUP(Survey!$B104,Needs[],COLUMN()+1,FALSE)),0,Survey!$G104/2*VLOOKUP(Survey!$B104,Needs[],COLUMN()+1,FALSE)),0)","v":0},{"$f":"IF(Survey!$B104<>\"\",IF(ISNA(VLOOKUP(Survey!$B104,Needs[],COLUMN()+1,FALSE)),0,Survey!$G104/2*VLOOKUP(Survey!$B104,Needs[],COLUMN()+1,FALSE)),0)","v":0},{"$f":"IF(Survey!$B104<>\"\",IF(ISNA(VLOOKUP(Survey!$B104,Needs[],COLUMN()+1,FALSE)),0,Survey!$G104/2*VLOOKUP(Survey!$B104,Needs[],COLUMN()+1,FALSE)),0)","v":0},{"$f":"IF(Survey!$B104<>\"\",IF(ISNA(VLOOKUP(Survey!$B104,Needs[],COLUMN()+1,FALSE)),0,Survey!$G104/2*VLOOKUP(Survey!$B104,Needs[],COLUMN()+1,FALSE)),0)","v":0},{"$f":"IF(Survey!$B104<>\"\",IF(ISNA(VLOOKUP(Survey!$B104,Needs[],COLUMN()+1,FALSE)),0,Survey!$G104/2*VLOOKUP(Survey!$B104,Needs[],COLUMN()+1,FALSE)),0)","v":0},{"$f":"IF(Survey!$B104<>\"\",IF(ISNA(VLOOKUP(Survey!$B104,Needs[],COLUMN()+1,FALSE)),0,Survey!$G104/2*VLOOKUP(Survey!$B104,Needs[],COLUMN()+1,FALSE)),0)","v":0},{"$f":"IF(Survey!$B104<>\"\",IF(ISNA(VLOOKUP(Survey!$B104,Needs[],COLUMN()+1,FALSE)),0,Survey!$G104/2*VLOOKUP(Survey!$B104,Needs[],COLUMN()+1,FALSE)),0)","v":0},{"$f":"IF(Survey!$B104<>\"\",IF(ISNA(VLOOKUP(Survey!$B104,Needs[],COLUMN()+1,FALSE)),0,Survey!$G104/2*VLOOKUP(Survey!$B104,Needs[],COLUMN()+1,FALSE)),0)","v":0},{"$f":"IF(Survey!$B104<>\"\",IF(ISNA(VLOOKUP(Survey!$B104,Needs[],COLUMN()+1,FALSE)),0,Survey!$G104/2*VLOOKUP(Survey!$B104,Needs[],COLUMN()+1,FALSE)),0)","v":0},{"$f":"IF(Survey!$B104<>\"\",IF(ISNA(VLOOKUP(Survey!$B104,Needs[],COLUMN()+1,FALSE)),0,Survey!$G104/2*VLOOKUP(Survey!$B104,Needs[],COLUMN()+1,FALSE)),0)","v":0},{"$f":"IF(Survey!$B104<>\"\",IF(ISNA(VLOOKUP(Survey!$B104,Needs[],COLUMN()+1,FALSE)),0,Survey!$G104/2*VLOOKUP(Survey!$B104,Needs[],COLUMN()+1,FALSE)),0)","v":0},{"$f":"IF(Survey!$B104<>\"\",IF(ISNA(VLOOKUP(Survey!$B104,Needs[],COLUMN()+1,FALSE)),0,Survey!$G104/2*VLOOKUP(Survey!$B104,Needs[],COLUMN()+1,FALSE)),0)","v":0}]
[null,{"$f":"IF(Survey!$B105<>\"\",IF(ISNA(VLOOKUP(Survey!$B105,Needs[],COLUMN()+1,FALSE)),0,Survey!$G105/2*VLOOKUP(Survey!$B105,Needs[],COLUMN()+1,FALSE)),0)","v":0},{"$f":"IF(Survey!$B105<>\"\",IF(ISNA(VLOOKUP(Survey!$B105,Needs[],COLUMN()+1,FALSE)),0,Survey!$G105/2*VLOOKUP(Survey!$B105,Needs[],COLUMN()+1,FALSE)),0)","v":0},{"$f":"IF(Survey!$B105<>\"\",IF(ISNA(VLOOKUP(Survey!$B105,Needs[],COLUMN()+1,FALSE)),0,Survey!$G105/2*VLOOKUP(Survey!$B105,Needs[],COLUMN()+1,FALSE)),0)","v":0},{"$f":"IF(Survey!$B105<>\"\",IF(ISNA(VLOOKUP(Survey!$B105,Needs[],COLUMN()+1,FALSE)),0,Survey!$G105/2*VLOOKUP(Survey!$B105,Needs[],COLUMN()+1,FALSE)),0)","v":0},{"$f":"IF(Survey!$B105<>\"\",IF(ISNA(VLOOKUP(Survey!$B105,Needs[],COLUMN()+1,FALSE)),0,Survey!$G105/2*VLOOKUP(Survey!$B105,Needs[],COLUMN()+1,FALSE)),0)","v":0},{"$f":"IF(Survey!$B105<>\"\",IF(ISNA(VLOOKUP(Survey!$B105,Needs[],COLUMN()+1,FALSE)),0,Survey!$G105/2*VLOOKUP(Survey!$B105,Needs[],COLUMN()+1,FALSE)),0)","v":0},{"$f":"IF(Survey!$B105<>\"\",IF(ISNA(VLOOKUP(Survey!$B105,Needs[],COLUMN()+1,FALSE)),0,Survey!$G105/2*VLOOKUP(Survey!$B105,Needs[],COLUMN()+1,FALSE)),0)","v":0},{"$f":"IF(Survey!$B105<>\"\",IF(ISNA(VLOOKUP(Survey!$B105,Needs[],COLUMN()+1,FALSE)),0,Survey!$G105/2*VLOOKUP(Survey!$B105,Needs[],COLUMN()+1,FALSE)),0)","v":0},{"$f":"IF(Survey!$B105<>\"\",IF(ISNA(VLOOKUP(Survey!$B105,Needs[],COLUMN()+1,FALSE)),0,Survey!$G105/2*VLOOKUP(Survey!$B105,Needs[],COLUMN()+1,FALSE)),0)","v":0},{"$f":"IF(Survey!$B105<>\"\",IF(ISNA(VLOOKUP(Survey!$B105,Needs[],COLUMN()+1,FALSE)),0,Survey!$G105/2*VLOOKUP(Survey!$B105,Needs[],COLUMN()+1,FALSE)),0)","v":0},{"$f":"IF(Survey!$B105<>\"\",IF(ISNA(VLOOKUP(Survey!$B105,Needs[],COLUMN()+1,FALSE)),0,Survey!$G105/2*VLOOKUP(Survey!$B105,Needs[],COLUMN()+1,FALSE)),0)","v":0},{"$f":"IF(Survey!$B105<>\"\",IF(ISNA(VLOOKUP(Survey!$B105,Needs[],COLUMN()+1,FALSE)),0,Survey!$G105/2*VLOOKUP(Survey!$B105,Needs[],COLUMN()+1,FALSE)),0)","v":0},{"$f":"IF(Survey!$B105<>\"\",IF(ISNA(VLOOKUP(Survey!$B105,Needs[],COLUMN()+1,FALSE)),0,Survey!$G105/2*VLOOKUP(Survey!$B105,Needs[],COLUMN()+1,FALSE)),0)","v":0}]
[null,{"$f":"IF(Survey!$B106<>\"\",IF(ISNA(VLOOKUP(Survey!$B106,Needs[],COLUMN()+1,FALSE)),0,Survey!$G106/2*VLOOKUP(Survey!$B106,Needs[],COLUMN()+1,FALSE)),0)","v":0},{"$f":"IF(Survey!$B106<>\"\",IF(ISNA(VLOOKUP(Survey!$B106,Needs[],COLUMN()+1,FALSE)),0,Survey!$G106/2*VLOOKUP(Survey!$B106,Needs[],COLUMN()+1,FALSE)),0)","v":0},{"$f":"IF(Survey!$B106<>\"\",IF(ISNA(VLOOKUP(Survey!$B106,Needs[],COLUMN()+1,FALSE)),0,Survey!$G106/2*VLOOKUP(Survey!$B106,Needs[],COLUMN()+1,FALSE)),0)","v":0},{"$f":"IF(Survey!$B106<>\"\",IF(ISNA(VLOOKUP(Survey!$B106,Needs[],COLUMN()+1,FALSE)),0,Survey!$G106/2*VLOOKUP(Survey!$B106,Needs[],COLUMN()+1,FALSE)),0)","v":0},{"$f":"IF(Survey!$B106<>\"\",IF(ISNA(VLOOKUP(Survey!$B106,Needs[],COLUMN()+1,FALSE)),0,Survey!$G106/2*VLOOKUP(Survey!$B106,Needs[],COLUMN()+1,FALSE)),0)","v":0},{"$f":"IF(Survey!$B106<>\"\",IF(ISNA(VLOOKUP(Survey!$B106,Needs[],COLUMN()+1,FALSE)),0,Survey!$G106/2*VLOOKUP(Survey!$B106,Needs[],COLUMN()+1,FALSE)),0)","v":0},{"$f":"IF(Survey!$B106<>\"\",IF(ISNA(VLOOKUP(Survey!$B106,Needs[],COLUMN()+1,FALSE)),0,Survey!$G106/2*VLOOKUP(Survey!$B106,Needs[],COLUMN()+1,FALSE)),0)","v":0},{"$f":"IF(Survey!$B106<>\"\",IF(ISNA(VLOOKUP(Survey!$B106,Needs[],COLUMN()+1,FALSE)),0,Survey!$G106/2*VLOOKUP(Survey!$B106,Needs[],COLUMN()+1,FALSE)),0)","v":0},{"$f":"IF(Survey!$B106<>\"\",IF(ISNA(VLOOKUP(Survey!$B106,Needs[],COLUMN()+1,FALSE)),0,Survey!$G106/2*VLOOKUP(Survey!$B106,Needs[],COLUMN()+1,FALSE)),0)","v":0},{"$f":"IF(Survey!$B106<>\"\",IF(ISNA(VLOOKUP(Survey!$B106,Needs[],COLUMN()+1,FALSE)),0,Survey!$G106/2*VLOOKUP(Survey!$B106,Needs[],COLUMN()+1,FALSE)),0)","v":0},{"$f":"IF(Survey!$B106<>\"\",IF(ISNA(VLOOKUP(Survey!$B106,Needs[],COLUMN()+1,FALSE)),0,Survey!$G106/2*VLOOKUP(Survey!$B106,Needs[],COLUMN()+1,FALSE)),0)","v":0},{"$f":"IF(Survey!$B106<>\"\",IF(ISNA(VLOOKUP(Survey!$B106,Needs[],COLUMN()+1,FALSE)),0,Survey!$G106/2*VLOOKUP(Survey!$B106,Needs[],COLUMN()+1,FALSE)),0)","v":0},{"$f":"IF(Survey!$B106<>\"\",IF(ISNA(VLOOKUP(Survey!$B106,Needs[],COLUMN()+1,FALSE)),0,Survey!$G106/2*VLOOKUP(Survey!$B106,Needs[],COLUMN()+1,FALSE)),0)","v":0}]
[null,{"$f":"IF(Survey!$B107<>\"\",IF(ISNA(VLOOKUP(Survey!$B107,Needs[],COLUMN()+1,FALSE)),0,Survey!$G107/2*VLOOKUP(Survey!$B107,Needs[],COLUMN()+1,FALSE)),0)","v":0},{"$f":"IF(Survey!$B107<>\"\",IF(ISNA(VLOOKUP(Survey!$B107,Needs[],COLUMN()+1,FALSE)),0,Survey!$G107/2*VLOOKUP(Survey!$B107,Needs[],COLUMN()+1,FALSE)),0)","v":0},{"$f":"IF(Survey!$B107<>\"\",IF(ISNA(VLOOKUP(Survey!$B107,Needs[],COLUMN()+1,FALSE)),0,Survey!$G107/2*VLOOKUP(Survey!$B107,Needs[],COLUMN()+1,FALSE)),0)","v":0},{"$f":"IF(Survey!$B107<>\"\",IF(ISNA(VLOOKUP(Survey!$B107,Needs[],COLUMN()+1,FALSE)),0,Survey!$G107/2*VLOOKUP(Survey!$B107,Needs[],COLUMN()+1,FALSE)),0)","v":0},{"$f":"IF(Survey!$B107<>\"\",IF(ISNA(VLOOKUP(Survey!$B107,Needs[],COLUMN()+1,FALSE)),0,Survey!$G107/2*VLOOKUP(Survey!$B107,Needs[],COLUMN()+1,FALSE)),0)","v":0},{"$f":"IF(Survey!$B107<>\"\",IF(ISNA(VLOOKUP(Survey!$B107,Needs[],COLUMN()+1,FALSE)),0,Survey!$G107/2*VLOOKUP(Survey!$B107,Needs[],COLUMN()+1,FALSE)),0)","v":0},{"$f":"IF(Survey!$B107<>\"\",IF(ISNA(VLOOKUP(Survey!$B107,Needs[],COLUMN()+1,FALSE)),0,Survey!$G107/2*VLOOKUP(Survey!$B107,Needs[],COLUMN()+1,FALSE)),0)","v":0},{"$f":"IF(Survey!$B107<>\"\",IF(ISNA(VLOOKUP(Survey!$B107,Needs[],COLUMN()+1,FALSE)),0,Survey!$G107/2*VLOOKUP(Survey!$B107,Needs[],COLUMN()+1,FALSE)),0)","v":0},{"$f":"IF(Survey!$B107<>\"\",IF(ISNA(VLOOKUP(Survey!$B107,Needs[],COLUMN()+1,FALSE)),0,Survey!$G107/2*VLOOKUP(Survey!$B107,Needs[],COLUMN()+1,FALSE)),0)","v":0},{"$f":"IF(Survey!$B107<>\"\",IF(ISNA(VLOOKUP(Survey!$B107,Needs[],COLUMN()+1,FALSE)),0,Survey!$G107/2*VLOOKUP(Survey!$B107,Needs[],COLUMN()+1,FALSE)),0)","v":0},{"$f":"IF(Survey!$B107<>\"\",IF(ISNA(VLOOKUP(Survey!$B107,Needs[],COLUMN()+1,FALSE)),0,Survey!$G107/2*VLOOKUP(Survey!$B107,Needs[],COLUMN()+1,FALSE)),0)","v":0},{"$f":"IF(Survey!$B107<>\"\",IF(ISNA(VLOOKUP(Survey!$B107,Needs[],COLUMN()+1,FALSE)),0,Survey!$G107/2*VLOOKUP(Survey!$B107,Needs[],COLUMN()+1,FALSE)),0)","v":0},{"$f":"IF(Survey!$B107<>\"\",IF(ISNA(VLOOKUP(Survey!$B107,Needs[],COLUMN()+1,FALSE)),0,Survey!$G107/2*VLOOKUP(Survey!$B107,Needs[],COLUMN()+1,FALSE)),0)","v":0}]
[null,{"$f":"IF(Survey!$B108<>\"\",IF(ISNA(VLOOKUP(Survey!$B108,Needs[],COLUMN()+1,FALSE)),0,Survey!$G108/2*VLOOKUP(Survey!$B108,Needs[],COLUMN()+1,FALSE)),0)","v":0},{"$f":"IF(Survey!$B108<>\"\",IF(ISNA(VLOOKUP(Survey!$B108,Needs[],COLUMN()+1,FALSE)),0,Survey!$G108/2*VLOOKUP(Survey!$B108,Needs[],COLUMN()+1,FALSE)),0)","v":0},{"$f":"IF(Survey!$B108<>\"\",IF(ISNA(VLOOKUP(Survey!$B108,Needs[],COLUMN()+1,FALSE)),0,Survey!$G108/2*VLOOKUP(Survey!$B108,Needs[],COLUMN()+1,FALSE)),0)","v":0},{"$f":"IF(Survey!$B108<>\"\",IF(ISNA(VLOOKUP(Survey!$B108,Needs[],COLUMN()+1,FALSE)),0,Survey!$G108/2*VLOOKUP(Survey!$B108,Needs[],COLUMN()+1,FALSE)),0)","v":0},{"$f":"IF(Survey!$B108<>\"\",IF(ISNA(VLOOKUP(Survey!$B108,Needs[],COLUMN()+1,FALSE)),0,Survey!$G108/2*VLOOKUP(Survey!$B108,Needs[],COLUMN()+1,FALSE)),0)","v":0},{"$f":"IF(Survey!$B108<>\"\",IF(ISNA(VLOOKUP(Survey!$B108,Needs[],COLUMN()+1,FALSE)),0,Survey!$G108/2*VLOOKUP(Survey!$B108,Needs[],COLUMN()+1,FALSE)),0)","v":0},{"$f":"IF(Survey!$B108<>\"\",IF(ISNA(VLOOKUP(Survey!$B108,Needs[],COLUMN()+1,FALSE)),0,Survey!$G108/2*VLOOKUP(Survey!$B108,Needs[],COLUMN()+1,FALSE)),0)","v":0},{"$f":"IF(Survey!$B108<>\"\",IF(ISNA(VLOOKUP(Survey!$B108,Needs[],COLUMN()+1,FALSE)),0,Survey!$G108/2*VLOOKUP(Survey!$B108,Needs[],COLUMN()+1,FALSE)),0)","v":0},{"$f":"IF(Survey!$B108<>\"\",IF(ISNA(VLOOKUP(Survey!$B108,Needs[],COLUMN()+1,FALSE)),0,Survey!$G108/2*VLOOKUP(Survey!$B108,Needs[],COLUMN()+1,FALSE)),0)","v":0},{"$f":"IF(Survey!$B108<>\"\",IF(ISNA(VLOOKUP(Survey!$B108,Needs[],COLUMN()+1,FALSE)),0,Survey!$G108/2*VLOOKUP(Survey!$B108,Needs[],COLUMN()+1,FALSE)),0)","v":0},{"$f":"IF(Survey!$B108<>\"\",IF(ISNA(VLOOKUP(Survey!$B108,Needs[],COLUMN()+1,FALSE)),0,Survey!$G108/2*VLOOKUP(Survey!$B108,Needs[],COLUMN()+1,FALSE)),0)","v":0},{"$f":"IF(Survey!$B108<>\"\",IF(ISNA(VLOOKUP(Survey!$B108,Needs[],COLUMN()+1,FALSE)),0,Survey!$G108/2*VLOOKUP(Survey!$B108,Needs[],COLUMN()+1,FALSE)),0)","v":0},{"$f":"IF(Survey!$B108<>\"\",IF(ISNA(VLOOKUP(Survey!$B108,Needs[],COLUMN()+1,FALSE)),0,Survey!$G108/2*VLOOKUP(Survey!$B108,Needs[],COLUMN()+1,FALSE)),0)","v":0}]
{"$rows_left_out":85}
{"sheet":"Results - Continued(1)","index":5,"n_rows":36,"n_cols":6,"rows_kept":36,"cut":false,"hidden":true,"merged":[]}
["Value comparison"]
["Importance "]
[]
[null,"Interoperability","Security","Scalability & Performance","Legal Assurance & Accountability"]
["Score ",{"$f":"interoperability_part2()","v":0},{"$f":"security_part2()","v":0},{"$f":"scalability_part2()","v":0},{"$f":"legal_part2()","v":0}]
["Maximum",{"$f":"COUNTA(Needs[Interoperability])","v":5},{"$f":"COUNTA(Needs[Security])","v":4},{"$f":"COUNTA(Needs[Scalability & performance])","v":4},{"$f":"COUNTA(Needs[Legal])","v":4}]
["Result (%)",{"$f":"B5/B6","v":0},{"$f":"C5/C6","v":0},0,0]
["Total result (%)",{"$f":"AVERAGE(B7:E7)","v":0}]
[]
["Performance (alternative)"]
{"$rows_left_out":27}
{"sheet":"Results - Continued(2)","index":6,"n_rows":30,"n_cols":9,"rows_kept":30,"cut":false,"hidden":true,"merged":[]}
["Risk comparison"]
["Importance "]
[]
[null,"Project risk","Organizational risk","Strategic/political risk","Functionality risk"]
["Score ",{"$f":"projectrisk_part1()","v":0},{"$f":"organizationalrisk_part1()","v":0},{"$f":"strategicrisk_part1()","v":0},{"$f":"functionalityrisk_part1()","v":0}]
["Maximum",{"$f":"COUNTA(Risk[Project risk])","v":2},{"$f":"COUNTA(Risk[Organizational risk])","v":2},{"$f":"COUNTA(Risk[Strategic/political risk])","v":2},{"$f":"COUNTA(Risk[Functionality risk])","v":1}]
["Result (%)",{"$f":"B5/B6","v":0},{"$f":"C5/C6","v":0},0,0]
["Total result (%)",{"$f":"AVERAGE(B7:E7)","v":0}]
[]
["Performance (alternative)"]
{"$rows_left_out":21}
{"sheet":"Survey Result","index":7,"n_rows":142,"n_cols":13,"rows_kept":142,"cut":false,"hidden":false,"merged":[[120,12,120,18],[123,12,123,18],[126,12,126,18],[129,12,129,18]]}
[]
[null,"Your results"]
[]
[]
[null,null,"Goals: what you can achieve"]
[]
[null,null,null,null,null,null,null,null,null,null,null,"Your goals"]
[]
[null,null,null,null,null,null,null,null,null,null,null,1,"Interoperability"]
[null,null,null,null,null,null,null,null,null,null,null,null,"Implementing common technical specifications that enable diverse organisations to exchange data and documents."]
{"$rows_left_out":133}
{"sheet":"eDelivery performance","index":8,"n_rows":84,"n_cols":9,"rows_kept":84,"cut":false,"hidden":true,"merged":[[69,8,69,11],[71,8,71,11],[73,4,73,11],[77,8,77,11],[79,8,79,11],[33,8,33,11],[3,4,3,11],[7,8,7,11],[9,8,9,11],[11,8,11,11],[15,8,15,11],[17,8,17,11],[19,8,19,11],[21,8,21,11],[25,8,25,11],[29,8,29,11],[31,8,31,11],[37,8,37,11],[39,8,39,11],[41,8,41,11],[43,8,43,11],[83,8,83,11],[59,4,59,11],[63,8,63,11],[65,8,65,11],[67,8,67,11],[81,8,81,11],[45,8,45,11],[47,8,47,11],[51,8,51,11],[53,8,53,11],[55,8,55,11],[57,8,57,11]]}
[]
[null,"eDelivery value scores on performance"]
[]
[null,"4.1",null,"Interoperability","Software"]
[]
[null,null,null,"Column3","Functionality",null,"Score performance (0-2)",null,"Comment"]
[]
[null,"SOFT.01",null,"Int.1","Exchange documents and/or data using a standardised messaging protocol which supports one-way push and/or two-way async message exchange patterns",null,2,null,"x"]
[]
[null,"SOFT.02",null,"Int.2","Exchange (multiple) attachments, e.g. PDF, in addition to messages ",null,2,null,"x"]
{"$rows_left_out":74}