{"text_format":"1","workbook":"xlsx","n_sheets":13,"sheets":["MAIN","OVERALL SUMMARY","TEMPLATE TABLES","REMARKS","TRANSPORT","OVERALL TARGET","HEAT PUMPS","STAT. TRANSFERS","COAL","OIL","GAS","ELE","REN"],"not_rendered":{"charts":0,"images":20,"macros":1,"external_links":2,"defined_names":36,"comments":0,"pivot_tables":0},"unopened":[],"bounds":{"document_bytes":16777216,"sheet_cells":100000,"rows_first":2000,"rows_last":500,"rows_between":2000,"halvings":0,"cell_chars":16384,"cell_head_chars":4096},"cells_cut":0,"cells_raw":0,"read":"whole","date_system":"1900"}

{"sheet":"MAIN","index":0,"n_rows":139,"n_cols":16,"rows_kept":139,"cut":false,"hidden":false,"merged":[[1,0,1,40],[2,0,2,40],[3,0,6,40],[44,0,44,40],[49,0,51,40],[40,0,41,40],[45,0,45,40],[11,0,11,40],[43,0,43,40],[47,0,47,40]]}
[]
["SHARES tool 2014"]
["SHort Assessment of Renewable Energy Sources"]
["v2014.51008"]
[]
[]
{"$rows_left_out":134}
{"sheet":"OVERALL SUMMARY","index":1,"n_rows":203,"n_cols":27,"rows_kept":203,"cut":false,"hidden":false,"merged":[[0,7,1,10],[66,9,66,10],[66,11,66,12],[66,13,66,14],[66,15,66,16],[65,9,65,10],[65,11,65,12],[65,13,65,14],[65,15,65,16],[64,9,64,16]]}
[null,null,null,null,null,null,null,{"$f":"MAIN!$D$9","v":""},null,null,null,null,null,null,null,null,null,null,null,null,null,null,null,null,null,null,1]
[]
[]
[]
[null,null,2004,2005,2006,2007,2008,2009,2010,2011,2012,2013,2014,2015,2016,2017,2018,2019,2020]
["Renewable electricity"]
{"$rows_left_out":198}
{"sheet":"TEMPLATE TABLES","index":2,"n_rows":104,"n_cols":19,"rows_kept":104,"cut":false,"hidden":false,"merged":[]}
[{"$f":"MAIN!$D$9","v":""},null,"Comparison with Progress Report tables 1, 1a, 1b and 1c",null,null,null,null,null,null,null,null,null,null,null,null,null,null,{"$f":"MAIN!A4","v":"v2014.51008"}]
[]
["This highlighting indicates information that is not available in the SHARES tool and most likely it is also not available in the annual energy questionnaires."]
[]
["Table 1"]
["The sectoral (electricity, heating and cooling, and transport) and overall shares of energy from renewable sources"]
{"$rows_left_out":99}
{"sheet":"REMARKS","index":3,"n_rows":2,"n_cols":1,"rows_kept":2,"cut":false,"hidden":false,"merged":[]}
["REMARKS"]
["Please include here important remarks."]

{"sheet":"TRANSPORT","index":4,"n_rows":98,"n_cols":38,"rows_kept":98,"cut":false,"hidden":false,"merged":[[62,0,62,6],[71,0,71,6]]}
[{"$f":"MAIN!$D$9","v":""},null,null,null,null,null,null,1990,1991,1992,1993,1994,1995,1996,1997,1998,1999,2000,2001,2002,2003,2004,2005,2006,2007,2008,2009,2010,2011,2012,2013,2014,2015,2016,2017,2018,2019,2020]
[]
["Transport sector: 10% target"]
["units: ktoe"]
[]
["Reported use of biofuels in transport (data from annual energy questionnaires) [ktoe]"]
{"$rows_left_out":93}
{"sheet":"OVERALL TARGET","index":5,"n_rows":59,"n_cols":38,"rows_kept":59,"cut":false,"hidden":false,"merged":[]}
[{"$f":"MAIN!$D$9","v":""},null,null,null,null,null,null,1990,1991,1992,1993,1994,1995,1996,1997,1998,1999,2000,2001,2002,2003,2004,2005,2006,2007,2008,2009,2010,2011,2012,2013,2014,2015,2016,2017,2018,2019,2020]
["Renewable Electricity Generation [GWh]",null,null,null,null,null,null,null,null,null,null,null,null,null,null,null,null,null,null,null,null,{"$f":"V3+V4+V5+V8+V9","v":0},0,0,0,0,0,0,{"$f":"AC3+AC4+AC6+AC7+AC8+AC9","v":0},{"$f":"AD3+AD4+AD6+AD7+AD8+AD9","v":0},0,0,0,0,0,0,0,0]
[null,"Normalised hydro generation",null,null,null,null,null,null,null,null,null,null,null,null,null,null,null,null,null,null,null,{"$f":"REN!V190+REN!V197","v":0},{"$f":"REN!W190+REN!W197","v":0},{"$f":"REN!X190+REN!X197","v":0},{"$f":"REN!Y190+REN!Y197","v":0},{"$f":"REN!Z190+REN!Z197","v":0},{"$f":"REN!AA190+REN!AA197","v":0},{"$f":"REN!AB190+REN!AB197","v":0},{"$f":"REN!AC190+REN!AC197","v":0},{"$f":"REN!AD190+REN!AD197","v":0},{"$f":"REN!AE190+REN!AE197","v":0},{"$f":"REN!AF190+REN!AF197","v":0},{"$f":"REN!AG190+REN!AG197","v":0},{"$f":"REN!AH190+REN!AH197","v":0},{"$f":"REN!AI190+REN!AI197","v":0},{"$f":"REN!AJ190+REN!AJ197","v":0},{"$f":"REN!AK190+REN!AK197","v":0},{"$f":"REN!AL190+REN!AL197","v":0}]
[null,"Normalised wind generation",null,null,null,null,null,null,null,null,null,null,null,null,null,null,null,null,null,null,null,{"$f":"IF(SUM(REN!V105)>0,((REN!V105+REN!U105)/2)*(SUM(ELE!R37:V37)/(REN!V105/2+REN!U105+REN!T105+REN!S105+REN!R105+REN!Q105/2)),0)","v":0},{"$f":"IF(SUM(REN!W105)>0,((REN!W105+REN!V105)/2)*(SUM(ELE!S37:W37)/(REN!W105/2+REN!V105+REN!U105+REN!T105+REN!S105+REN!R105/2)),0)","v":0},{"$f":"IF(SUM(REN!X105)>0,((REN!X105+REN!W105)/2)*(SUM(ELE!T37:X37)/(REN!X105/2+REN!W105+REN!V105+REN!U105+REN!T105+REN!S105/2)),0)","v":0},{"$f":"IF(SUM(REN!Y105)>0,((REN!Y105+REN!X105)/2)*(SUM(ELE!U37:Y37)/(REN!Y105/2+REN!X105+REN!W105+REN!V105+REN!U105+REN!T105/2)),0)","v":0},{"$f":"IF(SUM(REN!Z105)>0,((REN!Z105+REN!Y105)/2)*(SUM(ELE!V37:Z37)/(REN!Z105/2+REN!Y105+REN!X105+REN!W105+REN!V105+REN!U105/2)),0)","v":0},{"$f":"IF(SUM(REN!AA105)>0,((REN!AA105+REN!Z105)/2)*(SUM(ELE!W37:AA37)/(REN!AA105/2+REN!Z105+REN!Y105+REN!X105+REN!W105+REN!V105/2)),0)","v":0},{"$f":"IF(SUM(REN!AB105)>0,((REN!AB105+REN!AA105)/2)*(SUM(ELE!X37:AB37)/(REN!AB105/2+REN!AA105+REN!Z105+REN!Y105+REN!X105+REN!W105/2)),0)","v":0},{"$f":"IF(SUM(REN!AC105)>0,((REN!AC105+REN!AB105)/2)*(SUM(ELE!Y37:AC37)/(REN!AC105/2+REN!AB105+REN!AA105+REN!Z105+REN!Y105+REN!X105/2)),0)","v":0},{"$f":"IF(SUM(REN!AD105)>0,((REN!AD105+REN!AC105)/2)*(SUM(ELE!Z37:AD37)/(REN!AD105/2+REN!AC105+REN!AB105+REN!AA105+REN!Z105+REN!Y105/2)),0)","v":0},{"$f":"IF(SUM(REN!AE105)>0,((REN!AE105+REN!AD105)/2)*(SUM(ELE!AA37:AE37)/(REN!AE105/2+REN!AD105+REN!AC105+REN!AB105+REN!AA105+REN!Z105/2)),0)","v":0},{"$f":"IF(SUM(REN!AF105)>0,((REN!AF105+REN!AE105)/2)*(SUM(ELE!AB37:AF37)/(REN!AF105/2+REN!AE105+REN!AD105+REN!AC105+REN!AB105+REN!AA105/2)),0)","v":0},{"$f":"IF(SUM(REN!AG105)>0,((REN!AG105+REN!AF105)/2)*(SUM(ELE!AC37:AG37)/(REN!AG105/2+REN!AF105+REN!AE105+REN!AD105+REN!AC105+REN!AB105/2)),0)","v":0},{"$f":"IF(SUM(REN!AH105)>0,((REN!AH105+REN!AG105)/2)*(SUM(ELE!AD37:AH37)/(REN!AH105/2+REN!AG105+REN!AF105+REN!AE105+REN!AD105+REN!AC105/2)),0)","v":0},{"$f":"IF(SUM(REN!AI105)>0,((REN!AI105+REN!AH105)/2)*(SUM(ELE!AE37:AI37)/(REN!AI105/2+REN!AH105+REN!AG105+REN!AF105+REN!AE105+REN!AD105/2)),0)","v":0},{"$f":"IF(SUM(REN!AJ105)>0,((REN!AJ105+REN!AI105)/2)*(SUM(ELE!AF37:AJ37)/(REN!AJ105/2+REN!AI105+REN!AH105+REN!AG105+REN!AF105+REN!AE105/2)),0)","v":0},{"$f":"IF(SUM(REN!AK105)>0,((REN!AK105+REN!AJ105)/2)*(SUM(ELE!AG37:AK37)/(REN!AK105/2+REN!AJ105+REN!AI105+REN!AH105+REN!AG105+REN!AF105/2)),0)","v":0},{"$f":"IF(SUM(REN!AL105)>0,((REN!AL105+REN!AK105)/2)*(SUM(ELE!AH37:AL37)/(REN!AL105/2+REN!AK105+REN!AJ105+REN!AI105+REN!AH105+REN!AG105/2)),0)","v":0}]
[null,"From non-blended bioliquids, compliant + non-compliant",null,null,null,null,null,null,null,null,null,null,null,null,null,null,null,null,null,null,null,{"$f":"SUM(REN!V125:V128)/1000","v":0},{"$f":"SUM(REN!W125:W128)/1000","v":0},{"$f":"SUM(REN!X125:X128)/1000","v":0},{"$f":"SUM(REN!Y125:Y128)/1000","v":0},{"$f":"SUM(REN!Z125:Z128)/1000","v":0},{"$f":"SUM(REN!AA125:AA128)/1000","v":0},{"$f":"SUM(REN!AB125:AB128)/1000","v":0},{"$f":"SUM(REN!AC125:AC128)/1000","v":0},{"$f":"SUM(REN!AD125:AD128)/1000","v":0},{"$f":"SUM(REN!AE125:AE128)/1000","v":0},{"$f":"SUM(REN!AF125:AF128)/1000","v":0},{"$f":"SUM(REN!AG125:AG128)/1000","v":0},{"$f":"SUM(REN!AH125:AH128)/1000","v":0},{"$f":"SUM(REN!AI125:AI128)/1000","v":0},{"$f":"SUM(REN!AJ125:AJ128)/1000","v":0},{"$f":"SUM(REN!AK125:AK128)/1000","v":0},{"$f":"SUM(REN!AL125:AL128)/1000","v":0}]
[null,"- of which from compliant non-blended bioliquids",null,null,null,null,null,null,null,null,null,null,null,null,null,null,null,null,null,null,null,"û","û","û","û","û","û","û",0,0,0,0,0,0,0,0,0,0]
{"$rows_left_out":54}
{"sheet":"HEAT PUMPS","index":6,"n_rows":398,"n_cols":38,"rows_kept":398,"cut":false,"hidden":false,"merged":[]}
[{"$f":"MAIN!$D$9","v":""},null,null,null,null,null,null,1990,1991,1992,1993,1994,1995,1996,1997,1998,1999,2000,2001,2002,2003,2004,2005,2006,2007,2008,2009,2010,2011,2012,2013,2014,2015,2016,2017,2018,2019,2020]
[]
["Accounting of energy from heat pumps: ANNEX VII"]
["in effect of the Commission decision C(2013) 1082"]
["establishing the guidelines for Member States on calculating renewable energy from heat pumps from different heat pump technologies pursuant to Article 5 of Directive 2009/28/EC"]
[]
{"$rows_left_out":393}
{"sheet":"STAT. TRANSFERS","index":7,"n_rows":32,"n_cols":38,"rows_kept":32,"cut":false,"hidden":false,"merged":[]}
[{"$f":"MAIN!$D$9","v":""},null,null,null,null,null,null,1990,1991,1992,1993,1994,1995,1996,1997,1998,1999,2000,2001,2002,2003,2004,2005,2006,2007,2008,2009,2010,2011,2012,2013,2014,2015,2016,2017,2018,2019,2020]
["Cooperation Mechanizms - Statistical Transfers"]
["units: ktoe"]
[]
[]
["Article 6 : Statistical transfers between Member States"]
{"$rows_left_out":27}
{"sheet":"COAL","index":8,"n_rows":246,"n_cols":38,"rows_kept":246,"cut":false,"hidden":false,"merged":[]}
["IMPORT","QUEST","PRODUCT","DATATYPE","ITEM1","ITEM2"]
[]
["TIME",null,null,null,null,null,null,1990,1991,1992,1993,1994,1995,1996,1997,1998,1999,2000,2001,2002,2003,2004,2005,2006,2007,2008,2009,2010,2011,2012,2013,2014,2015,2016,2017,2018,2019,2020]
[null,null,null,null,null,null,"TOTAL GFCoE [ktoe]",{"$f":"(SUMPRODUCT(H112:H128,H169:H185)+SUMPRODUCT(H131:H147,H188:H204)+SUMPRODUCT(H150:H166,H207:H223)-(H226+H227)*1000+SUMPRODUCT(H150:H166,H230:H246))/41868","v":0},0,0,0,0,0,0,0,0,0,0,0,0,0,0,0,0,0,0,0,0,0,0,0,0,0,0,0,0,0,{"$f":"(SUMPRODUCT(AL112:AL128,AL169:AL185)+SUMPRODUCT(AL131:AL147,AL188:AL204)+SUMPRODUCT(AL150:AL166,AL207:AL223)-(AL226+AL227)*1000+SUMPRODUCT(AL150:AL166,AL230:AL246))/41868","v":0}]
[]
[null,null,null,null,null,null,"Net calorific values - Used in blast furnaces"]
{"$rows_left_out":241}
{"sheet":"OIL","index":9,"n_rows":223,"n_cols":38,"rows_kept":223,"cut":false,"hidden":false,"merged":[]}
["IMPORT","QUEST","PRODUCT","DATATYPE","ITEM1","ITEM2"]
[]
["TIME",null,null,null,null,null,null,1990,1991,1992,1993,1994,1995,1996,1997,1998,1999,2000,2001,2002,2003,2004,2005,2006,2007,2008,2009,2010,2011,2012,2013,2014,2015,2016,2017,2018,2019,2020]
[null,null,null,null,null,null,"TOTAL GFCoE [ktoe]",{"$f":"H5+H6","v":0},{"$f":"I5+I6","v":0},0,0,0,0,0,0,0,0,0,0,0,0,0,0,0,0,0,0,0,0,0,0,0,0,0,0,0,0,0]
[null,null,null,null,null,null,"- non-transport [ktoe]",{"$f":"(SUMPRODUCT(H58:H79,H82:H103)+SUMPRODUCT(H58:H79,H106:H127)+SUMPRODUCT(H58:H79,H130:H151))/41868","v":0},{"$f":"(SUMPRODUCT(I58:I79,I82:I103)+SUMPRODUCT(I58:I79,I106:I127)+SUMPRODUCT(I58:I79,I130:I151))/41868","v":0},0,0,0,0,0,0,0,0,0,0,0,0,0,0,0,0,0,0,0,0,0,0,0,0,0,0,0,0,0]
[null,null,null,null,null,null,"- transport [ktoe]",{"$f":"(H58*H154+H59*H155+H60*H156+H61*H157+H62*H158+H63*H159+H67*H163+H69*H165+H70*H166+H73*H169+H74*H170+H75*H171+H76*H172+H77*H173+H78*H174+H79*H175)/41868+SUM(TRANSPORT!H23:H24,TRANSPORT!H28:H30,TRANSPORT!H32:H34,TRANSPORT!H36,TRANSPORT!H38)","v":0},{"$f":"(I58*I154+I59*I155+I60*I156+I61*I157+I62*I158+I63*I159+I67*I163+I69*I165+I70*I166+I73*I169+I74*I170+I75*I171+I76*I172+I77*I173+I78*I174+I79*I175)/41868+SUM(TRANSPORT!I23:I24,TRANSPORT!I28:I30,TRANSPORT!I32:I34,TRANSPORT!I36,TRANSPORT!I38)","v":0},{"$f":"(J58*J154+J59*J155+J60*J156+J61*J157+J62*J158+J63*J159+J67*J163+J69*J165+J70*J166+J73*J169+J74*J170+J75*J171+J76*J172+J77*J173+J78*J174+J79*J175)/41868+SUM(TRANSPORT!J23:J24,TRANSPORT!J28:J30,TRANSPORT!J32:J34,TRANSPORT!J36,TRANSPORT!J38)","v":0},{"$f":"(K58*K154+K59*K155+K60*K156+K61*K157+K62*K158+K63*K159+K67*K163+K69*K165+K70*K166+K73*K169+K74*K170+K75*K171+K76*K172+K77*K173+K78*K174+K79*K175)/41868+SUM(TRANSPORT!K23:K24,TRANSPORT!K28:K30,TRANSPORT!K32:K34,TRANSPORT!K36,TRANSPORT!K38)","v":0},{"$f":"(L58*L154+L59*L155+L60*L156+L61*L157+L62*L158+L63*L159+L67*L163+L69*L165+L70*L166+L73*L169+L74*L170+L75*L171+L76*L172+L77*L173+L78*L174+L79*L175)/41868+SUM(TRANSPORT!L23:L24,TRANSPORT!L28:L30,TRANSPORT!L32:L34,TRANSPORT!L36,TRANSPORT!L38)","v":0},{"$f":"(M58*M154+M59*M155+M60*M156+M61*M157+M62*M158+M63*M159+M67*M163+M69*M165+M70*M166+M73*M169+M74*M170+M75*M171+M76*M172+M77*M173+M78*M174+M79*M175)/41868+SUM(TRANSPORT!M23:M24,TRANSPORT!M28:M30,TRANSPORT!M32:M34,TRANSPORT!M36,TRANSPORT!M38)","v":0},{"$f":"(N58*N154+N59*N155+N60*N156+N61*N157+N62*N158+N63*N159+N67*N163+N69*N165+N70*N166+N73*N169+N74*N170+N75*N171+N76*N172+N77*N173+N78*N174+N79*N175)/41868+SUM(TRANSPORT!N23:N24,TRANSPORT!N28:N30,TRANSPORT!N32:N34,TRANSPORT!N36,TRANSPORT!N38)","v":0},{"$f":"(O58*O154+O59*O155+O60*O156+O61*O157+O62*O158+O63*O159+O67*O163+O69*O165+O70*O166+O73*O169+O74*O170+O75*O171+O76*O172+O77*O173+O78*O174+O79*O175)/41868+SUM(TRANSPORT!O23:O24,TRANSPORT!O28:O30,TRANSPORT!O32:O34,TRANSPORT!O36,TRANSPORT!O38)","v":0},{"$f":"(P58*P154+P59*P155+P60*P156+P61*P157+P62*P158+P63*P159+P67*P163+P69*P165+P70*P166+P73*P169+P74*P170+P75*P171+P76*P172+P77*P173+P78*P174+P79*P175)/41868+SUM(TRANSPORT!P23:P24,TRANSPORT!P28:P30,TRANSPORT!P32:P34,TRANSPORT!P36,TRANSPORT!P38)","v":0},{"$f":"(Q58*Q154+Q59*Q155+Q60*Q156+Q61*Q157+Q62*Q158+Q63*Q159+Q67*Q163+Q69*Q165+Q70*Q166+Q73*Q169+Q74*Q170+Q75*Q171+Q76*Q172+Q77*Q173+Q78*Q174+Q79*Q175)/41868+SUM(TRANSPORT!Q23:Q24,TRANSPORT!Q28:Q30,TRANSPORT!Q32:Q34,TRANSPORT!Q36,TRANSPORT!Q38)","v":0},{"$f":"(R58*R154+R59*R155+R60*R156+R61*R157+R62*R158+R63*R159+R67*R163+R69*R165+R70*R166+R73*R169+R74*R170+R75*R171+R76*R172+R77*R173+R78*R174+R79*R175)/41868+SUM(TRANSPORT!R23:R24,TRANSPORT!R28:R30,TRANSPORT!R32:R34,TRANSPORT!R36,TRANSPORT!R38)","v":0},{"$f":"(S58*S154+S59*S155+S60*S156+S61*S157+S62*S158+S63*S159+S67*S163+S69*S165+S70*S166+S73*S169+S74*S170+S75*S171+S76*S172+S77*S173+S78*S174+S79*S175)/41868+SUM(TRANSPORT!S23:S24,TRANSPORT!S28:S30,TRANSPORT!S32:S34,TRANSPORT!S36,TRANSPORT!S38)","v":0},{"$f":"(T58*T154+T59*T155+T60*T156+T61*T157+T62*T158+T63*T159+T67*T163+T69*T165+T70*T166+T73*T169+T74*T170+T75*T171+T76*T172+T77*T173+T78*T174+T79*T175)/41868+SUM(TRANSPORT!T23:T24,TRANSPORT!T28:T30,TRANSPORT!T32:T34,TRANSPORT!T36,TRANSPORT!T38)","v":0},{"$f":"(U58*U154+U59*U155+U60*U156+U61*U157+U62*U158+U63*U159+U67*U163+U69*U165+U70*U166+U73*U169+U74*U170+U75*U171+U76*U172+U77*U173+U78*U174+U79*U175)/41868+SUM(TRANSPORT!U23:U24,TRANSPORT!U28:U30,TRANSPORT!U32:U34,TRANSPORT!U36,TRANSPORT!U38)","v":0},{"$f":"(V58*V154+V59*V155+V60*V156+V61*V157+V62*V158+V63*V159+V67*V163+V69*V165+V70*V166+V73*V169+V74*V170+V75*V171+V76*V172+V77*V173+V78*V174+V79*V175)/41868+SUM(TRANSPORT!V23:V24,TRANSPORT!V28:V30,TRANSPORT!V32:V34,TRANSPORT!V36,TRANSPORT!V38)","v":0},{"$f":"(W58*W154+W59*W155+W60*W156+W61*W157+W62*W158+W63*W159+W67*W163+W69*W165+W70*W166+W73*W169+W74*W170+W75*W171+W76*W172+W77*W173+W78*W174+W79*W175)/41868+SUM(TRANSPORT!W23:W24,TRANSPORT!W28:W30,TRANSPORT!W32:W34,TRANSPORT!W36,TRANSPORT!W38)","v":0},{"$f":"(X58*X154+X59*X155+X60*X156+X61*X157+X62*X158+X63*X159+X67*X163+X69*X165+X70*X166+X73*X169+X74*X170+X75*X171+X76*X172+X77*X173+X78*X174+X79*X175)/41868+SUM(TRANSPORT!X23:X24,TRANSPORT!X28:X30,TRANSPORT!X32:X34,TRANSPORT!X36,TRANSPORT!X38)","v":0},{"$f":"(Y58*Y154+Y59*Y155+Y60*Y156+Y61*Y157+Y62*Y158+Y63*Y159+Y67*Y163+Y69*Y165+Y70*Y166+Y73*Y169+Y74*Y170+Y75*Y171+Y76*Y172+Y77*Y173+Y78*Y174+Y79*Y175)/41868+SUM(TRANSPORT!Y23:Y24,TRANSPORT!Y28:Y30,TRANSPORT!Y32:Y34,TRANSPORT!Y36,TRANSPORT!Y38)","v":0},{"$f":"(Z58*Z154+Z59*Z155+Z60*Z156+Z61*Z157+Z62*Z158+Z63*Z159+Z67*Z163+Z69*Z165+Z70*Z166+Z73*Z169+Z74*Z170+Z75*Z171+Z76*Z172+Z77*Z173+Z78*Z174+Z79*Z175)/41868+SUM(TRANSPORT!Z23:Z24,TRANSPORT!Z28:Z30,TRANSPORT!Z32:Z34,TRANSPORT!Z36,TRANSPORT!Z38)","v":0},{"$f":"(AA58*AA154+AA59*AA155+AA60*AA156+AA61*AA157+AA62*AA158+AA63*AA159+AA67*AA163+AA69*AA165+AA70*AA166+AA73*AA169+AA74*AA170+AA75*AA171+AA76*AA172+AA77*AA173+AA78*AA174+AA79*AA175)/41868+SUM(TRANSPORT!AA23:AA24,TRANSPORT!AA28:AA30,TRANSPORT!AA32:AA34,TRANSPORT!AA36,TRANSPORT!AA38)","v":0},{"$f":"(AB58*AB154+AB59*AB155+AB60*AB156+AB61*AB157+AB62*AB158+AB63*AB159+AB67*AB163+AB69*AB165+AB70*AB166+AB73*AB169+AB74*AB170+AB75*AB171+AB76*AB172+AB77*AB173+AB78*AB174+AB79*AB175)/41868+SUM(TRANSPORT!AB23:AB24,TRANSPORT!AB28:AB30,TRANSPORT!AB32:AB34,TRANSPORT!AB36,TRANSPORT!AB38)","v":0},{"$f":"(AC58*AC154+AC59*AC155+AC60*AC156+AC61*AC157+AC62*AC158+AC63*AC159+AC67*AC163+AC69*AC165+AC70*AC166+AC73*AC169+AC74*AC170+AC75*AC171+AC76*AC172+AC77*AC173+AC78*AC174+AC79*AC175)/41868+SUM(TRANSPORT!AC23:AC24,TRANSPORT!AC28:AC30,TRANSPORT!AC32:AC34,TRANSPORT!AC36,TRANSPORT!AC38)","v":0},{"$f":"(AD58*AD154+AD59*AD155+AD60*AD156+AD61*AD157+AD62*AD158+AD63*AD159+AD67*AD163+AD69*AD165+AD70*AD166+AD73*AD169+AD74*AD170+AD75*AD171+AD76*AD172+AD77*AD173+AD78*AD174+AD79*AD175)/41868+SUM(TRANSPORT!AD23:AD24,TRANSPORT!AD28:AD30,TRANSPORT!AD32:AD34,TRANSPORT!AD36,TRANSPORT!AD38)","v":0},{"$f":"(AE58*AE154+AE59*AE155+AE60*AE156+AE61*AE157+AE62*AE158+AE63*AE159+AE67*AE163+AE69*AE165+AE70*AE166+AE73*AE169+AE74*AE170+AE75*AE171+AE76*AE172+AE77*AE173+AE78*AE174+AE79*AE175)/41868+SUM(TRANSPORT!AE23:AE24,TRANSPORT!AE28:AE30,TRANSPORT!AE32:AE34,TRANSPORT!AE36,TRANSPORT!AE38)","v":0},{"$f":"(AF58*AF154+AF59*AF155+AF60*AF156+AF61*AF157+AF62*AF158+AF63*AF159+AF67*AF163+AF69*AF165+AF70*AF166+AF73*AF169+AF74*AF170+AF75*AF171+AF76*AF172+AF77*AF173+AF78*AF174+AF79*AF175)/41868+SUM(TRANSPORT!AF23:AF24,TRANSPORT!AF28:AF30,TRANSPORT!AF32:AF34,TRANSPORT!AF36,TRANSPORT!AF38)","v":0},{"$f":"(AG58*AG154+AG59*AG155+AG60*AG156+AG61*AG157+AG62*AG158+AG63*AG159+AG67*AG163+AG69*AG165+AG70*AG166+AG73*AG169+AG74*AG170+AG75*AG171+AG76*AG172+AG77*AG173+AG78*AG174+AG79*AG175)/41868+SUM(TRANSPORT!AG23:AG24,TRANSPORT!AG28:AG30,TRANSPORT!AG32:AG34,TRANSPORT!AG36,TRANSPORT!AG38)","v":0},{"$f":"(AH58*AH154+AH59*AH155+AH60*AH156+AH61*AH157+AH62*AH158+AH63*AH159+AH67*AH163+AH69*AH165+AH70*AH166+AH73*AH169+AH74*AH170+AH75*AH171+AH76*AH172+AH77*AH173+AH78*AH174+AH79*AH175)/41868+SUM(TRANSPORT!AH23:AH24,TRANSPORT!AH28:AH30,TRANSPORT!AH32:AH34,TRANSPORT!AH36,TRANSPORT!AH38)","v":0},{"$f":"(AI58*AI154+AI59*AI155+AI60*AI156+AI61*AI157+AI62*AI158+AI63*AI159+AI67*AI163+AI69*AI165+AI70*AI166+AI73*AI169+AI74*AI170+AI75*AI171+AI76*AI172+AI77*AI173+AI78*AI174+AI79*AI175)/41868+SUM(TRANSPORT!AI23:AI24,TRANSPORT!AI28:AI30,TRANSPORT!AI32:AI34,TRANSPORT!AI36,TRANSPORT!AI38)","v":0},{"$f":"(AJ58*AJ154+AJ59*AJ155+AJ60*AJ156+AJ61*AJ157+AJ62*AJ158+AJ63*AJ159+AJ67*AJ163+AJ69*AJ165+AJ70*AJ166+AJ73*AJ169+AJ74*AJ170+AJ75*AJ171+AJ76*AJ172+AJ77*AJ173+AJ78*AJ174+AJ79*AJ175)/41868+SUM(TRANSPORT!AJ23:AJ24,TRANSPORT!AJ28:AJ30,TRANSPORT!AJ32:AJ34,TRANSPORT!AJ36,TRANSPORT!AJ38)","v":0},{"$f":"(AK58*AK154+AK59*AK155+AK60*AK156+AK61*AK157+AK62*AK158+AK63*AK159+AK67*AK163+AK69*AK165+AK70*AK166+AK73*AK169+AK74*AK170+AK75*AK171+AK76*AK172+AK77*AK173+AK78*AK174+AK79*AK175)/41868+SUM(TRANSPORT!AK23:AK24,TRANSPORT!AK28:AK30,TRANSPORT!AK32:AK34,TRANSPORT!AK36,TRANSPORT!AK38)","v":0},{"$f":"(AL58*AL154+AL59*AL155+AL60*AL156+AL61*AL157+AL62*AL158+AL63*AL159+AL67*AL163+AL69*AL165+AL70*AL166+AL73*AL169+AL74*AL170+AL75*AL171+AL76*AL172+AL77*AL173+AL78*AL174+AL79*AL175)/41868+SUM(TRANSPORT!AL23:AL24,TRANSPORT!AL28:AL30,TRANSPORT!AL32:AL34,TRANSPORT!AL36,TRANSPORT!AL38)","v":0}]
{"$rows_left_out":218}
{"sheet":"GAS","index":10,"n_rows":20,"n_cols":38,"rows_kept":20,"cut":false,"hidden":false,"merged":[]}
["IMPORT","QUEST","PRODUCT","DATATYPE","ITEM1","ITEM2"]
[]
["TIME",null,null,null,null,null,null,1990,1991,1992,1993,1994,1995,1996,1997,1998,1999,2000,2001,2002,2003,2004,2005,2006,2007,2008,2009,2010,2011,2012,2013,2014,2015,2016,2017,2018,2019,2020]
[null,null,null,null,null,null,"TOTAL GFCoE [ktoe]",{"$f":"H5+H6","v":0},{"$f":"I5+I6","v":0},0,0,0,0,0,0,0,0,0,0,0,0,0,0,0,0,0,0,0,0,0,0,0,0,0,0,0,0,0]
[null,null,null,null,null,null,"- non-transport [ktoe]",{"$f":"SUM(H9:H11)*900/41868","v":0},{"$f":"SUM(I9:I11)*900/41868","v":0},0,0,0,0,0,0,0,0,0,0,0,0,0,0,0,0,0,0,0,0,0,0,0,0,0,0,0,0,0]
[null,null,null,null,null,null,"- transport [ktoe]",{"$f":"H13*900/41868","v":0},{"$f":"I13*900/41868","v":0},0,0,0,0,0,0,0,0,0,0,0,0,0,0,0,0,0,0,0,0,0,0,0,0,0,0,0,0,0]
{"$rows_left_out":15}
{"sheet":"ELE","index":11,"n_rows":47,"n_cols":38,"rows_kept":47,"cut":false,"hidden":false,"merged":[]}
["IMPORT","QUEST","PRODUCT","DATATYPE","ITEM1","ITEM2"]
[]
["TIME",null,null,null,null,null,null,1990,1991,1992,1993,1994,1995,1996,1997,1998,1999,2000,2001,2002,2003,2004,2005,2006,2007,2008,2009,2010,2011,2012,2013,2014,2015,2016,2017,2018,2019,2020]
[null,null,null,null,null,null,"TOTAL GFCoE [ktoe]",{"$f":"H5+H6","v":0},{"$f":"I5+I6","v":0},0,0,0,0,0,0,0,0,0,0,0,0,0,0,{"$f":"X5+X6","v":0},{"$f":"Y5+Y6","v":0},{"$f":"Z5+Z6","v":0},{"$f":"AA5+AA6","v":0},{"$f":"AB5+AB6","v":0},{"$f":"AC5+AC6","v":0},{"$f":"AD5+AD6","v":0},0,0,0,0,0,0,0,0]
[null,null,null,null,null,null,"Electricity [ktoe]",{"$f":"SUM(H9:H17)*3.6/41.868","v":0},{"$f":"SUM(I9:I17)*3.6/41.868","v":0},0,0,0,0,0,0,0,0,0,0,0,0,0,0,0,0,0,0,0,0,0,0,0,0,0,0,0,0,0]
[null,null,null,null,null,null,"Heat [ktoe]",{"$f":"SUM(H23:H31)/41.868","v":0},{"$f":"SUM(I23:I31)/41.868","v":0},0,0,0,0,0,0,0,0,0,0,0,0,0,0,{"$f":"SUM(X23:X31)/41.868","v":0},{"$f":"SUM(Y23:Y31)/41.868","v":0},0,0,0,0,0,{"$f":"SUM(AE23:AE31)/41.868","v":0},0,0,0,0,0,0,0]
{"$rows_left_out":42}
{"sheet":"REN","index":12,"n_rows":218,"n_cols":38,"rows_kept":218,"cut":false,"hidden":false,"merged":[]}
["IMPORT","QUEST","PRODUCT","DATATYPE","ITEM1","ITEM2"]
[]
["TIME",null,null,null,null,null,null,1990,1991,1992,1993,1994,1995,1996,1997,1998,1999,2000,2001,2002,2003,2004,2005,2006,2007,2008,2009,2010,2011,2012,2013,2014,2015,2016,2017,2018,2019,2020]
[null,null,null,null,null,null,"TOTAL GFCoE [ktoe]",{"$f":"(SUMPRODUCT(H32:H37,H40:H45)+SUMPRODUCT(H26:H37,H48:H59)+SUMPRODUCT(H26:H37,H62:H73))/41868","v":0},{"$f":"(SUMPRODUCT(I32:I37,I40:I45)+SUMPRODUCT(I26:I37,I48:I59)+SUMPRODUCT(I26:I37,I62:I73))/41868","v":0},0,0,0,0,0,0,0,0,0,0,0,0,0,0,0,0,0,0,0,0,0,0,0,{"$f":"(SUMPRODUCT(AG32:AG37,AG40:AG45)+SUMPRODUCT(AG26:AG37,AG48:AG59)+SUMPRODUCT(AG26:AG37,AG62:AG73))/41868","v":0},0,0,0,0,0]
[null,null,null,null,null,null,"value above excludes transport fuels - for GFCoE those are included in the sheet OIL, for RES-T indicators those are on sheet TRANSPORT"]
[]
{"$rows_left_out":212}